<?xml version="1.0" encoding="utf-8"?>
<!-- Generator: Adobe Illustrator 21.0.0, SVG Export Plug-In . SVG Version: 6.00 Build 0)  -->
<svg version="1.1" id="Capa_1" xmlns="http://www.w3.org/2000/svg" xmlns:xlink="http://www.w3.org/1999/xlink" x="0px" y="0px"
	 viewBox="0 0 297 297" style="enable-background:new 0 0 297 297;" xml:space="preserve">
<style type="text/css">
	.st0{fill:#2D2D2D;}
</style>
<g>
	<path class="st0" d="M95.7,191.8H65.4c-15.5,0-28.5-13.1-28.5-28.5v-44.1H13c-4.3,0-8.4,2.2-10.8,5.8c-2.4,3.6-2.9,8.2-1.2,12.2
		l14.4,35.2L1,207.5c-1.6,4-1.2,8.6,1.2,12.2c2.4,3.6,6.5,5.8,10.8,5.8h79.3c4.6,0,8.9-2.5,11.3-6.5c2.3-4,2.4-8.9,0.1-13
		L95.7,191.8z"/>
	<path class="st0" d="M65.4,176.8h182.4c3.7,0,7.2-1.8,9.6-4.5l36.1-39.7c4.5-5,4.5-12.7,0-17.7l-36.1-39.4c-2.5-2.7-6-4-9.6-4H65.4
		c-7.2,0-13.5,5.3-13.5,12.5v79.2C51.9,170.5,58.2,176.8,65.4,176.8z"/>
</g>
</svg>
