<?xml version="1.0" encoding="iso-8859-1"?>
<!-- Generator: Adobe Illustrator 19.0.0, SVG Export Plug-In . SVG Version: 6.00 Build 0)  -->
<svg version="1.1" id="Capa_1" xmlns="http://www.w3.org/2000/svg" xmlns:xlink="http://www.w3.org/1999/xlink" x="0px" y="0px"
	 viewBox="0 0 512 512" style="enable-background:new 0 0 512 512;" xml:space="preserve">
<g>
	<g>
		<path d="M384.49,339.185L329,333.019v-29.6c21.839-15.56,36.839-40.119,39.553-68.216l27.098-40.671v-74.54l-0.002-0.262
			C394.496,53.71,339.847,0,273.826,0c-32.095,0-62.071,12.514-84.396,35.232c-22.299,22.692-34.287,52.832-33.762,84.885v73.93
			l23.739,40.696C182,263.032,197.043,287.774,219,303.419v29.6l-55.491,6.166C115.331,344.538,79,385.129,79,433.604V512h30
			v-78.396c0-33.167,24.858-60.94,57.822-64.603l54.703-6.078c7.019,22.301,27.887,38.521,52.475,38.521s45.457-16.22,52.475-38.521
			l54.703,6.078C414.142,372.664,439,400.437,439,433.604V512h30v-78.396C469,385.129,432.669,344.537,384.49,339.185z M194,151
			h-8.333v-31.008l-0.002-0.262c-0.419-23.992,8.517-46.533,25.162-63.471C227.467,39.326,249.841,30,273.826,30
			c49.723,0,90.888,40.422,91.824,90.129V151H314c-24.813,0-45-20.187-45-45h-30C239,130.813,218.813,151,194,151z M299,346.444
			c0,13.785-11.215,25-25,25c-13.785,0-25-11.215-25-25v-28.789c7.969,2.176,16.35,3.345,25,3.345c8.65,0,17.031-1.169,25-3.345
			V346.444z M274,291c-35.841,0-65-29.159-65-65v-46.507c18.286-3.727,34.176-14.129,45-28.541C267.695,169.186,289.493,181,314,181
			h25v45C339,261.841,309.841,291,274,291z"/>
	</g>
</g>
<g>
	<g>
		<rect x="159" y="462" width="30" height="50"/>
	</g>
</g>
<g>
	<g>
		<rect x="359" y="462" width="30" height="50"/>
	</g>
</g>
<g>
	<g>
		<polygon points="143,46.327 108.451,41.307 93,10 77.549,41.307 43,46.327 68,70.696 62.098,105.105 93,88.86 123.902,105.105 
			118,70.696 		"/>
	</g>
</g>
<g>
</g>
<g>
</g>
<g>
</g>
<g>
</g>
<g>
</g>
<g>
</g>
<g>
</g>
<g>
</g>
<g>
</g>
<g>
</g>
<g>
</g>
<g>
</g>
<g>
</g>
<g>
</g>
<g>
</g>
</svg>
