7357 4762 262
1753 2101 175
8190 6666 257
7722 1417 262
3264 1201 217
6273 2357 262
6920 735 262
9815 9384 198
9637 2655 262
9952 3747 262
5829 7021 262
4558 5488 210
8747 4698 262
3366 4812 238
8403 3722 262
1207 7517 262
5826 3118 238
1884 9301 262
7884 8501 252
8352 6260 257
4292 651 238
8620 9254 247
3885 9450 262
732 373 171
7194 3578 262
3012 3604 199
7455 7742 208
9690 3206 262
478 9815 262
5873 1251 238
7915 3491 262
902 4022 238
9944 6969 260
5090 3000 238
7670 35 262
5575 5537 236
2270 837 183
6725 7134 257
4427 7929 262
5190 1461 238
1886 1156 182
9048 3958 262
8638 2848 262
7531 5277 262
6967 5078 262
6974 3467 262
5468 769 238
6031 1448 238
4176 5498 215
7344 4630 262
7713 4150 262
945 7599 262
5494 9624 262
114 37 119
4125 5272 215
2295 2574 209
3982 5871 236
6920 2610 262
2296 8008 262
7485 6217 257
316 6297 262
6189 2210 262
2924 4003 238
8206 1534 262
4819 9517 262
8483 1042 262
4909 5274 210
4368 7692 262
2295 9836 262
9001 1502 262
6332 7431 257
1191 9538 262
9890 1125 262
7005 4796 262
1093 5727 238
3707 9704 262
3435 8974 262
1698 4316 238
5981 4158 236
2328 5641 238
7324 2371 262
3741 8192 262
6368 7060 257
8100 6113 262
7922 726 262
9636 6545 260
1345 4624 238
1471 8548 262
234 966 179
4988 3314 238
4798 3858 215
5848 1799 238
2617 1448 209
7423 9374 260
7359 8160 252
9304 5336 262
7147 8677 252
9388 8122 260
6027 4602 236
1624 4826 238
9362 7234 260
9834 4948 262
2614 3612 217
3748 5010 215
8430 4747 262
887 4378 238
1222 1344 177
4520 5293 210
6810 5962 262
3367 4119 238
5547 4659 210
6776 4329 262
8891 7130 252
7044 9989 260
614 5167 238
2384 857 183
5536 3963 215
9469 1901 262
4481 4601 184
689 9593 262
4290 276 238
7178 1341 262
1288 6121 238
5042 7045 262
8220 1273 262
6786 4662 262
451 8292 262
78 9191 262
1933 9923 262
8930 242 262
4600 4946 210
6 5755 238
5480 3834 215
7981 3192 262
6513 6871 244
601 6989 262
42 1783 182
734 9510 262
4631 4075 215
76 4604 238
8894 2899 262
500 3547 217
7753 2436 262
7123 4467 262
8722 2872 262
7524 3167 262
8755 41 262
6704 5397 262
9791 494 262
7624 8338 252
3820 9218 262
4165 7974 262
5060 5768 236
8838 3509 262
7840 704 262
2084 5831 238
8784 3098 262
5710 9922 262
988 127 179
9804 7514 260
6937 8089 257
2486 201 209
3332 5685 238
1982 5607 238
7112 261 262
6517 8637 257
5166 1398 238
6089 880 238
7275 1696 262
1019 4970 238
9300 5091 262
4993 8940 262
7037 637 262
3243 9704 262
7256 4442 262
6066 4939 236
7672 5852 262
7829 9140 252
2076 7256 262
9875 1633 262
7358 9007 252
8621 5977 262
680 3985 238
74 6705 262
5568 883 238
1824 7130 262
7473 6568 257
3643 1813 217
7599 1299 262
8316 8561 234
1492 7426 262
1941 4457 238
7028 4871 262
7599 1043 262
6631 7770 257
8225 6907 257
4289 8780 262
8584 5784 262
6833 1278 262
4926 4273 215
6922 9828 260
4899 6845 262
4551 5946 236
5755 3558 238
237 878 179
7238 3961 262
4781 2077 238
8310 9674 260
729 9697 262
1664 6800 262
2146 8892 262
2026 4389 238
5976 4228 236
7832 161 262
9794 3332 262
6648 8767 257
3691 4621 238
7580 1993 262
7325 1903 262
1936 6474 262
8947 969 262
2299 646 183
2056 8449 262
467 2730 209
847 7786 262
6662 7393 257
1388 9621 262
5104 1553 238
2677 2392 209
382 6910 262
3333 3102 199
6240 2810 262
1072 4555 238
5938 4089 236
556 8214 262
4300 5860 236
8297 5645 262
4511 4223 215
7388 2295 262
2013 416 182
8925 8577 216
7943 8601 252
3525 4529 238
3773 3339 238
9686 848 262
7216 2714 262
2721 2359 209
685 7017 262
5354 358 238
1587 700 182
4107 5811 236
2279 5623 238
4795 3629 238
9188 3269 262
6416 1038 262
7977 6857 257
1542 1718 180
7858 1239 262
6449 458 262
7006 3586 262
8420 7792 252
4817 5325 210
1074 2893 209
4166 7995 262
5599 5983 218
9455 686 262
8061 339 262
5498 7340 262
7962 1763 262
736 3986 238
5919 8841 262
4069 6171 262
3075 7151 262
4275 3625 238
1053 9243 262
3144 9787 262
1721 8124 262
4634 9442 262
8623 9210 247
3085 9078 262
358 7170 262
6361 1738 262
5564 4551 210
315 1080 179
7645 8694 252
5824 8453 262
8691 9980 260
3955 1029 238
7957 4479 262
8554 4704 262
7820 3291 262
9733 4137 262
587 4295 238
5395 5998 236
2440 6323 262
5900 5722 218
5106 8203 262
7969 5699 262
2460 2574 209
4012 2802 238
