{
  "TCPServerAddress" : "127.0.0.1:8081",
  "HTTPServerAddress" : ":8080",
  "TCPPoolInitCapacity"   : 1000,
  "HTMLFilePath"          : "/Users/zhiyuan.ning/go/src/entry_task_ning/static/html/*",
  "DatabaseDriverName"    : "mysql",
  "DataSourceName"        : "root:@/entry_task",
  "DatabaseMaxOpenConns"     : 20,
  "DatabaseMaxIdleConns"     : 20
}

