%YAML 1.1
%TAG !u! tag:unity3d.com,2011:
--- !u!114 &11400000
MonoBehaviour:
  m_ObjectHideFlags: 0
  m_CorrespondingSourceObject: {fileID: 0}
  m_PrefabInstance: {fileID: 0}
  m_PrefabAsset: {fileID: 0}
  m_GameObject: {fileID: 0}
  m_Enabled: 1
  m_EditorHideFlags: 0
  m_Script: {fileID: 11500000, guid: e7abd919dd0863c4ab103248455015a1, type: 3}
  m_Name: Plant0
  m_EditorClassIdentifier: 
  textures:
  - {fileID: 21300000, guid: 2dff51a27542fae47a05c9ad173ad3f1, type: 3}
  - {fileID: 21300000, guid: af173410b457ccb45b6176237fd2967e, type: 3}
  fruit: {fileID: 21300000, guid: 855b81c08e90e59438dcbea875b452a8, type: 3}
