%YAML 1.1
%TAG !u! tag:unity3d.com,2011:
--- !u!114 &11400000
MonoBehaviour:
  m_ObjectHideFlags: 0
  m_CorrespondingSourceObject: {fileID: 0}
  m_PrefabInstance: {fileID: 0}
  m_PrefabAsset: {fileID: 0}
  m_GameObject: {fileID: 0}
  m_Enabled: 1
  m_EditorHideFlags: 0
  m_Script: {fileID: 11500000, guid: e7abd919dd0863c4ab103248455015a1, type: 3}
  m_Name: Sprout
  m_EditorClassIdentifier: 
  textures:
  - {fileID: 21300000, guid: 0e48b8a731089fa40aeeed9b8236b9d0, type: 3}
  - {fileID: 21300000, guid: 745d9181580cfa64a8512a7c51fca2f3, type: 3}
  fruit: {fileID: 0}
