%YAML 1.1
%TAG !u! tag:unity3d.com,2011:
--- !u!114 &11400000
MonoBehaviour:
  m_ObjectHideFlags: 0
  m_CorrespondingSourceObject: {fileID: 0}
  m_PrefabInstance: {fileID: 0}
  m_PrefabAsset: {fileID: 0}
  m_GameObject: {fileID: 0}
  m_Enabled: 1
  m_EditorHideFlags: 0
  m_Script: {fileID: 11500000, guid: e7abd919dd0863c4ab103248455015a1, type: 3}
  m_Name: Plant2
  m_EditorClassIdentifier: Assembly-CSharp::PlantSprite
  textures:
  - {fileID: 21300000, guid: 8556465e222ee2446a36f1d9ddffba7d, type: 3}
  - {fileID: 21300000, guid: 3bfec507084b9694d8806c02122a1a70, type: 3}
  fruit: {fileID: 21300000, guid: ebffabc81b6fdb341a95a67aa3ca9108, type: 3}
