\relax 
\@writefile{toc}{\contentsline {section}{\numberline {I}INTRODUCTION}{1}}
\@writefile{toc}{\contentsline {section}{\numberline {II}PROCEDURE FOR PAPER SUBMISSION}{1}}
\@writefile{toc}{\contentsline {subsection}{\numberline {II-A}Selecting a Template (Heading 2)}{1}}
\@writefile{toc}{\contentsline {subsection}{\numberline {II-B}Maintaining the Integrity of the Specifications}{1}}
\@writefile{toc}{\contentsline {section}{\numberline {III}PILCO}{1}}
\@writefile{toc}{\contentsline {subsection}{\numberline {III-A}PILCO algorithm}{1}}
\@writefile{toc}{\contentsline {subsection}{\numberline {III-B}Results}{1}}
\@writefile{lof}{\contentsline {figure}{\numberline {1}{\ignorespaces Result of PILCO Used on Mass-Spring-Damper Model}}{1}}
\newlabel{figurelabel}{{1}{1}}
\@writefile{lof}{\contentsline {figure}{\numberline {2}{\ignorespaces Result of PILCO Used on Pendulum Model}}{1}}
\newlabel{figurelabel}{{2}{1}}
\@writefile{lof}{\contentsline {figure}{\numberline {3}{\ignorespaces Result of PILCO Used on Cart-Pole Model (Initial Angle=$10^{\circ }$).}}{2}}
\newlabel{figurelabel}{{3}{2}}
\@writefile{lof}{\contentsline {figure}{\numberline {4}{\ignorespaces Result of PILCO Used on Cart-Pole Model (Initial Angle=$90^{\circ }$).}}{2}}
\newlabel{figurelabel}{{4}{2}}
\@writefile{toc}{\contentsline {section}{\numberline {IV}Model Free}{2}}
\@writefile{toc}{\contentsline {subsection}{\numberline {IV-A}Q-Learning Algorithm}{2}}
\@writefile{lof}{\contentsline {figure}{\numberline {5}{\ignorespaces Result of PILCO Used on Cart-Pole Model (Initial Angle=$180^{\circ }$).}}{2}}
\newlabel{figurelabel}{{5}{2}}
\@writefile{toc}{\contentsline {subsection}{\numberline {IV-B}Results}{2}}
\@writefile{lof}{\contentsline {figure}{\numberline {6}{\ignorespaces Result of Q-Learning Used on Spring-Mass-Damper Model}}{2}}
\newlabel{figurelabel}{{6}{2}}
\@writefile{toc}{\contentsline {subsubsection}{\numberline {IV-B.1}Mass-Spring-Damper}{2}}
\@writefile{lof}{\contentsline {figure}{\numberline {7}{\ignorespaces Result of Q-learning Used on Inverted Pendulum Model}}{3}}
\newlabel{figurelabel}{{7}{3}}
\@writefile{toc}{\contentsline {subsubsection}{\numberline {IV-B.2}Inverted Pendulum}{3}}
\@writefile{lof}{\contentsline {figure}{\numberline {8}{\ignorespaces Result of Q-Learning Used on Cart-Pole Model}}{3}}
\newlabel{figurelabel}{{8}{3}}
\@writefile{lof}{\contentsline {figure}{\numberline {9}{\ignorespaces Result of Q-Learning Used on Cart-Pole Model}}{3}}
\newlabel{figurelabel}{{9}{3}}
\@writefile{toc}{\contentsline {subsubsection}{\numberline {IV-B.3}Cart Pole}{3}}
\@writefile{toc}{\contentsline {section}{\numberline {V}Optimal Control}{3}}
\@writefile{toc}{\contentsline {subsection}{\numberline {V-A}LQR Algotithm}{3}}
\@writefile{toc}{\contentsline {subsection}{\numberline {V-B}LQR Results}{4}}
\@writefile{lof}{\contentsline {figure}{\numberline {10}{\ignorespaces Result of LQR Used on Spring-Mass-Damper Model}}{4}}
\newlabel{figurelabel}{{10}{4}}
\@writefile{lof}{\contentsline {figure}{\numberline {11}{\ignorespaces Result of LQR Used on Inverted Pendulum Model}}{4}}
\newlabel{figurelabel}{{11}{4}}
\@writefile{lof}{\contentsline {figure}{\numberline {12}{\ignorespaces Result of LQR Used on Cart-Pole Model (Initial Angle=$10^{\circ }$).}}{4}}
\newlabel{figurelabel}{{12}{4}}
\@writefile{toc}{\contentsline {subsection}{\numberline {V-C}iLQR Algorithm}{4}}
\@writefile{toc}{\contentsline {subsection}{\numberline {V-D}iLQR Results}{5}}
\@writefile{lof}{\contentsline {figure}{\numberline {13}{\ignorespaces Result of iLQR Used on Spring-Mass-Damper Model}}{5}}
\newlabel{figurelabel}{{13}{5}}
\@writefile{lof}{\contentsline {figure}{\numberline {14}{\ignorespaces Result of iLQR Used on Inverted-Pendulum Model}}{5}}
\newlabel{figurelabel}{{14}{5}}
\@writefile{toc}{\contentsline {section}{\numberline {VI}USING THE TEMPLATE}{5}}
\@writefile{toc}{\contentsline {subsection}{\numberline {VI-A}Headings, etc}{5}}
\@writefile{toc}{\contentsline {subsection}{\numberline {VI-B}Figures and Tables}{5}}
\@writefile{lot}{\contentsline {table}{\numberline {I}{\ignorespaces An Example of a Table}}{5}}
\newlabel{table_example}{{I}{5}}
\@writefile{lof}{\contentsline {figure}{\numberline {15}{\ignorespaces Inductance of oscillation winding on amorphous magnetic core versus DC bias magnetic field}}{5}}
\newlabel{figurelabel}{{15}{5}}
\bibcite{c1}{1}
\bibcite{c2}{2}
\bibcite{c3}{3}
\bibcite{c4}{4}
\bibcite{c5}{5}
\bibcite{c6}{6}
\bibcite{c7}{7}
\bibcite{c8}{8}
\bibcite{c9}{9}
\bibcite{c10}{10}
\bibcite{c11}{11}
\bibcite{c12}{12}
\bibcite{c13}{13}
\bibcite{c14}{14}
\bibcite{c15}{15}
\bibcite{c16}{16}
\bibcite{c17}{17}
\bibcite{c18}{18}
\bibcite{c19}{19}
\bibcite{c20}{20}
\@writefile{toc}{\contentsline {section}{\numberline {VII}CONCLUSIONS}{6}}
\@writefile{toc}{\contentsline {section}{References}{6}}
