\relax 
\@writefile{toc}{\contentsline {section}{\numberline {I}INTRODUCTION}{1}}
\@writefile{toc}{\contentsline {section}{\numberline {II}PROCEDURE FOR PAPER SUBMISSION}{1}}
\@writefile{toc}{\contentsline {subsection}{\numberline {II-A}Selecting a Template (Heading 2)}{1}}
\@writefile{toc}{\contentsline {subsection}{\numberline {II-B}Maintaining the Integrity of the Specifications}{1}}
\@writefile{toc}{\contentsline {section}{\numberline {III}Model Free}{1}}
\@writefile{toc}{\contentsline {subsection}{\numberline {III-A}Q-Learning Algorithm}{1}}
\@writefile{toc}{\contentsline {subsection}{\numberline {III-B}Results}{1}}
\@writefile{toc}{\contentsline {subsection}{\numberline {III-C}Mass-Spring-Damper}{1}}
\@writefile{lof}{\contentsline {figure}{\numberline {1}{\ignorespaces Result of LQR Used on Spring-Mass-Damper Model}}{1}}
\newlabel{figurelabel}{{1}{1}}
\@writefile{toc}{\contentsline {subsection}{\numberline {III-D}Inverted Pendulum}{1}}
\@writefile{toc}{\contentsline {subsection}{\numberline {III-E}Cart Pole}{1}}
\@writefile{lof}{\contentsline {figure}{\numberline {2}{\ignorespaces Result of LQR Used on Spring-Mass-Damper Model}}{2}}
\newlabel{figurelabel}{{2}{2}}
\@writefile{lof}{\contentsline {figure}{\numberline {3}{\ignorespaces Result of LQR Used on Spring-Mass-Damper Model}}{2}}
\newlabel{figurelabel}{{3}{2}}
\@writefile{toc}{\contentsline {section}{\numberline {IV}Optimal Control}{2}}
\@writefile{toc}{\contentsline {subsection}{\numberline {IV-A}LQR Algotithm}{2}}
\@writefile{toc}{\contentsline {subsection}{\numberline {IV-B}LQR Results}{2}}
\@writefile{lof}{\contentsline {figure}{\numberline {4}{\ignorespaces Result of LQR Used on Spring-Mass-Damper Model}}{2}}
\newlabel{figurelabel}{{4}{2}}
\@writefile{lof}{\contentsline {figure}{\numberline {5}{\ignorespaces Result of LQR Used on Inverted Pendulum Model}}{3}}
\newlabel{figurelabel}{{5}{3}}
\@writefile{lof}{\contentsline {figure}{\numberline {6}{\ignorespaces Result of LQR Used on Cart-Pole Model (Initial Angle=$10^{\circ }$).}}{3}}
\newlabel{figurelabel}{{6}{3}}
\@writefile{toc}{\contentsline {subsection}{\numberline {IV-C}iLQR Algorithm}{3}}
\@writefile{toc}{\contentsline {subsection}{\numberline {IV-D}iLQR Results}{3}}
\@writefile{lof}{\contentsline {figure}{\numberline {7}{\ignorespaces Result of iLQR Used on Spring-Mass-Damper Model}}{3}}
\newlabel{figurelabel}{{7}{3}}
\@writefile{lof}{\contentsline {figure}{\numberline {8}{\ignorespaces Result of iLQR Used on Inverted-Pendulum Model}}{3}}
\newlabel{figurelabel}{{8}{3}}
\bibcite{c1}{1}
\bibcite{c2}{2}
\bibcite{c3}{3}
\bibcite{c4}{4}
\bibcite{c5}{5}
\bibcite{c6}{6}
\bibcite{c7}{7}
\bibcite{c8}{8}
\bibcite{c9}{9}
\bibcite{c10}{10}
\bibcite{c11}{11}
\bibcite{c12}{12}
\bibcite{c13}{13}
\bibcite{c14}{14}
\@writefile{toc}{\contentsline {section}{\numberline {V}USING THE TEMPLATE}{4}}
\@writefile{toc}{\contentsline {subsection}{\numberline {V-A}Headings, etc}{4}}
\@writefile{toc}{\contentsline {subsection}{\numberline {V-B}Figures and Tables}{4}}
\@writefile{lot}{\contentsline {table}{\numberline {I}{\ignorespaces An Example of a Table}}{4}}
\newlabel{table_example}{{I}{4}}
\@writefile{lof}{\contentsline {figure}{\numberline {9}{\ignorespaces Inductance of oscillation winding on amorphous magnetic core versus DC bias magnetic field}}{4}}
\newlabel{figurelabel}{{9}{4}}
\@writefile{toc}{\contentsline {section}{\numberline {VI}CONCLUSIONS}{4}}
\@writefile{toc}{\contentsline {section}{References}{4}}
\bibcite{c15}{15}
\bibcite{c16}{16}
\bibcite{c17}{17}
\bibcite{c18}{18}
\bibcite{c19}{19}
\bibcite{c20}{20}
