﻿Rank,Title (click to view),Title (click to view)链接,Studio,Opening*,% of Total,Theaters,Avg.,Total Gross^,Date**
1,Avengers: Endgame,https://www.boxofficemojo.com/movies/?id=marvel2019.htm,BV,"$357,115,007",44.7%,"4,662","$76,601","$798,172,736",4/26/2019
2,Avengers: Infinity War,https://www.boxofficemojo.com/movies/?id=marvel0518.htm,BV,"$257,698,183",38.0%,"4,474","$57,599","$678,815,482",4/27/2018
3,Star Wars: The Force Awakens,https://www.boxofficemojo.com/movies/?id=starwars7.htm,BV,"$247,966,675",26.5%,"4,134","$59,982","$936,662,225",12/18/2015
4,Star Wars: The Last Jedi,https://www.boxofficemojo.com/movies/?id=starwars8.htm,BV,"$220,009,584",35.5%,"4,232","$51,987","$620,181,382",12/15/2017
5,Jurassic World,https://www.boxofficemojo.com/movies/?id=jurassicpark4.htm,Uni.,"$208,806,270",32.0%,"4,274","$48,855","$652,270,625",6/12/2015
6,Marvel's The Avengers,https://www.boxofficemojo.com/movies/?id=avengers11.htm,BV,"$207,438,708",33.3%,"4,349","$47,698","$623,357,910",5/4/2012
7,Black Panther,https://www.boxofficemojo.com/movies/?id=marvel2017b.htm,BV,"$202,003,951",28.9%,"4,020","$50,250","$700,059,566",2/16/2018
8,Avengers: Age of Ultron,https://www.boxofficemojo.com/movies/?id=avengers2.htm,BV,"$191,271,109",41.7%,"4,276","$44,731","$459,005,868",5/1/2015
9,Incredibles 2,https://www.boxofficemojo.com/movies/?id=theincredibles2.htm,BV,"$182,687,905",30.0%,"4,410","$41,426","$608,581,744",6/15/2018
10,Captain America: Civil War,https://www.boxofficemojo.com/movies/?id=marvel2016.htm,BV,"$179,139,142",43.9%,"4,226","$42,390","$408,084,349",5/6/2016
11,Beauty and the Beast (2017),https://www.boxofficemojo.com/movies/?id=beautyandthebeast2017.htm,BV,"$174,750,616",34.7%,"4,210","$41,508","$504,014,165",3/17/2017
12,Iron Man 3,https://www.boxofficemojo.com/movies/?id=ironman3.htm,BV,"$174,144,585",42.6%,"4,253","$40,946","$409,013,994",5/3/2013
13,Harry Potter and the Deathly Hallows Part 2,https://www.boxofficemojo.com/movies/?id=harrypotter72.htm,WB,"$169,189,427",44.4%,"4,375","$38,672","$381,011,219",7/15/2011
14,Batman v Superman: Dawn of Justice,https://www.boxofficemojo.com/movies/?id=superman2015.htm,WB,"$166,007,347",50.3%,"4,242","$39,134","$330,360,194",3/25/2016
15,The Dark Knight Rises,https://www.boxofficemojo.com/movies/?id=batman3.htm,WB,"$160,887,295",35.9%,"4,404","$36,532","$448,139,099",7/20/2012
16,The Dark Knight,https://www.boxofficemojo.com/movies/?id=darkknight.htm,WB,"$158,411,483",29.7%,"4,366","$36,283","$533,345,358",7/18/2008
17,The Hunger Games: Catching Fire,https://www.boxofficemojo.com/movies/?id=catchingfire.htm,LGF,"$158,074,286",37.2%,"4,163","$37,971","$424,668,047",11/22/2013
18,Rogue One: A Star Wars Story,https://www.boxofficemojo.com/movies/?id=starwars2016.htm,BV,"$155,081,681",29.1%,"4,157","$37,306","$532,177,324",12/16/2016
19,Captain Marvel,https://www.boxofficemojo.com/movies/?id=marvel2018a.htm,BV,"$153,433,423",36.0%,"4,310","$35,599","$425,781,352",3/8/2019
20,The Hunger Games,https://www.boxofficemojo.com/movies/?id=hungergames.htm,LGF,"$152,535,747",37.4%,"4,137","$36,871","$408,010,692",3/23/2012
21,Spider-Man 3,https://www.boxofficemojo.com/movies/?id=spiderman3.htm,Sony,"$151,116,516",44.9%,"4,252","$35,540","$336,530,303",5/4/2007
22,Jurassic World: Fallen Kingdom,https://www.boxofficemojo.com/movies/?id=jurassicworldsequel.htm,Uni.,"$148,024,610",35.4%,"4,475","$33,078","$417,719,760",6/22/2018
23,Furious 7,https://www.boxofficemojo.com/movies/?id=fast7.htm,Uni.,"$147,187,040",41.7%,"4,004","$36,760","$353,007,020",4/3/2015
24,Guardians of the Galaxy Vol. 2,https://www.boxofficemojo.com/movies/?id=marvel17a.htm,BV,"$146,510,104",37.6%,"4,347","$33,704","$389,813,101",5/5/2017
25,The Twilight Saga: New Moon,https://www.boxofficemojo.com/movies/?id=newmoon.htm,Sum.,"$142,839,137",48.2%,"4,024","$35,497","$296,623,634",11/20/2009
26,The Twilight Saga: Breaking Dawn Part 2,https://www.boxofficemojo.com/movies/?id=breakingdawn2.htm,LG/S,"$141,067,634",48.3%,"4,070","$34,660","$292,324,737",11/16/2012
27,The Twilight Saga: Breaking Dawn Part 1,https://www.boxofficemojo.com/movies/?id=breakingdawn.htm,Sum.,"$138,122,261",49.1%,"4,061","$34,012","$281,287,133",11/18/2011
28,Pirates of the Caribbean: Dead Man's Chest,https://www.boxofficemojo.com/movies/?id=piratesofthecaribbean2.htm,BV,"$135,634,554",32.0%,"4,133","$32,817","$423,315,812",7/7/2006
29,Finding Dory,https://www.boxofficemojo.com/movies/?id=pixar2015.htm,BV,"$135,060,273",27.8%,"4,305","$31,373","$486,295,561",6/17/2016
30,Suicide Squad,https://www.boxofficemojo.com/movies/?id=dc2016.htm,WB,"$133,682,248",41.1%,"4,255","$31,418","$325,100,054",8/5/2016
31,Deadpool,https://www.boxofficemojo.com/movies/?id=deadpool2016.htm,Fox,"$132,434,639",36.5%,"3,558","$37,222","$363,070,709",2/12/2016
32,Iron Man 2,https://www.boxofficemojo.com/movies/?id=ironman2.htm,Par.,"$128,122,480",41.0%,"4,380","$29,252","$312,433,331",5/7/2010
33,Deadpool 2,https://www.boxofficemojo.com/movies/?id=foxmarvel18.htm,Fox,"$125,507,153",39.4%,"4,349","$28,859","$318,491,426",5/18/2018
34,Harry Potter and the Deathly Hallows Part 1,https://www.boxofficemojo.com/movies/?id=harrypotter7.htm,WB,"$125,017,372",42.2%,"4,125","$30,307","$295,983,305",11/19/2010
35,It,https://www.boxofficemojo.com/movies/?id=it.htm,WB (NL),"$123,403,419",37.7%,"4,103","$30,076","$327,481,748",9/8/2017
36,Thor: Ragnarok,https://www.boxofficemojo.com/movies/?id=marvel2017.htm,BV,"$122,744,989",39.0%,"4,080","$30,085","$315,058,289",11/3/2017
37,The Hunger Games: Mockingjay - Part 1,https://www.boxofficemojo.com/movies/?id=hungergames3.htm,LGF,"$121,897,634",36.2%,"4,151","$29,366","$337,135,885",11/21/2014
38,Shrek the Third,https://www.boxofficemojo.com/movies/?id=shrek3.htm,P/DW,"$121,629,270",37.7%,"4,122","$29,507","$322,719,944",5/18/2007
39,Spider-Man: Homecoming,https://www.boxofficemojo.com/movies/?id=spiderman2017.htm,Sony,"$117,027,503",35.0%,"4,348","$26,915","$334,201,140",7/7/2017
40,Man of Steel,https://www.boxofficemojo.com/movies/?id=superman2012.htm,WB,"$116,619,362",40.1%,"4,207","$27,720","$291,045,518",6/14/2013
41,Alice in Wonderland (2010),https://www.boxofficemojo.com/movies/?id=aliceinwonderland10.htm,BV,"$116,101,023",34.7%,"3,728","$31,143","$334,191,110",3/5/2010
42,Minions,https://www.boxofficemojo.com/movies/?id=minions.htm,Uni.,"$115,718,405",34.4%,"4,301","$26,905","$336,045,770",7/10/2015
43,Spider-Man,https://www.boxofficemojo.com/movies/?id=spiderman.htm,Sony,"$114,844,116",28.4%,"3,615","$31,769","$403,706,375",5/3/2002
44,Pirates of the Caribbean: At World's End,https://www.boxofficemojo.com/movies/?id=piratesofthecaribbean3.htm,BV,"$114,732,820",37.1%,"4,362","$26,302","$309,420,425",5/25/2007
45,Toy Story 3,https://www.boxofficemojo.com/movies/?id=toystory3.htm,BV,"$110,307,189",26.6%,"4,028","$27,385","$415,004,880",6/18/2010
46,Transformers: Revenge of the Fallen,https://www.boxofficemojo.com/movies/?id=transformers2.htm,P/DW,"$108,966,307",27.1%,"4,234","$25,736","$402,111,870",6/24/2009
47,Star Wars: Episode III - Revenge of the Sith,https://www.boxofficemojo.com/movies/?id=starwars3.htm,Fox,"$108,435,841",28.5%,"3,661","$29,619","$380,270,577",5/19/2005
48,Shrek 2,https://www.boxofficemojo.com/movies/?id=shrek2.htm,DW,"$108,037,878",24.5%,"4,163","$25,951","$441,226,247",5/19/2004
49,The Secret Life of Pets,https://www.boxofficemojo.com/movies/?id=illumination2015.htm,Uni.,"$104,352,905",28.3%,"4,370","$23,879","$368,384,330",7/8/2016
50,The Jungle Book (2016),https://www.boxofficemojo.com/movies/?id=junglebook2015.htm,BV,"$103,261,464",28.4%,"4,028","$25,636","$364,001,123",4/15/2016
51,Wonder Woman,https://www.boxofficemojo.com/movies/?id=wonderwoman.htm,WB,"$103,251,471",25.0%,"4,165","$24,790","$412,563,408",6/2/2017
52,X-Men: The Last Stand,https://www.boxofficemojo.com/movies/?id=x3.htm,Fox,"$102,750,665",43.8%,"3,690","$27,846","$234,362,462",5/26/2006
53,Harry Potter and the Goblet of Fire,https://www.boxofficemojo.com/movies/?id=harrypotter4.htm,WB,"$102,685,961",35.4%,"3,858","$26,616","$290,013,036",11/18/2005
54,The Hunger Games: Mockingjay - Part 2,https://www.boxofficemojo.com/movies/?id=hungergames4.htm,LGF,"$102,665,981",36.4%,"4,175","$24,591","$281,723,902",11/20/2015
55,Indiana Jones and the Kingdom of the Crystal Skull,https://www.boxofficemojo.com/movies/?id=indianajones4.htm,Par.,"$100,137,835",31.6%,"4,260","$23,507","$317,101,119",5/22/2008
56,Transformers: Age of Extinction,https://www.boxofficemojo.com/movies/?id=transformers4.htm,Par.,"$100,038,390",40.8%,"4,233","$23,633","$245,439,076",6/27/2014
57,The Fate of the Furious,https://www.boxofficemojo.com/movies/?id=furious8.htm,Uni.,"$98,786,705",43.7%,"4,310","$22,920","$226,008,385",4/14/2017
58,Iron Man,https://www.boxofficemojo.com/movies/?id=ironman.htm,Par.,"$98,618,668",31.0%,"4,105","$24,024","$318,412,101",5/2/2008
59,Transformers: Dark of the Moon,https://www.boxofficemojo.com/movies/?id=transformers3.htm,P/DW,"$97,852,865",27.8%,"4,088","$23,937","$352,390,543",6/29/2011
60,Fast & Furious 6,https://www.boxofficemojo.com/movies/?id=fast6.htm,Uni.,"$97,375,245",40.8%,"3,658","$26,620","$238,679,850",5/24/2013
61,Captain America: The Winter Soldier,https://www.boxofficemojo.com/movies/?id=marvel14b.htm,BV,"$95,023,721",36.6%,"3,938","$24,130","$259,766,572",4/4/2014
62,Guardians of the Galaxy,https://www.boxofficemojo.com/movies/?id=marvel2014a.htm,BV,"$94,320,883",28.3%,"4,080","$23,118","$333,176,600",8/1/2014
63,Justice League,https://www.boxofficemojo.com/movies/?id=dcfilm1117.htm,WB,"$93,842,239",41.0%,"4,051","$23,165","$229,024,295",11/17/2017
64,Harry Potter and the Prisoner of Azkaban,https://www.boxofficemojo.com/movies/?id=harrypotter3.htm,WB,"$93,687,367",37.5%,"3,855","$24,302","$249,541,069",6/4/2004
65,Godzilla (2014),https://www.boxofficemojo.com/movies/?id=godzilla2012.htm,WB,"$93,188,384",46.4%,"3,952","$23,580","$200,676,069",5/16/2014
66,The Matrix Reloaded,https://www.boxofficemojo.com/movies/?id=matrixreloaded.htm,WB,"$91,774,413",32.6%,"3,603","$25,471","$281,576,461",5/15/2003
67,The Amazing Spider-Man 2,https://www.boxofficemojo.com/movies/?id=amazingspiderman2.htm,Sony,"$91,608,337",45.2%,"4,324","$21,186","$202,853,933",5/2/2014
68,X-Men: Days of Future Past,https://www.boxofficemojo.com/movies/?id=xmen2014.htm,Fox,"$90,823,660",38.8%,"3,996","$22,729","$233,921,534",5/23/2014
69,Inside Out,https://www.boxofficemojo.com/movies/?id=pixar2014.htm,BV,"$90,440,272",25.4%,"3,946","$22,919","$356,461,711",6/19/2015
70,Harry Potter and the Sorcerer's Stone,https://www.boxofficemojo.com/movies/?id=harrypotter.htm,WB,"$90,294,621",28.4%,"3,672","$24,590","$317,575,550",11/16/2001
71,Pirates of the Caribbean: On Stranger Tides,https://www.boxofficemojo.com/movies/?id=piratesofthecaribbean4.htm,BV,"$90,151,958",37.4%,"4,155","$21,697","$241,071,802",5/20/2011
72,American Sniper,https://www.boxofficemojo.com/movies/?id=americansniper.htm,WB,"$89,269,066",25.5%,"3,555","$25,111","$350,126,372",1/16/2015
73,Logan (2017),https://www.boxofficemojo.com/movies/?id=wolverine2017.htm,Fox,"$88,411,916",39.1%,"4,071","$21,717","$226,277,068",3/3/2017
74,Skyfall,https://www.boxofficemojo.com/movies/?id=bond23.htm,Sony,"$88,364,714",29.0%,"3,505","$25,211","$304,360,277",11/9/2012
75,Harry Potter and the Chamber of Secrets,https://www.boxofficemojo.com/movies/?id=harrypotter2.htm,WB,"$88,357,488",33.7%,"3,682","$23,997","$261,988,482",11/15/2002
76,Spider-Man 2,https://www.boxofficemojo.com/movies/?id=spiderman2.htm,Sony,"$88,156,227",23.6%,"4,152","$21,232","$373,585,825",6/30/2004
77,Fast Five,https://www.boxofficemojo.com/movies/?id=fastfive.htm,Uni.,"$86,198,765",41.1%,"3,644","$23,655","$209,837,675",4/29/2011
78,Aladdin (2019),https://www.boxofficemojo.com/movies/?id=disneyfairytale22019.htm,BV,"$86,100,000",100.0%,"4,476","$19,236","$86,100,000",5/24/2019
79,The Hangover Part II,https://www.boxofficemojo.com/movies/?id=hangover2.htm,WB,"$85,946,294",33.8%,"3,615","$23,775","$254,464,305",5/26/2011
80,Thor: The Dark World,https://www.boxofficemojo.com/movies/?id=thor2.htm,BV,"$85,737,841",41.5%,"3,841","$22,322","$206,362,140",11/8/2013
81,X2: X-Men United,https://www.boxofficemojo.com/movies/?id=x2.htm,Fox,"$85,558,731",39.8%,"3,741","$22,870","$214,949,694",5/2/2003
82,Fifty Shades of Grey,https://www.boxofficemojo.com/movies/?id=fiftyshadesofgrey.htm,Uni.,"$85,171,450",51.3%,"3,646","$23,360","$166,167,230",2/13/2015
83,Doctor Strange,https://www.boxofficemojo.com/movies/?id=marvel716.htm,BV,"$85,058,311",36.6%,"3,882","$21,911","$232,641,920",11/4/2016
84,X-Men Origins: Wolverine,https://www.boxofficemojo.com/movies/?id=wolverine.htm,Fox,"$85,058,003",47.3%,"4,099","$20,751","$179,883,157",5/1/2009
85,The Hobbit: An Unexpected Journey,https://www.boxofficemojo.com/movies/?id=hobbit.htm,WB (NL),"$84,617,303",27.9%,"4,045","$20,919","$303,003,568",12/14/2012
86,Solo: A Star Wars Story,https://www.boxofficemojo.com/movies/?id=untitledhansolostarwarsanthologyfilm.htm,BV,"$84,420,489",39.5%,"4,381","$19,270","$213,767,512",5/25/2018
87,The Passion of the Christ,https://www.boxofficemojo.com/movies/?id=passionofthechrist.htm,NM,"$83,848,082",22.6%,"3,043","$27,554","$370,274,604",2/25/2004
88,Despicable Me 2,https://www.boxofficemojo.com/movies/?id=despicableme2.htm,Uni.,"$83,517,315",22.7%,"3,997","$20,895","$368,061,265",7/3/2013
89,Monsters University,https://www.boxofficemojo.com/movies/?id=monstersinc2.htm,BV,"$82,429,469",30.7%,"4,004","$20,587","$268,492,764",6/21/2013
90,Venom (2018),https://www.boxofficemojo.com/movies/?id=venom2018.htm,Sony,"$80,255,756",37.6%,"4,250","$18,884","$213,515,506",10/5/2018
91,Star Wars: Episode II - Attack of the Clones,https://www.boxofficemojo.com/movies/?id=starwars2.htm,Fox,"$80,027,814",26.5%,"3,161","$25,317","$302,191,252",5/16/2002
92,Oz The Great and Powerful,https://www.boxofficemojo.com/movies/?id=oz.htm,BV,"$79,110,453",33.7%,"3,912","$20,223","$234,911,825",3/8/2013
93,Harry Potter and the Half-Blood Prince,https://www.boxofficemojo.com/movies/?id=harrypotter6.htm,WB,"$77,835,727",25.8%,"4,325","$17,997","$301,959,197",7/15/2009
94,I Am Legend,https://www.boxofficemojo.com/movies/?id=iamlegend.htm,WB,"$77,211,321",30.1%,"3,606","$21,411","$256,393,010",12/14/2007
95,Harry Potter and the Order of the Phoenix,https://www.boxofficemojo.com/movies/?id=harrypotter5.htm,WB,"$77,108,414",26.4%,"4,285","$17,994","$292,004,738",7/11/2007
96,The Da Vinci Code,https://www.boxofficemojo.com/movies/?id=davincicode.htm,Sony,"$77,073,388",35.4%,"3,735","$20,635","$217,536,138",5/19/2006
97,Avatar,https://www.boxofficemojo.com/movies/?id=avatar.htm,Fox,"$77,025,481",10.3%,"3,452","$22,313","$749,766,139",12/18/2009
98,Halloween (2018),https://www.boxofficemojo.com/movies/?id=halloween2018.htm,Uni.,"$76,221,545",47.8%,"3,928","$19,405","$159,342,015",10/19/2018
99,Ant-Man and the Wasp,https://www.boxofficemojo.com/movies/?id=ant-manandthewasp.htm,BV,"$75,812,205",35.0%,"4,206","$18,025","$216,648,740",7/6/2018
100,Star Trek,https://www.boxofficemojo.com/movies/?id=startrek11.htm,Par.,"$75,204,289",29.2%,"3,849","$19,539","$257,730,019",5/8/2009
101,Zootopia,https://www.boxofficemojo.com/movies/?id=disney2016.htm,BV,"$75,063,401",22.0%,"3,827","$19,614","$341,268,248",3/4/2016
102,Fantastic Beasts and Where To Find Them,https://www.boxofficemojo.com/movies/?id=fantasticbeasts.htm,WB,"$74,403,387",31.8%,"4,144","$17,954","$234,037,575",11/18/2016
103,The Simpsons Movie,https://www.boxofficemojo.com/movies/?id=simpsons.htm,Fox,"$74,036,787",40.4%,"3,922","$18,877","$183,135,014",7/27/2007
104,The Hobbit: The Desolation of Smaug,https://www.boxofficemojo.com/movies/?id=hobbit2.htm,WB (NL),"$73,645,197",28.5%,"3,903","$18,869","$258,366,855",12/13/2013
105,Austin Powers in Goldmember,https://www.boxofficemojo.com/movies/?id=austinpowers3.htm,NL,"$73,071,188",34.3%,"3,613","$20,224","$213,307,889",7/26/2002
106,The Lord of the Rings: The Return of the King,https://www.boxofficemojo.com/movies/?id=returnoftheking.htm,NL,"$72,629,713",19.3%,"3,703","$19,613","$377,027,325",12/17/2003
107,Dawn of the Planet of the Apes,https://www.boxofficemojo.com/movies/?id=dawnoftheapes.htm,Fox,"$72,611,427",34.8%,"3,967","$18,304","$208,545,589",7/11/2014
108,Despicable Me 3,https://www.boxofficemojo.com/movies/?id=despicableme3.htm,Uni.,"$72,434,025",27.4%,"4,529","$15,993","$264,624,300",6/30/2017
109,The Lost World: Jurassic Park,https://www.boxofficemojo.com/movies/?id=jurassicpark2.htm,Uni.,"$72,132,785",31.5%,"3,281","$21,985","$229,086,679",5/23/1997
110,Us,https://www.boxofficemojo.com/movies/?id=untitledjordanpeele.htm,Uni.,"$71,117,625",40.7%,"3,741","$19,010","$174,748,645",3/22/2019
111,Fast and Furious,https://www.boxofficemojo.com/movies/?id=fastandthefurious4.htm,Uni.,"$70,950,500",45.8%,"3,461","$20,500","$155,064,265",4/3/2009
112,300,https://www.boxofficemojo.com/movies/?id=300.htm,WB,"$70,885,301",33.7%,"3,103","$22,844","$210,614,939",3/9/2007
113,Shrek Forever After,https://www.boxofficemojo.com/movies/?id=shrek4.htm,P/DW,"$70,838,207",29.7%,"4,359","$16,251","$238,736,787",5/21/2010
114,Transformers,https://www.boxofficemojo.com/movies/?id=transformers06.htm,P/DW,"$70,502,384",22.1%,"4,011","$17,577","$319,246,193",7/3/2007
115,The Incredibles,https://www.boxofficemojo.com/movies/?id=incredibles.htm,BV,"$70,467,623",27.0%,"3,933","$17,917","$261,441,092",11/5/2004
116,Spectre,https://www.boxofficemojo.com/movies/?id=bond24.htm,Sony,"$70,403,148",35.2%,"3,929","$17,919","$200,074,609",11/6/2015
117,Finding Nemo,https://www.boxofficemojo.com/movies/?id=findingnemo.htm,BV,"$70,251,710",20.7%,"3,374","$20,821","$339,714,978",5/30/2003
118,Dr. Seuss' The Lorax,https://www.boxofficemojo.com/movies/?id=lorax.htm,Uni.,"$70,217,070",32.8%,"3,729","$18,830","$214,030,500",3/2/2012
119,Star Trek Into Darkness,https://www.boxofficemojo.com/movies/?id=startrek12.htm,Par.,"$70,165,559",30.7%,"3,868","$18,140","$228,778,661",5/16/2013
120,Twilight,https://www.boxofficemojo.com/movies/?id=twilight08.htm,Sum.,"$69,637,740",36.1%,"3,419","$20,368","$192,769,854",11/21/2008
121,Maleficent,https://www.boxofficemojo.com/movies/?id=maleficient.htm,BV,"$69,431,298",28.8%,"3,948","$17,586","$241,410,378",5/30/2014
122,The Bourne Ultimatum,https://www.boxofficemojo.com/movies/?id=bourneultimatum.htm,Uni.,"$69,283,690",30.5%,"3,660","$18,929","$227,471,070",8/3/2007
123,Pitch Perfect 2,https://www.boxofficemojo.com/movies/?id=pitchperfect2.htm,Uni.,"$69,216,890",37.6%,"3,473","$19,930","$184,296,230",5/15/2015
124,The LEGO Movie,https://www.boxofficemojo.com/movies/?id=lego.htm,WB,"$69,050,279",26.8%,"3,775","$18,291","$257,760,692",2/7/2014
125,The Day After Tomorrow,https://www.boxofficemojo.com/movies/?id=dayaftertomorrow.htm,Fox,"$68,743,584",36.8%,"3,425","$20,071","$186,740,799",5/28/2004
126,Planet of the Apes (2001),https://www.boxofficemojo.com/movies/?id=planetoftheapes01.htm,Fox,"$68,532,960",38.1%,"3,500","$19,580","$180,011,740",7/27/2001
127,The Mummy Returns,https://www.boxofficemojo.com/movies/?id=mummyreturns.htm,Uni.,"$68,139,035",33.7%,"3,401","$20,035","$202,019,785",5/4/2001
128,Up,https://www.boxofficemojo.com/movies/?id=up.htm,BV,"$68,108,790",23.2%,"3,766","$18,085","$293,004,164",5/29/2009
129,Ice Age: The Meltdown,https://www.boxofficemojo.com/movies/?id=iceage2.htm,Fox,"$68,033,544",34.8%,"3,964","$17,162","$195,330,621",3/31/2006
130,Bruce Almighty,https://www.boxofficemojo.com/movies/?id=brucealmighty.htm,Uni.,"$67,953,330",28.0%,"3,483","$19,510","$242,829,261",5/23/2003
131,Cinderella (2015),https://www.boxofficemojo.com/movies/?id=cinderella2015.htm,BV,"$67,877,361",33.7%,"3,845","$17,653","$201,151,353",3/13/2015
132,Aquaman,https://www.boxofficemojo.com/movies/?id=dcfilm0617.htm,WB,"$67,873,522",20.3%,"4,125","$16,454","$335,061,807",12/21/2018
133,Dr. Seuss' The Grinch (2018),https://www.boxofficemojo.com/movies/?id=grinch2017.htm,Uni.,"$67,572,855",25.0%,"4,141","$16,318","$270,620,950",11/9/2018
134,Quantum of Solace,https://www.boxofficemojo.com/movies/?id=jamesbond22.htm,Sony,"$67,528,882",40.1%,"3,451","$19,568","$168,368,427",11/14/2008
135,Rush Hour 2,https://www.boxofficemojo.com/movies/?id=rushhour2.htm,NL,"$67,408,222",29.8%,"3,118","$21,619","$226,164,286",8/3/2001
136,Frozen,https://www.boxofficemojo.com/movies/?id=frozen2013.htm,BV,"$67,391,326",16.8%,"3,742","$18,009","$400,738,009",11/27/2013
137,World War Z,https://www.boxofficemojo.com/movies/?id=worldwarz.htm,Par.,"$66,411,834",32.8%,"3,607","$18,412","$202,359,711",6/21/2013
138,Brave,https://www.boxofficemojo.com/movies/?id=bearandthebow.htm,BV,"$66,323,594",28.0%,"4,164","$15,928","$237,283,207",6/22/2012
139,Cars 2,https://www.boxofficemojo.com/movies/?id=cars2.htm,BV,"$66,135,507",34.5%,"4,115","$16,072","$191,452,396",6/24/2011
140,X-Men: Apocalypse,https://www.boxofficemojo.com/movies/?id=x-men2016.htm,Fox,"$65,769,562",42.3%,"4,150","$15,848","$155,442,489",5/27/2016
141,Thor,https://www.boxofficemojo.com/movies/?id=thor.htm,Par.,"$65,723,338",36.3%,"3,955","$16,618","$181,030,624",5/6/2011
142,Teenage Mutant Ninja Turtles (2014),https://www.boxofficemojo.com/movies/?id=tmnt2013.htm,Par.,"$65,575,105",34.3%,"3,845","$17,055","$191,204,754",8/8/2014
143,"The Chronicles of Narnia: The Lion, the Witch and the Wardrobe",https://www.boxofficemojo.com/movies/?id=narnia.htm,BV,"$65,556,312",22.5%,"3,616","$18,129","$291,710,957",12/9/2005
144,2012,https://www.boxofficemojo.com/movies/?id=2012.htm,Sony,"$65,237,614",39.3%,"3,404","$19,165","$166,112,167",11/13/2009
145,Captain America: The First Avenger,https://www.boxofficemojo.com/movies/?id=captainamerica.htm,Par.,"$65,058,524",36.8%,"3,715","$17,512","$176,654,505",7/22/2011
146,War of the Worlds,https://www.boxofficemojo.com/movies/?id=waroftheworlds.htm,Par.,"$64,878,725",27.7%,"3,908","$16,601","$234,280,354",6/29/2005
147,The Twilight Saga: Eclipse,https://www.boxofficemojo.com/movies/?id=eclipse.htm,Sum.,"$64,832,191",21.6%,"4,468","$14,510","$300,531,751",6/30/2010
148,Star Wars: Episode I - The Phantom Menace,https://www.boxofficemojo.com/movies/?id=starwars.htm,Fox,"$64,820,970",15.0%,"2,970","$21,825","$431,088,295",5/19/1999
149,Madagascar: Escape 2 Africa,https://www.boxofficemojo.com/movies/?id=madagascar2.htm,P/DW,"$63,106,589",35.1%,"4,056","$15,559","$180,010,950",11/7/2008
150,WALL-E,https://www.boxofficemojo.com/movies/?id=wall-e.htm,BV,"$63,087,526",28.2%,"3,992","$15,803","$223,808,164",6/27/2008
151,Pirates of the Caribbean: Dead Men Tell No Tales,https://www.boxofficemojo.com/movies/?id=potc5.htm,BV,"$62,983,253",36.5%,"4,276","$14,729","$172,558,876",5/26/2017
152,Inception,https://www.boxofficemojo.com/movies/?id=inception.htm,WB,"$62,785,337",21.5%,"3,792","$16,557","$292,576,195",7/16/2010
153,Hancock,https://www.boxofficemojo.com/movies/?id=hancock.htm,Sony,"$62,603,879",27.5%,"3,965","$15,789","$227,946,274",7/2/2008
154,"Monsters, Inc.",https://www.boxofficemojo.com/movies/?id=monstersinc.htm,BV,"$62,577,067",24.5%,"3,237","$19,331","$255,873,250",11/2/2001
155,Sherlock Holmes,https://www.boxofficemojo.com/movies/?id=sherlockholmes.htm,WB,"$62,304,277",29.8%,"3,626","$17,183","$209,028,679",12/25/2009
156,Fantastic Beasts: The Crimes of Grindelwald,https://www.boxofficemojo.com/movies/?id=wbevent2018.htm,WB,"$62,163,104",39.0%,"4,163","$14,932","$159,555,901",11/16/2018
157,Hulk,https://www.boxofficemojo.com/movies/?id=hulk.htm,Uni.,"$62,128,420",47.0%,"3,660","$16,974","$132,177,234",6/20/2003
158,The Lord of the Rings: The Two Towers,https://www.boxofficemojo.com/movies/?id=twotowers.htm,NL,"$62,007,528",18.2%,"3,622","$17,119","$339,789,881",12/18/2002
159,The Amazing Spider-Man,https://www.boxofficemojo.com/movies/?id=spiderman4.htm,Sony,"$62,004,688",23.7%,"4,318","$14,360","$262,030,663",7/3/2012
160,Mission: Impossible - Fallout,https://www.boxofficemojo.com/movies/?id=missionimpossible6.htm,Par.,"$61,236,534",27.8%,"4,386","$13,962","$220,159,104",7/27/2018
161,Clash of the Titans (2010),https://www.boxofficemojo.com/movies/?id=clashofthetitans10.htm,WB,"$61,235,105",37.5%,"3,777","$16,213","$163,214,888",4/2/2010
162,Kong: Skull Island,https://www.boxofficemojo.com/movies/?id=legendary2016.htm,WB,"$61,025,472",36.3%,"3,846","$15,867","$168,052,812",3/10/2017
163,Madagascar 3: Europe's Most Wanted,https://www.boxofficemojo.com/movies/?id=madagascar3.htm,P/DW,"$60,316,738",27.9%,"4,258","$14,166","$216,391,482",6/8/2012
164,Kung Fu Panda,https://www.boxofficemojo.com/movies/?id=kungfupanda.htm,P/DW,"$60,239,130",28.0%,"4,114","$14,642","$215,434,591",6/6/2008
165,Straight Outta Compton,https://www.boxofficemojo.com/movies/?id=straightouttacompton.htm,Uni.,"$60,200,180",37.3%,"2,757","$21,835","$161,197,785",8/14/2015
166,Cars,https://www.boxofficemojo.com/movies/?id=cars.htm,BV,"$60,119,509",24.6%,"3,985","$15,086","$244,082,982",6/9/2006
167,Signs,https://www.boxofficemojo.com/movies/?id=signs.htm,BV,"$60,117,080",26.4%,"3,264","$18,418","$227,966,634",8/2/2002
168,Monsters Vs. Aliens,https://www.boxofficemojo.com/movies/?id=monstersvsaliens.htm,P/DW,"$59,321,095",29.9%,"4,104","$14,454","$198,351,526",3/27/2009
169,Star Trek Beyond,https://www.boxofficemojo.com/movies/?id=startrek2016.htm,Par.,"$59,253,211",37.3%,"3,928","$15,085","$158,848,340",7/22/2016
170,Jason Bourne,https://www.boxofficemojo.com/movies/?id=bourne5.htm,Uni.,"$59,215,365",36.5%,"4,026","$14,708","$162,434,410",7/29/2016
171,Pearl Harbor,https://www.boxofficemojo.com/movies/?id=pearlharbor.htm,BV,"$59,078,912",29.8%,"3,214","$18,381","$198,542,554",5/25/2001
172,Fantastic Four: Rise of the Silver Surfer,https://www.boxofficemojo.com/movies/?id=fantasticfour2.htm,Fox,"$58,051,684",44.0%,"3,959","$14,663","$131,921,738",6/15/2007
173,Hannibal,https://www.boxofficemojo.com/movies/?id=hannibal.htm,MGM,"$58,003,121",35.1%,"3,230","$17,957","$165,092,268",2/9/2001
174,Mission: Impossible II,https://www.boxofficemojo.com/movies/?id=mi2.htm,Par.,"$57,845,297",26.9%,"3,653","$15,835","$215,409,889",5/24/2000
175,Toy Story 2,https://www.boxofficemojo.com/movies/?id=toystory2.htm,BV,"$57,388,839",23.3%,"3,236","$17,734","$245,852,179",11/24/1999
176,Ant-Man,https://www.boxofficemojo.com/movies/?id=antman.htm,BV,"$57,225,526",31.8%,"3,856","$14,841","$180,202,163",7/17/2015
177,22 Jump Street,https://www.boxofficemojo.com/movies/?id=21jumpstreet2.htm,Sony,"$57,071,445",29.8%,"3,306","$17,263","$191,719,337",6/13/2014
178,Sex and the City,https://www.boxofficemojo.com/movies/?id=sexandthecity.htm,WB (NL),"$57,038,404",37.4%,"3,285","$17,363","$152,647,258",5/30/2008
179,John Wick: Chapter 3 - Parabellum,https://www.boxofficemojo.com/movies/?id=johnwick3.htm,LG/S,"$56,818,067",56.3%,"3,850","$14,758","$100,988,941",5/17/2019
180,Moana,https://www.boxofficemojo.com/movies/?id=disney1116.htm,BV,"$56,631,401",22.8%,"3,875","$14,615","$248,757,044",11/23/2016
181,Despicable Me,https://www.boxofficemojo.com/movies/?id=despicableme.htm,Uni.,"$56,397,125",22.4%,"3,476","$16,225","$251,513,985",7/9/2010
182,War for the Planet of the Apes,https://www.boxofficemojo.com/movies/?id=planetoftheapes16.htm,Fox,"$56,262,929",38.3%,"4,022","$13,989","$146,880,162",7/14/2017
183,Valentine's Day,https://www.boxofficemojo.com/movies/?id=valentinesday.htm,WB (NL),"$56,260,707",50.9%,"3,665","$15,351","$110,485,654",2/12/2010
184,Ralph Breaks the Internet,https://www.boxofficemojo.com/movies/?id=wreckitralph2.htm,BV,"$56,237,634",28.0%,"4,017","$14,000","$201,091,711",11/21/2018
185,Snow White and the Huntsman,https://www.boxofficemojo.com/movies/?id=snowwhiteandthehuntsman.htm,Uni.,"$56,217,700",36.2%,"3,773","$14,900","$155,332,381",6/1/2012
186,Big Hero 6,https://www.boxofficemojo.com/movies/?id=disney2014.htm,BV,"$56,215,889",25.3%,"3,761","$14,947","$222,527,828",11/7/2014
187,Charlie and the Chocolate Factory,https://www.boxofficemojo.com/movies/?id=charliechocolate.htm,WB,"$56,178,450",27.2%,"3,770","$14,901","$206,459,076",7/15/2005
188,Fantastic Four (2005),https://www.boxofficemojo.com/movies/?id=fantasticfour.htm,Fox,"$56,061,504",36.2%,"3,602","$15,563","$154,696,080",7/8/2005
189,Gravity,https://www.boxofficemojo.com/movies/?id=gravity.htm,WB,"$55,785,112",20.4%,"3,575","$15,604","$274,092,705",10/4/2013
190,The Karate Kid,https://www.boxofficemojo.com/movies/?id=karatekid2010.htm,Sony,"$55,665,805",31.5%,"3,663","$15,197","$176,591,618",6/11/2010
191,Mission: Impossible - Rogue Nation,https://www.boxofficemojo.com/movies/?id=mi5.htm,Par.,"$55,520,089",28.5%,"3,956","$14,034","$195,042,377",7/31/2015
192,The Incredible Hulk,https://www.boxofficemojo.com/movies/?id=incrediblehulk.htm,Uni.,"$55,414,050",41.1%,"3,505","$15,810","$134,806,913",6/13/2008
193,The SpongeBob Movie: Sponge Out of Water,https://www.boxofficemojo.com/movies/?id=spongebob2.htm,Par.,"$55,365,012",34.0%,"3,641","$15,206","$162,994,032",2/6/2015
194,Watchmen,https://www.boxofficemojo.com/movies/?id=watchmen.htm,WB,"$55,214,334",51.4%,"3,611","$15,291","$107,509,799",3/6/2009
195,X-Men: First Class,https://www.boxofficemojo.com/movies/?id=xmenfirstclass.htm,Fox,"$55,101,604",37.6%,"3,641","$15,134","$146,408,305",6/3/2011
196,How the Grinch Stole Christmas,https://www.boxofficemojo.com/movies/?id=grinch.htm,Uni.,"$55,082,330",21.2%,"3,127","$17,615","$260,044,825",11/17/2000
197,The Chronicles of Narnia: Prince Caspian,https://www.boxofficemojo.com/movies/?id=narnia2.htm,BV,"$55,034,805",38.9%,"3,929","$14,007","$141,621,490",5/16/2008
198,How to Train Your Dragon: The Hidden World,https://www.boxofficemojo.com/movies/?id=httyd3.htm,Uni.,"$55,022,245",34.3%,"4,259","$12,919","$160,522,630",2/22/2019
199,Austin Powers: The Spy Who Shagged Me,https://www.boxofficemojo.com/movies/?id=austinpowers2.htm,NL,"$54,917,604",26.7%,"3,312","$16,581","$206,040,086",6/11/1999
200,Rise of the Planet of the Apes,https://www.boxofficemojo.com/movies/?id=riseoftheapes.htm,Fox,"$54,806,191",31.0%,"3,648","$15,024","$176,760,185",8/5/2011
201,The Hobbit: The Battle of the Five Armies,https://www.boxofficemojo.com/movies/?id=hobbit3.htm,WB (NL),"$54,724,334",21.5%,"3,875","$14,122","$255,119,788",12/17/2014
202,G.I. Joe: The Rise of Cobra,https://www.boxofficemojo.com/movies/?id=gijoe.htm,Par.,"$54,713,046",36.4%,"4,007","$13,654","$150,201,498",8/7/2009
203,Divergent,https://www.boxofficemojo.com/movies/?id=divergent.htm,LG/S,"$54,607,747",36.2%,"3,936","$13,874","$150,947,895",3/21/2014
204,MIB 3,https://www.boxofficemojo.com/movies/?id=mib3.htm,Sony,"$54,592,779",30.5%,"4,248","$12,851","$179,020,854",5/25/2012
205,San Andreas,https://www.boxofficemojo.com/movies/?id=sanandreas.htm,WB (NL),"$54,588,173",35.2%,"3,777","$14,453","$155,190,832",5/29/2015
206,X-Men,https://www.boxofficemojo.com/movies/?id=xmen.htm,Fox,"$54,471,475",34.6%,"3,025","$18,007","$157,299,717",7/14/2000
207,Ted,https://www.boxofficemojo.com/movies/?id=ted.htm,Uni.,"$54,415,205",24.9%,"3,239","$16,800","$218,815,487",6/29/2012
208,Pokemon Detective Pikachu,https://www.boxofficemojo.com/movies/?id=detectivepikachu.htm,WB,"$54,365,242",46.8%,"4,202","$12,938","$116,122,622",5/10/2019
209,The Martian,https://www.boxofficemojo.com/movies/?id=scott2016.htm,Fox,"$54,308,575",23.8%,"3,831","$14,176","$228,433,663",10/2/2015
210,Night at the Museum: Battle of the Smithsonian,https://www.boxofficemojo.com/movies/?id=nightatthemuseum2.htm,Fox,"$54,173,286",30.6%,"4,096","$13,226","$177,243,721",5/22/2009
211,Scooby-Doo,https://www.boxofficemojo.com/movies/?id=scoobydoo.htm,WB,"$54,155,312",35.3%,"3,447","$15,710","$153,294,164",6/14/2002
212,The Nun,https://www.boxofficemojo.com/movies/?id=thenun.htm,WB (NL),"$53,807,379",45.8%,"3,876","$13,882","$117,450,119",9/7/2018
213,Cars 3,https://www.boxofficemojo.com/movies/?id=cars3.htm,BV,"$53,688,680",35.1%,"4,256","$12,615","$152,901,115",6/16/2017
214,Shazam!,https://www.boxofficemojo.com/movies/?id=untitledmovieiv.htm,WB (NL),"$53,505,326",38.6%,"4,217","$12,688","$138,503,556",4/5/2019
215,Green Lantern,https://www.boxofficemojo.com/movies/?id=greenlantern.htm,WB,"$53,174,303",45.6%,"3,816","$13,935","$116,601,172",6/17/2011
216,The Wolverine,https://www.boxofficemojo.com/movies/?id=wolverine2.htm,Fox,"$53,113,752",40.1%,"3,924","$13,536","$132,556,852",7/26/2013
217,The LEGO Batman Movie,https://www.boxofficemojo.com/movies/?id=lego2.htm,WB,"$53,003,468",30.2%,"4,088","$12,966","$175,750,384",2/10/2017
218,Batman Forever,https://www.boxofficemojo.com/movies/?id=batmanforever.htm,WB,"$52,784,433",28.7%,"2,842","$18,572","$184,031,112",6/16/1995
219,Paranormal Activity 3,https://www.boxofficemojo.com/movies/?id=paranormalactivity3.htm,Par.,"$52,568,183",50.5%,"3,321","$15,829","$104,028,807",10/21/2011
220,Superman Returns,https://www.boxofficemojo.com/movies/?id=superman06.htm,WB,"$52,535,096",26.3%,"4,065","$12,923","$200,081,192",6/28/2006
221,The Bourne Supremacy,https://www.boxofficemojo.com/movies/?id=bournesupremacy.htm,Uni.,"$52,521,865",29.8%,"3,165","$16,594","$176,241,941",7/23/2004
222,The Divergent Series: Insurgent,https://www.boxofficemojo.com/movies/?id=insurgent.htm,LG/S,"$52,263,680",40.1%,"3,875","$13,487","$130,179,072",3/20/2015
223,"I, Robot",https://www.boxofficemojo.com/movies/?id=irobot.htm,Fox,"$52,179,887",36.0%,"3,420","$15,257","$144,801,023",7/16/2004
224,Men in Black II,https://www.boxofficemojo.com/movies/?id=meninblack2.htm,Sony,"$52,148,751",27.4%,"3,557","$14,660","$190,418,803",7/3/2002
225,Home (2015),https://www.boxofficemojo.com/movies/?id=happysmekday.htm,Fox,"$52,107,731",29.4%,"3,708","$14,053","$177,397,510",3/27/2015
226,Van Helsing,https://www.boxofficemojo.com/movies/?id=vanhelsing.htm,Uni.,"$51,748,040",43.1%,"3,575","$14,474","$120,177,084",5/7/2004
227,8 Mile,https://www.boxofficemojo.com/movies/?id=8mile.htm,Uni.,"$51,240,555",43.9%,"2,470","$20,745","$116,750,901",11/8/2002
228,Men in Black,https://www.boxofficemojo.com/movies/?id=meninblack.htm,Sony,"$51,068,455",20.4%,"3,020","$16,910","$250,690,539",7/2/1997
229,Bohemian Rhapsody,https://www.boxofficemojo.com/movies/?id=bohemianrhapsody.htm,Fox,"$51,061,119",23.6%,"4,000","$12,765","$216,428,042",11/2/2018
230,Prometheus,https://www.boxofficemojo.com/movies/?id=prometheus.htm,Fox,"$51,050,101",40.4%,"3,396","$15,032","$126,477,084",6/8/2012
231,Wanted,https://www.boxofficemojo.com/movies/?id=wanted.htm,Uni.,"$50,927,085",37.9%,"3,175","$16,040","$134,508,551",6/27/2008
232,Coco,https://www.boxofficemojo.com/movies/?id=pixar1117.htm,BV,"$50,802,605",24.2%,"3,987","$12,742","$209,726,015",11/22/2017
233,Jurassic Park III,https://www.boxofficemojo.com/movies/?id=jurassicpark3.htm,Uni.,"$50,771,645",28.0%,"3,434","$14,784","$181,171,875",7/18/2001
234,The Village,https://www.boxofficemojo.com/movies/?id=village.htm,BV,"$50,746,142",44.4%,"3,730","$13,604","$114,197,520",7/30/2004
235,Dunkirk,https://www.boxofficemojo.com/movies/?id=chrisnolan2017.htm,WB,"$50,513,488",26.9%,"3,720","$13,579","$188,045,546",7/21/2017
236,2 Fast 2 Furious,https://www.boxofficemojo.com/movies/?id=2fast2furious.htm,Uni.,"$50,472,480",39.7%,"3,408","$14,810","$127,154,901",6/6/2003
237,Jackass 3-D,https://www.boxofficemojo.com/movies/?id=jackass3d.htm,Par.,"$50,353,641",43.0%,"3,081","$16,343","$117,229,692",10/15/2010
238,Mr. & Mrs. Smith,https://www.boxofficemojo.com/movies/?id=mrandmrssmith.htm,Fox,"$50,342,878",27.0%,"3,424","$14,702","$186,336,279",6/10/2005
239,Independence Day,https://www.boxofficemojo.com/movies/?id=independenceday.htm,Fox,"$50,228,264",16.4%,"2,882","$17,428","$306,169,268",7/3/1996
240,A Quiet Place,https://www.boxofficemojo.com/movies/?id=aquietplace.htm,Par.,"$50,203,562",26.7%,"3,508","$14,311","$188,024,361",4/6/2018
241,The Boss Baby,https://www.boxofficemojo.com/movies/?id=bossbaby.htm,Fox,"$50,198,902",28.7%,"3,773","$13,305","$175,003,033",3/31/2017
242,King Kong,https://www.boxofficemojo.com/movies/?id=kingkong05.htm,Uni.,"$50,130,145",23.0%,"3,568","$14,049","$218,080,025",12/14/2005
243,The Great Gatsby (2013),https://www.boxofficemojo.com/movies/?id=greatgatsby2012.htm,WB,"$50,085,185",34.6%,"3,535","$14,168","$144,840,419",5/10/2013
