﻿Rank,Title (click to view),Title (click to view)链接,Studio,Opening*,% of Total,Theaters,Avg.,Total Gross^,Date**
353,50 First Dates,https://www.boxofficemojo.com/movies/?id=50firstdates.htm,Sony,"$39,852,237",33.0%,"3,591","$11,097","$120,908,074",2/13/2004
354,The Revenant,https://www.boxofficemojo.com/movies/?id=revenant.htm,Fox,"$39,826,840",21.7%,"3,375","$11,801","$183,637,894",1/8/2016
355,Wild Hogs,https://www.boxofficemojo.com/movies/?id=wildhogs.htm,BV,"$39,699,023",23.6%,"3,287","$12,077","$168,273,550",3/2/2007
356,Sherlock Holmes: A Game of Shadows,https://www.boxofficemojo.com/movies/?id=sherlockholmes2.htm,WB,"$39,637,079",21.2%,"3,703","$10,704","$186,848,418",12/16/2011
357,The Waterboy,https://www.boxofficemojo.com/movies/?id=waterboy.htm,BV,"$39,414,071",24.4%,"2,664","$14,795","$161,491,646",11/6/1998
358,Rio 2,https://www.boxofficemojo.com/movies/?id=rio2.htm,Fox,"$39,327,869",29.9%,"3,948","$9,961","$131,538,435",4/11/2014
359,Rio,https://www.boxofficemojo.com/movies/?id=rio.htm,Fox,"$39,225,962",27.3%,"3,826","$10,252","$143,619,809",4/15/2011
360,Taken 3,https://www.boxofficemojo.com/movies/?id=taken3.htm,Fox,"$39,201,657",43.9%,"3,594","$10,908","$89,256,424",1/9/2015
361,The Break-Up,https://www.boxofficemojo.com/movies/?id=breakup.htm,Uni.,"$39,172,785",33.0%,"3,070","$12,759","$118,703,275",6/2/2006
362,The Good Dinosaur,https://www.boxofficemojo.com/movies/?id=pixar2013.htm,BV,"$39,155,217",31.8%,"3,749","$10,444","$123,087,120",11/25/2015
363,Ocean's Twelve,https://www.boxofficemojo.com/movies/?id=oceanstwelve.htm,WB,"$39,153,380",31.2%,"3,290","$11,900","$125,544,280",12/10/2004
364,The Grudge,https://www.boxofficemojo.com/movies/?id=grudge.htm,Sony,"$39,128,715",35.5%,"3,245","$12,058","$110,359,362",10/22/2004
365,Magic Mike,https://www.boxofficemojo.com/movies/?id=magicmike.htm,WB,"$39,127,170",34.4%,"2,930","$13,354","$113,721,571",6/29/2012
366,The Heat,https://www.boxofficemojo.com/movies/?id=bullockmccarthy.htm,Fox,"$39,115,043",24.5%,"3,181","$12,296","$159,582,188",6/28/2013
367,Kingsman: The Golden Circle,https://www.boxofficemojo.com/movies/?id=kingsman2.htm,Fox,"$39,023,010",38.9%,"4,003","$9,748","$100,234,838",9/22/2017
368,Dinosaur,https://www.boxofficemojo.com/movies/?id=dinosaur.htm,BV,"$38,854,851",28.2%,"3,257","$11,929","$137,748,063",5/19/2000
369,Daddy's Home,https://www.boxofficemojo.com/movies/?id=daddyshome.htm,Par.,"$38,740,203",25.8%,"3,271","$11,844","$150,357,137",12/25/2015
370,Get Smart,https://www.boxofficemojo.com/movies/?id=getsmart.htm,WB,"$38,683,480",29.7%,"3,911","$9,891","$130,319,208",6/20/2008
371,Fifty Shades Freed,https://www.boxofficemojo.com/movies/?id=fiftyshadesfreed.htm,Uni.,"$38,560,195",38.4%,"3,768","$10,234","$100,407,760",2/9/2018
372,You Don't Mess with the Zohan,https://www.boxofficemojo.com/movies/?id=youdontmesswiththezohan.htm,Sony,"$38,531,374",38.5%,"3,462","$11,130","$100,018,837",6/6/2008
373,The Legend of Tarzan,https://www.boxofficemojo.com/movies/?id=tarzan2016.htm,WB,"$38,527,856",30.4%,"3,561","$10,819","$126,643,061",7/1/2016
374,Over the Hedge,https://www.boxofficemojo.com/movies/?id=overthehedge.htm,P/DW,"$38,457,003",24.8%,"4,059","$9,474","$155,019,340",5/19/2006
375,The Cat in the Hat,https://www.boxofficemojo.com/movies/?id=catinthehat.htm,Uni.,"$38,329,160",37.9%,"3,464","$11,065","$101,149,285",11/21/2003
376,Alien Vs. Predator,https://www.boxofficemojo.com/movies/?id=avp.htm,Fox,"$38,291,056",47.7%,"3,395","$11,279","$80,282,231",8/13/2004
377,The Angry Birds Movie,https://www.boxofficemojo.com/movies/?id=angrybirds.htm,Sony,"$38,155,177",35.5%,"3,932","$9,704","$107,509,366",5/20/2016
378,The Bourne Legacy,https://www.boxofficemojo.com/movies/?id=bourne4.htm,Uni.,"$38,142,825",33.7%,"3,745","$10,185","$113,203,870",8/10/2012
379,Ocean's Eleven,https://www.boxofficemojo.com/movies/?id=oceanseleven.htm,WB,"$38,107,822",20.8%,"3,075","$12,392","$183,417,150",12/7/2001
380,Rango,https://www.boxofficemojo.com/movies/?id=rango.htm,Par.,"$38,079,323",30.8%,"3,917","$9,722","$123,477,607",3/4/2011
381,Inglourious Basterds,https://www.boxofficemojo.com/movies/?id=inglouriousbasterds.htm,Wein.,"$38,054,676",31.6%,"3,165","$12,024","$120,540,719",8/21/2009
382,Bee Movie,https://www.boxofficemojo.com/movies/?id=beemovie.htm,P/DW,"$38,021,044",30.0%,"3,928","$9,679","$126,631,277",11/2/2007
383,Lone Survivor,https://www.boxofficemojo.com/movies/?id=lonesurvivor.htm,Uni.,"$37,849,910",30.3%,"2,875","$13,165","$125,095,601",1/10/2014
384,Ace Ventura: When Nature Calls,https://www.boxofficemojo.com/movies/?id=aceventura2.htm,WB,"$37,804,076",34.9%,"2,652","$14,254","$108,385,533",11/10/1995
385,Charlie's Angels: Full Throttle,https://www.boxofficemojo.com/movies/?id=charliesangels2.htm,Sony,"$37,634,221",37.3%,"3,459","$10,880","$100,830,111",6/27/2003
386,Hop,https://www.boxofficemojo.com/movies/?id=ihop.htm,Uni.,"$37,543,710",34.7%,"3,579","$10,490","$108,085,305",4/1/2011
387,Gone Girl,https://www.boxofficemojo.com/movies/?id=gonegirl.htm,Fox,"$37,513,109",22.4%,"3,014","$12,446","$167,767,189",10/3/2014
388,District 9,https://www.boxofficemojo.com/movies/?id=district9.htm,TriS,"$37,354,308",32.3%,"3,049","$12,251","$115,646,235",8/14/2009
389,Pacific Rim,https://www.boxofficemojo.com/movies/?id=pacificrim.htm,WB,"$37,285,325",36.6%,"3,275","$11,385","$101,802,906",7/12/2013
390,Mr. Deeds,https://www.boxofficemojo.com/movies/?id=mrdeeds.htm,Sony,"$37,162,787",29.4%,"3,231","$11,501","$126,293,452",6/28/2002
391,Annabelle,https://www.boxofficemojo.com/movies/?id=newlinehorror.htm,WB (NL),"$37,134,255",44.1%,"3,185","$11,659","$84,273,813",10/3/2014
392,Air Force One,https://www.boxofficemojo.com/movies/?id=airforceone.htm,Sony,"$37,132,505",21.5%,"2,919","$12,720","$172,956,409",7/25/1997
393,S.W.A.T.,https://www.boxofficemojo.com/movies/?id=swat.htm,Sony,"$37,062,535",31.7%,"3,202","$11,574","$116,934,650",8/8/2003
394,Oblivion,https://www.boxofficemojo.com/movies/?id=oblivion.htm,Uni.,"$37,054,485",41.6%,"3,783","$9,795","$89,107,235",4/19/2013
395,Red Dragon,https://www.boxofficemojo.com/movies/?id=reddragon.htm,Uni.,"$36,540,945",39.2%,"3,357","$10,885","$93,149,898",10/4/2002
396,Cowboys & Aliens,https://www.boxofficemojo.com/movies/?id=cowboysandaliens.htm,Uni.,"$36,431,290",36.3%,"3,750","$9,715","$100,240,551",7/29/2011
397,Freddy Vs. Jason,https://www.boxofficemojo.com/movies/?id=freddyvsjason.htm,NL,"$36,428,066",44.1%,"3,014","$12,086","$82,622,655",8/15/2003
398,Interview with the Vampire,https://www.boxofficemojo.com/movies/?id=interviewwiththevampire.htm,WB,"$36,389,705",34.6%,"2,604","$13,975","$105,264,608",11/11/1994
399,Marley and Me,https://www.boxofficemojo.com/movies/?id=marleyandme.htm,Fox,"$36,357,586",25.4%,"3,480","$10,448","$143,153,751",12/25/2008
400,21 Jump Street,https://www.boxofficemojo.com/movies/?id=21jumpstreet.htm,Sony,"$36,302,612",26.2%,"3,121","$11,632","$138,447,667",3/16/2012
401,Kingsman: The Secret Service,https://www.boxofficemojo.com/movies/?id=secretservice.htm,Fox,"$36,206,331",28.2%,"3,204","$11,300","$128,261,724",2/13/2015
402,Jumanji: Welcome to the Jungle,https://www.boxofficemojo.com/movies/?id=jumanji2016.htm,Sony,"$36,169,328",8.9%,"3,765","$9,607","$404,515,480",12/20/2017
403,Alien: Covenant,https://www.boxofficemojo.com/movies/?id=alienparadiselost.htm,Fox,"$36,160,621",48.7%,"3,761","$9,615","$74,262,031",5/19/2017
404,Ocean's Thirteen,https://www.boxofficemojo.com/movies/?id=oceans13.htm,WB,"$36,133,403",30.8%,"3,565","$10,135","$117,154,724",6/8/2007
405,Dumb and Dumber To,https://www.boxofficemojo.com/movies/?id=dumberto.htm,Uni.,"$36,111,775",41.9%,"3,154","$11,450","$86,208,010",11/14/2014
406,Armageddon,https://www.boxofficemojo.com/movies/?id=armageddon.htm,BV,"$36,089,972",17.9%,"3,127","$11,541","$201,578,182",7/1/1998
407,The Scorpion King,https://www.boxofficemojo.com/movies/?id=scorpionking.htm,Uni.,"$36,075,875",39.6%,"3,444","$10,474","$91,047,077",4/19/2002
408,Robin Hood,https://www.boxofficemojo.com/movies/?id=nottingham.htm,Uni.,"$36,063,385",34.3%,"3,503","$10,295","$105,269,730",5/14/2010
409,Robots,https://www.boxofficemojo.com/movies/?id=robots.htm,Fox,"$36,045,301",28.1%,"3,776","$9,545","$128,200,012",3/11/2005
410,The Equalizer 2,https://www.boxofficemojo.com/movies/?id=theequalizer2.htm,Sony,"$36,011,640",35.3%,"3,388","$10,629","$102,084,362",7/20/2018
411,Salt,https://www.boxofficemojo.com/movies/?id=salt10.htm,Sony,"$36,011,243",30.4%,"3,612","$9,970","$118,311,368",7/23/2010
412,Star Wars (Special Edition),https://www.boxofficemojo.com/movies/?id=starwars4se.htm,Fox,"$35,906,661",26.0%,"2,104","$17,065","$138,257,865",1/31/1997
413,"10,000 B.C.",https://www.boxofficemojo.com/movies/?id=10000bc.htm,WB,"$35,867,488",37.8%,"3,410","$10,518","$94,784,201",3/7/2008
414,Rampage (2018),https://www.boxofficemojo.com/movies/?id=newlinetentpole2018.htm,WB (NL),"$35,753,093",35.4%,"4,101","$8,718","$101,028,233",4/13/2018
415,Minority Report,https://www.boxofficemojo.com/movies/?id=minorityreport.htm,Fox,"$35,677,125",27.0%,"3,001","$11,888","$132,072,926",6/21/2002
416,Sweet Home Alabama,https://www.boxofficemojo.com/movies/?id=sweethomealabama.htm,BV,"$35,648,740",28.0%,"3,293","$10,825","$127,223,418",9/27/2002
417,The Smurfs,https://www.boxofficemojo.com/movies/?id=smurfs.htm,Sony,"$35,611,637",25.0%,"3,395","$10,489","$142,614,158",7/29/2011
418,Creed II,https://www.boxofficemojo.com/movies/?id=creed2.htm,MGM,"$35,574,710",30.7%,"3,441","$10,338","$115,715,889",11/21/2018
419,Battle: Los Angeles,https://www.boxofficemojo.com/movies/?id=battlelosangeles.htm,Sony,"$35,573,187",42.6%,"3,417","$10,411","$83,552,429",3/11/2011
420,The Other Guys,https://www.boxofficemojo.com/movies/?id=ferrellwahlberg2010.htm,Sony,"$35,543,162",29.8%,"3,651","$9,735","$119,219,978",8/6/2010
421,Central Intelligence,https://www.boxofficemojo.com/movies/?id=centralintelligence.htm,WB (NL),"$35,535,250",27.9%,"3,508","$10,130","$127,440,871",6/17/2016
422,The World Is Not Enough,https://www.boxofficemojo.com/movies/?id=worldisnotenough.htm,MGM,"$35,519,007",28.0%,"3,163","$11,229","$126,943,684",11/19/1999
423,Super 8,https://www.boxofficemojo.com/movies/?id=super8.htm,Par.,"$35,451,168",27.9%,"3,379","$10,492","$127,004,179",6/10/2011
424,Spider-Man: Into The Spider-Verse,https://www.boxofficemojo.com/movies/?id=animatedspider-man.htm,Sony,"$35,363,376",18.6%,"3,813","$9,274","$190,241,310",12/14/2018
425,Teenage Mutant Ninja Turtles: Out of the Shadows,https://www.boxofficemojo.com/movies/?id=tmnt2016.htm,Par.,"$35,316,382",43.0%,"4,071","$8,675","$82,051,601",6/3/2016
426,Lilo & Stitch,https://www.boxofficemojo.com/movies/?id=lilostitch.htm,BV,"$35,260,212",24.2%,"3,191","$11,049","$145,794,338",6/21/2002
427,Sing,https://www.boxofficemojo.com/movies/?id=illumination2016.htm,Uni.,"$35,258,145",13.0%,"4,022","$8,766","$270,395,425",12/21/2016
428,Ride Along 2,https://www.boxofficemojo.com/movies/?id=ridealong2.htm,Uni.,"$35,243,095",38.6%,"3,175","$11,100","$91,221,830",1/15/2016
429,National Treasure,https://www.boxofficemojo.com/movies/?id=nationaltreasure.htm,BV,"$35,142,554",20.3%,"3,017","$11,648","$173,008,894",11/19/2004
430,The Ring Two,https://www.boxofficemojo.com/movies/?id=ring2.htm,DW,"$35,065,237",46.0%,"3,332","$10,523","$76,231,249",3/18/2005
431,Runaway Bride,https://www.boxofficemojo.com/movies/?id=runawaybride.htm,Par.,"$35,055,556",23.0%,"3,158","$11,100","$152,257,509",7/30/1999
432,Sully,https://www.boxofficemojo.com/movies/?id=sully.htm,WB,"$35,028,301",28.0%,"3,525","$9,937","$125,070,033",9/9/2016
433,Annabelle: Creation,https://www.boxofficemojo.com/movies/?id=annabelle2.htm,WB (NL),"$35,006,404",34.3%,"3,502","$9,996","$102,092,201",8/11/2017
434,Mamma Mia! Here We Go Again,https://www.boxofficemojo.com/movies/?id=mammamia2.htm,Uni.,"$34,952,180",29.0%,"3,317","$10,537","$120,634,935",7/20/2018
435,The Expendables,https://www.boxofficemojo.com/movies/?id=expendables.htm,LGF,"$34,825,135",33.8%,"3,270","$10,650","$103,068,524",8/13/2010
436,Gladiator,https://www.boxofficemojo.com/movies/?id=gladiator.htm,DW,"$34,819,017",18.5%,"2,938","$11,851","$187,705,427",5/5/2000
437,Scream 3,https://www.boxofficemojo.com/movies/?id=scream3.htm,Dim.,"$34,713,342",38.9%,"3,467","$10,012","$89,143,175",2/4/2000
438,The Magnificent Seven (2016),https://www.boxofficemojo.com/movies/?id=themagnificentseven.htm,Sony,"$34,703,397",37.1%,"3,674","$9,446","$93,432,655",9/23/2016
439,Identity Thief,https://www.boxofficemojo.com/movies/?id=identitythief.htm,Uni.,"$34,551,025",25.7%,"3,141","$11,000","$134,506,920",2/8/2013
440,Hellboy II: The Golden Army,https://www.boxofficemojo.com/movies/?id=hellboy2.htm,Uni.,"$34,539,115",45.5%,"3,204","$10,780","$75,986,503",7/11/2008
441,Enchanted,https://www.boxofficemojo.com/movies/?id=enchanted.htm,BV,"$34,440,317",26.9%,"3,730","$9,233","$127,807,262",11/21/2007
442,Couples Retreat,https://www.boxofficemojo.com/movies/?id=couplesretreat.htm,Uni.,"$34,286,740",31.4%,"3,000","$11,429","$109,204,945",10/9/2009
443,Sausage Party,https://www.boxofficemojo.com/movies/?id=sausageparty.htm,Sony,"$34,263,534",35.1%,"3,103","$11,042","$97,685,686",8/12/2016
444,I Now Pronounce You Chuck and Larry,https://www.boxofficemojo.com/movies/?id=chuckandlarry.htm,Uni.,"$34,233,750",28.5%,"3,495","$9,795","$120,059,556",7/20/2007
445,Tarzan,https://www.boxofficemojo.com/movies/?id=tarzan.htm,BV,"$34,221,968",20.0%,"3,005","$11,388","$171,091,819",6/16/1999
446,Ransom,https://www.boxofficemojo.com/movies/?id=ransom.htm,BV,"$34,216,088",25.1%,"2,676","$12,786","$136,492,681",11/8/1996
447,Norbit,https://www.boxofficemojo.com/movies/?id=norbit.htm,P/DW,"$34,195,434",35.7%,"3,136","$10,904","$95,673,607",2/9/2007
448,The Equalizer,https://www.boxofficemojo.com/movies/?id=equalizer.htm,Sony,"$34,137,828",33.6%,"3,236","$10,549","$101,530,738",9/26/2014
449,The Blind Side,https://www.boxofficemojo.com/movies/?id=blindside.htm,WB,"$34,119,372",13.3%,"3,110","$10,971","$255,959,475",11/20/2009
450,The LEGO Movie 2: The Second Part,https://www.boxofficemojo.com/movies/?id=warneranimated0518.htm,WB,"$34,115,335",32.2%,"4,303","$7,928","$105,806,508",2/8/2019
451,Puss in Boots,https://www.boxofficemojo.com/movies/?id=pussinboots12.htm,P/DW,"$34,077,439",22.8%,"3,952","$8,623","$149,260,504",10/28/2011
452,The Purge,https://www.boxofficemojo.com/movies/?id=purge.htm,Uni.,"$34,058,360",52.8%,"2,536","$13,430","$64,473,115",6/7/2013
453,Lethal Weapon 4,https://www.boxofficemojo.com/movies/?id=lethalweapon4.htm,WB,"$34,048,124",26.1%,"3,117","$10,923","$130,444,603",7/10/1998
454,Cloudy with a Chance of Meatballs 2,https://www.boxofficemojo.com/movies/?id=cloudy2.htm,Sony,"$34,017,930",28.4%,"4,001","$8,502","$119,793,567",9/27/2013
455,Wedding Crashers,https://www.boxofficemojo.com/movies/?id=weddingcrashers.htm,NL,"$33,900,720",16.2%,"2,925","$11,589","$209,255,921",7/15/2005
456,Get Hard,https://www.boxofficemojo.com/movies/?id=gethard.htm,WB,"$33,803,253",37.4%,"3,175","$10,647","$90,411,453",3/27/2015
457,The Devil Inside,https://www.boxofficemojo.com/movies/?id=devilinside.htm,Par.,"$33,732,515",63.3%,"2,285","$14,763","$53,261,944",1/6/2012
458,Think Like a Man,https://www.boxofficemojo.com/movies/?id=thinklikeaman.htm,SGem,"$33,636,303",36.7%,"2,015","$16,693","$91,547,205",4/20/2012
459,The Proposal,https://www.boxofficemojo.com/movies/?id=proposal.htm,BV,"$33,627,598",20.5%,"3,056","$11,004","$163,958,031",6/19/2009
460,What Women Want,https://www.boxofficemojo.com/movies/?id=whatwomenwant.htm,Par.,"$33,614,543",18.4%,"3,012","$11,160","$182,811,707",12/15/2000
461,Saw III,https://www.boxofficemojo.com/movies/?id=saw3.htm,LGF,"$33,610,391",41.9%,"3,167","$10,612","$80,238,724",10/27/2006
462,Epic,https://www.boxofficemojo.com/movies/?id=leafmen.htm,Fox,"$33,531,068",31.2%,"3,882","$8,638","$107,518,682",5/24/2013
463,The Green Hornet,https://www.boxofficemojo.com/movies/?id=greenhornet.htm,Sony,"$33,526,876",33.9%,"3,584","$9,355","$98,780,042",1/14/2011
464,Ted 2,https://www.boxofficemojo.com/movies/?id=ted2.htm,Uni.,"$33,507,870",41.1%,"3,442","$9,735","$81,476,385",6/26/2015
465,101 Dalmatians (1996),https://www.boxofficemojo.com/movies/?id=101dalmatiansliveaction.htm,BV,"$33,504,025",24.6%,"2,794","$11,991","$136,189,294",11/27/1996
466,Wrath of the Titans,https://www.boxofficemojo.com/movies/?id=clashofthetitans2.htm,WB,"$33,457,188",40.0%,"3,545","$9,438","$83,670,083",3/30/2012
467,The Haunting,https://www.boxofficemojo.com/movies/?id=haunting.htm,DW,"$33,435,140",36.6%,"2,808","$11,907","$91,411,151",7/23/1999
468,Spy Kids 3D: Game Over,https://www.boxofficemojo.com/movies/?id=spykids3.htm,Dim.,"$33,417,739",29.9%,"3,344","$9,993","$111,761,982",7/25/2003
469,Get Out,https://www.boxofficemojo.com/movies/?id=blumhouse2.htm,Uni.,"$33,377,060",19.0%,"2,781","$12,002","$176,040,665",2/24/2017
470,Live Free or Die Hard,https://www.boxofficemojo.com/movies/?id=diehard4.htm,Fox,"$33,369,559",24.8%,"3,408","$9,791","$134,529,403",6/27/2007
471,American Wedding,https://www.boxofficemojo.com/movies/?id=americanwedding.htm,Uni.,"$33,369,440",31.9%,"3,172","$10,520","$104,565,114",8/1/2003
472,A Bug's Life,https://www.boxofficemojo.com/movies/?id=bugslife.htm,BV,"$33,258,052",20.4%,"2,686","$12,382","$162,798,565",11/25/1998
473,Lethal Weapon 3,https://www.boxofficemojo.com/movies/?id=lethalweapon3.htm,WB,"$33,243,086",23.0%,"2,510","$13,244","$144,731,527",5/15/1992
474,A Wrinkle in Time,https://www.boxofficemojo.com/movies/?id=ladisneyfairytale22018.htm,BV,"$33,123,609",33.0%,"3,980","$8,323","$100,478,608",3/9/2018
475,Superbad,https://www.boxofficemojo.com/movies/?id=superbad.htm,Sony,"$33,052,411",27.2%,"2,948","$11,212","$121,463,226",8/17/2007
476,Tomorrowland,https://www.boxofficemojo.com/movies/?id=1952.htm,BV,"$33,028,165",35.3%,"3,972","$8,315","$93,436,322",5/22/2015
477,Blades of Glory,https://www.boxofficemojo.com/movies/?id=bladesofglory.htm,P/DW,"$33,014,202",27.8%,"3,372","$9,790","$118,594,548",3/30/2007
478,Rush Hour,https://www.boxofficemojo.com/movies/?id=rushhour.htm,NL,"$33,001,803",23.4%,"2,638","$12,510","$141,186,864",9/18/1998
479,Scream 2,https://www.boxofficemojo.com/movies/?id=scream2.htm,Dim.,"$32,926,342",32.5%,"2,663","$12,364","$101,363,301",12/12/1997
480,A Nightmare on Elm Street (2010),https://www.boxofficemojo.com/movies/?id=nightmareonelmstreet10.htm,WB (NL),"$32,902,299",52.2%,"3,332","$9,875","$63,075,011",4/30/2010
481,The Book of Eli,https://www.boxofficemojo.com/movies/?id=bookofeli.htm,WB,"$32,789,494",34.6%,"3,111","$10,540","$94,835,059",1/15/2010
482,Blade Runner 2049,https://www.boxofficemojo.com/movies/?id=bladerunnersequel.htm,WB,"$32,753,122",35.6%,"4,058","$8,071","$92,054,159",10/6/2017
483,Where the Wild Things Are,https://www.boxofficemojo.com/movies/?id=wherethewildthingsare.htm,WB,"$32,695,407",42.3%,"3,735","$8,754","$77,233,467",10/16/2009
484,Due Date,https://www.boxofficemojo.com/movies/?id=duedate.htm,WB,"$32,689,406",32.5%,"3,355","$9,743","$100,539,043",11/5/2010
485,Blade II,https://www.boxofficemojo.com/movies/?id=blade2.htm,NL,"$32,528,016",39.5%,"2,707","$12,016","$82,348,319",3/22/2002
486,The Maze Runner,https://www.boxofficemojo.com/movies/?id=mazerunner.htm,Fox,"$32,512,804",31.7%,"3,604","$9,021","$102,427,862",9/19/2014
487,Hannah Montana The Movie,https://www.boxofficemojo.com/movies/?id=hannahmontanamovie.htm,BV,"$32,324,487",40.6%,"3,118","$10,367","$79,576,189",4/10/2009
488,Mr. Peabody & Sherman,https://www.boxofficemojo.com/movies/?id=mrpeabodyandsherman.htm,Fox,"$32,207,057",28.9%,"3,934","$8,187","$111,506,430",3/7/2014
489,Immortals,https://www.boxofficemojo.com/movies/?id=warofgods.htm,Rela.,"$32,206,425",38.6%,"3,112","$10,349","$83,504,017",11/11/2011
490,Jackass Presents: Bad Grandpa,https://www.boxofficemojo.com/movies/?id=badgrandpa.htm,Par.,"$32,055,177",31.4%,"3,336","$9,609","$102,003,019",10/25/2013
491,The SpongeBob SquarePants Movie,https://www.boxofficemojo.com/movies/?id=spongebob.htm,Par.,"$32,018,216",37.5%,"3,212","$9,968","$85,417,988",11/19/2004
492,Paul Blart: Mall Cop,https://www.boxofficemojo.com/movies/?id=mallcop.htm,Sony,"$31,832,636",21.8%,"3,144","$10,125","$146,336,178",1/16/2009
493,Terminator 2: Judgment Day,https://www.boxofficemojo.com/movies/?id=terminator2.htm,TriS,"$31,765,506",15.5%,"2,274","$13,969","$204,843,345",7/3/1991
494,Saw IV,https://www.boxofficemojo.com/movies/?id=saw4.htm,LGF,"$31,756,764",50.2%,"3,183","$9,976","$63,300,095",10/26/2007
495,Saw II,https://www.boxofficemojo.com/movies/?id=saw2.htm,Lions,"$31,725,652",36.4%,"2,949","$10,758","$87,039,965",10/28/2005
496,G-Force,https://www.boxofficemojo.com/movies/?id=g-force.htm,BV,"$31,706,934",26.5%,"3,697","$8,576","$119,436,770",7/24/2009
497,The Mummy (2017),https://www.boxofficemojo.com/movies/?id=mummy2016.htm,Uni.,"$31,688,375",39.5%,"4,035","$7,853","$80,227,895",6/9/2017
498,Bad Teacher,https://www.boxofficemojo.com/movies/?id=badteacher.htm,Sony,"$31,603,106",31.5%,"3,049","$10,365","$100,292,856",6/24/2011
499,The Truman Show,https://www.boxofficemojo.com/movies/?id=trumanshow.htm,Par.,"$31,542,121",25.1%,"2,315","$13,625","$125,618,201",6/5/1998
500,The Purge: Election Year,https://www.boxofficemojo.com/movies/?id=purge3.htm,Uni.,"$31,515,110",39.8%,"2,796","$11,271","$79,213,375",7/1/2016
501,The Wolfman,https://www.boxofficemojo.com/movies/?id=wolfman.htm,Uni.,"$31,479,235",50.8%,"3,222","$9,770","$61,979,680",2/12/2010
502,Liar Liar,https://www.boxofficemojo.com/movies/?id=liarliar.htm,Uni.,"$31,423,025",17.3%,"2,845","$11,045","$181,410,615",3/21/1997
503,Percy Jackson & The Olympians: The Lightning Thief,https://www.boxofficemojo.com/movies/?id=percyjackson.htm,Fox,"$31,236,067",35.2%,"3,356","$9,308","$88,768,303",2/12/2010
504,Girls Trip,https://www.boxofficemojo.com/movies/?id=girltrip.htm,Uni.,"$31,201,920",27.1%,"2,591","$12,042","$115,171,585",7/21/2017
505,Evan Almighty,https://www.boxofficemojo.com/movies/?id=evanalmighty.htm,Uni.,"$31,192,615",31.0%,"3,604","$8,654","$100,462,298",6/22/2007
506,The Sum of All Fears,https://www.boxofficemojo.com/movies/?id=sumofallfears.htm,Par.,"$31,178,526",26.2%,"3,183","$9,795","$118,907,036",5/31/2002
507,Home Alone 2: Lost in New York,https://www.boxofficemojo.com/movies/?id=homealone2.htm,Fox,"$31,126,882",17.9%,"2,222","$14,008","$173,585,516",11/20/1992
508,Hannah Montana/Miley Cyrus: Best of Both Worlds Concert Tour,https://www.boxofficemojo.com/movies/?id=hannahmontanaconcert.htm,BV,"$31,117,834",47.7%,683,"$45,561","$65,281,781",2/1/2008
509,Elf,https://www.boxofficemojo.com/movies/?id=elf.htm,NL,"$31,113,501",17.9%,"3,337","$9,323","$173,398,518",11/7/2003
510,Bringing Down the House,https://www.boxofficemojo.com/movies/?id=bringingdownthehouse.htm,BV,"$31,101,026",23.4%,"2,801","$11,103","$132,716,677",3/7/2003
511,Four Christmases,https://www.boxofficemojo.com/movies/?id=fourchristmases.htm,WB (NL),"$31,069,826",25.9%,"3,310","$9,387","$120,146,040",11/26/2008
512,Into the Woods,https://www.boxofficemojo.com/movies/?id=intothewoods.htm,BV,"$31,051,923",24.3%,"2,440","$12,726","$128,002,372",12/25/2014
513,Pokemon: The First Movie,https://www.boxofficemojo.com/movies/?id=pokemon1.htm,WB,"$31,036,678",36.2%,"3,043","$10,199","$85,744,662",11/10/1999
514,Sex and the City 2,https://www.boxofficemojo.com/movies/?id=sexandthecity2.htm,WB (NL),"$31,001,870",32.5%,"3,445","$8,999","$95,347,692",5/27/2010
515,Step Brothers,https://www.boxofficemojo.com/movies/?id=stepbrothers.htm,Sony,"$30,940,732",30.8%,"3,094","$10,000","$100,468,793",7/25/2008
516,Little Fockers,https://www.boxofficemojo.com/movies/?id=meetthefockerssequel.htm,Uni.,"$30,833,665",20.8%,"3,536","$8,720","$148,438,600",12/22/2010
517,Star Trek: First Contact,https://www.boxofficemojo.com/movies/?id=startrek8.htm,Par.,"$30,716,131",33.4%,"2,812","$10,923","$92,027,888",11/22/1996
518,Knocked Up,https://www.boxofficemojo.com/movies/?id=knockedup.htm,Uni.,"$30,690,990",20.6%,"2,871","$10,690","$148,768,917",6/1/2007
519,The Dukes of Hazzard,https://www.boxofficemojo.com/movies/?id=dukesofhazzard.htm,WB,"$30,675,314",38.2%,"3,785","$8,104","$80,270,227",8/5/2005
520,Unbroken,https://www.boxofficemojo.com/movies/?id=unbroken.htm,Uni.,"$30,621,445",26.5%,"3,131","$9,780","$115,637,895",12/25/2014
521,Bruno,https://www.boxofficemojo.com/movies/?id=bruno.htm,Uni.,"$30,619,130",51.0%,"2,756","$11,110","$60,054,530",7/10/2009
522,Saving Private Ryan,https://www.boxofficemojo.com/movies/?id=savingprivateryan.htm,DW,"$30,576,104",14.1%,"2,463","$12,414","$216,540,909",7/24/1998
523,The Pacifier,https://www.boxofficemojo.com/movies/?id=pacifier.htm,BV,"$30,552,694",27.0%,"3,131","$9,758","$113,086,868",3/4/2005
524,Bram Stoker's Dracula,https://www.boxofficemojo.com/movies/?id=bramstokersdracula.htm,Col.,"$30,521,679",37.0%,"2,491","$12,252","$82,522,790",11/13/1992
525,The Happening,https://www.boxofficemojo.com/movies/?id=happening.htm,Fox,"$30,517,109",47.3%,"2,986","$10,220","$64,506,874",6/13/2008
526,Just Go With It,https://www.boxofficemojo.com/movies/?id=thepretendwife.htm,Sony,"$30,514,732",29.6%,"3,548","$8,601","$103,028,109",2/11/2011
527,The Day the Earth Stood Still (2008),https://www.boxofficemojo.com/movies/?id=daytheearthstoodstill08.htm,Fox,"$30,480,153",38.4%,"3,560","$8,562","$79,366,978",12/12/2008
528,Dear John,https://www.boxofficemojo.com/movies/?id=dearjohn.htm,SGem,"$30,468,614",38.1%,"2,969","$10,262","$80,014,842",2/5/2010
529,John Wick: Chapter Two,https://www.boxofficemojo.com/movies/?id=johnwick2.htm,LG/S,"$30,436,123",33.1%,"3,113","$9,777","$92,029,184",2/10/2017
530,Night at the Museum,https://www.boxofficemojo.com/movies/?id=nightatthemuseum.htm,Fox,"$30,433,781",12.1%,"3,685","$8,258","$250,863,268",12/22/2006
531,Olympus Has Fallen,https://www.boxofficemojo.com/movies/?id=olympushasfallen.htm,FD,"$30,373,794",30.7%,"3,098","$9,804","$98,925,640",3/22/2013
532,Unbreakable,https://www.boxofficemojo.com/movies/?id=unbreakable.htm,BV,"$30,330,771",31.9%,"2,708","$11,200","$95,011,339",11/22/2000
533,Maze Runner: The Scorch Trials,https://www.boxofficemojo.com/movies/?id=mazerunner2.htm,Fox,"$30,316,510",37.1%,"3,791","$7,997","$81,697,192",9/18/2015
534,Cloudy with a Chance of Meatballs,https://www.boxofficemojo.com/movies/?id=cloudywithachanceofmeatballs.htm,Sony,"$30,304,648",24.3%,"3,119","$9,716","$124,870,275",9/18/2009
535,America's Sweethearts,https://www.boxofficemojo.com/movies/?id=americassweethearts.htm,SonR,"$30,181,877",32.2%,"3,011","$10,023","$93,607,673",7/20/2001
536,John Carter,https://www.boxofficemojo.com/movies/?id=johncarterofmars.htm,BV,"$30,180,188",41.3%,"3,749","$8,050","$73,078,100",3/9/2012
537,The Lion King (in 3D),https://www.boxofficemojo.com/movies/?id=lionking3d.htm,BV,"$30,151,614",32.0%,"2,330","$12,941","$94,242,001",9/16/2011
538,The X-Files,https://www.boxofficemojo.com/movies/?id=x-filesfightthefuture.htm,Fox,"$30,138,758",35.9%,"2,629","$11,464","$83,898,313",6/19/1998
539,Django Unchained,https://www.boxofficemojo.com/movies/?id=djangounchained.htm,Wein.,"$30,122,888",18.5%,"3,010","$10,008","$162,805,434",12/25/2012
540,The Best Man Holiday,https://www.boxofficemojo.com/movies/?id=bestman2.htm,Uni.,"$30,107,555",42.7%,"2,024","$14,875","$70,525,195",11/15/2013
541,Trainwreck,https://www.boxofficemojo.com/movies/?id=trainwreck15.htm,Uni.,"$30,097,040",27.3%,"3,158","$9,530","$110,212,700",7/17/2015
542,Prince of Persia: The Sands of Time,https://www.boxofficemojo.com/movies/?id=princeofpersia.htm,BV,"$30,095,259",33.2%,"3,646","$8,254","$90,759,676",5/28/2010
543,DodgeBall: A True Underdog Story,https://www.boxofficemojo.com/movies/?id=dodgeball.htm,Fox,"$30,070,196",26.3%,"2,694","$11,161","$114,326,736",6/18/2004
544,Lemony Snicket's A Series of Unfortunate Events,https://www.boxofficemojo.com/movies/?id=lemonysnicket.htm,Par.,"$30,061,756",25.3%,"3,620","$8,304","$118,634,549",12/17/2004
545,Sleepy Hollow,https://www.boxofficemojo.com/movies/?id=sleepyhollow.htm,Par.,"$30,060,467",29.7%,"3,064","$9,810","$101,071,502",11/19/1999
546,Panic Room,https://www.boxofficemojo.com/movies/?id=panicroom.htm,Sony,"$30,056,751",31.2%,"3,053","$9,844","$96,397,334",3/29/2002
547,The Exorcism of Emily Rose,https://www.boxofficemojo.com/movies/?id=exorcismofemilyrose.htm,SGem,"$30,054,300",40.0%,"2,981","$10,081","$75,072,454",9/9/2005
548,Saw V,https://www.boxofficemojo.com/movies/?id=saw5.htm,LGF,"$30,053,954",53.0%,"3,060","$9,822","$56,746,769",10/24/2008
549,Catch Me If You Can,https://www.boxofficemojo.com/movies/?id=catchmeifyoucan.htm,DW,"$30,053,627",18.3%,"3,156","$9,522","$164,615,351",12/25/2002
550,A Christmas Carol (2009),https://www.boxofficemojo.com/movies/?id=christmascarol09.htm,BV,"$30,051,075",21.8%,"3,683","$8,159","$137,855,863",11/6/2009
551,Tyler Perry's Madea's Family Reunion,https://www.boxofficemojo.com/movies/?id=madeasfamilyreunion.htm,LGF,"$30,030,661",47.5%,"2,194","$13,687","$63,257,940",2/24/2006
