{
	"info": {
		"_postman_id": "9a1fce7a-97de-4a83-8a90-3ee59f04f61c",
		"name": "MasterAcademyAsana",
		"schema": "https://schema.getpostman.com/json/collection/v2.1.0/collection.json"
	},
	"item": [
		{
			"name": "Get multiple projects",
			"protocolProfileBehavior": {
				"disableBodyPruning": true
			},
			"request": {
				"auth": {
					"type": "bearer",
					"bearer": [
						{
							"key": "token",
							"value": "0/10319618feef414db90cbec591926a9e",
							"type": "string"
						}
					]
				},
				"method": "GET",
				"header": [
					{
						"key": "Content-Type",
						"name": "Content-Type",
						"value": "application/json",
						"type": "text"
					}
				],
				"body": {
					"mode": "raw",
					"raw": ""
				},
				"url": {
					"raw": "https://app.asana.com/api/1.0/projects",
					"protocol": "https",
					"host": [
						"app",
						"asana",
						"com"
					],
					"path": [
						"api",
						"1.0",
						"projects"
					]
				}
			},
			"response": []
		},
		{
			"name": "Get workspaces",
			"protocolProfileBehavior": {
				"disableBodyPruning": true
			},
			"request": {
				"auth": {
					"type": "bearer",
					"bearer": [
						{
							"key": "token",
							"value": "0/10319618feef414db90cbec591926a9e",
							"type": "string"
						}
					]
				},
				"method": "GET",
				"header": [
					{
						"key": "Content-Type",
						"name": "Content-Type",
						"value": "application/json",
						"type": "text"
					}
				],
				"body": {
					"mode": "raw",
					"raw": ""
				},
				"url": {
					"raw": "https://app.asana.com/api/1.0/workspaces",
					"protocol": "https",
					"host": [
						"app",
						"asana",
						"com"
					],
					"path": [
						"api",
						"1.0",
						"workspaces"
					]
				}
			},
			"response": []
		},
		{
			"name": "Create project",
			"request": {
				"auth": {
					"type": "bearer",
					"bearer": [
						{
							"key": "token",
							"value": "0/10319618feef414db90cbec591926a9e",
							"type": "string"
						}
					]
				},
				"method": "POST",
				"header": [
					{
						"key": "Content-Type",
						"name": "Content-Type",
						"type": "text",
						"value": "application/json"
					}
				],
				"body": {
					"mode": "raw",
					"raw": "{\r\n  \"data\": {\r\n    \"name\": \"MA Test Project\",\r\n    \"notes\": \"For tracking learning Postman basics\",\r\n    \"workspace\": \"1150275543490980\"\r\n  }\r\n}"
				},
				"url": {
					"raw": "https://app.asana.com/api/1.0/projects",
					"protocol": "https",
					"host": [
						"app",
						"asana",
						"com"
					],
					"path": [
						"api",
						"1.0",
						"projects"
					]
				}
			},
			"response": []
		},
		{
			"name": "Get users",
			"protocolProfileBehavior": {
				"disableBodyPruning": true
			},
			"request": {
				"auth": {
					"type": "bearer",
					"bearer": [
						{
							"key": "token",
							"value": "0/10319618feef414db90cbec591926a9e",
							"type": "string"
						}
					]
				},
				"method": "GET",
				"header": [
					{
						"key": "Content-Type",
						"name": "Content-Type",
						"value": "application/json",
						"type": "text"
					}
				],
				"body": {
					"mode": "raw",
					"raw": ""
				},
				"url": {
					"raw": "https://app.asana.com/api/1.0/users",
					"protocol": "https",
					"host": [
						"app",
						"asana",
						"com"
					],
					"path": [
						"api",
						"1.0",
						"users"
					]
				}
			},
			"response": []
		},
		{
			"name": "Create task",
			"request": {
				"auth": {
					"type": "bearer",
					"bearer": [
						{
							"key": "token",
							"value": "0/10319618feef414db90cbec591926a9e",
							"type": "string"
						}
					]
				},
				"method": "POST",
				"header": [
					{
						"key": "Content-Type",
						"name": "Content-Type",
						"type": "text",
						"value": "application/json"
					}
				],
				"body": {
					"mode": "raw",
					"raw": "{\r\n  \"data\": {\r\n    \"name\": \"Buy catnip\",\r\n    \"assignee\": null,\r\n    \"assignee_status\": \"upcoming\",\r\n    \"completed\": false,\r\n    \"due_on\": \"2012-03-26\",\r\n    \"external\": {\r\n      \"gid\": \"my_gid\",\r\n      \"data\": \"A blob of information\"\r\n    },\r\n  \r\n    \"html_notes\": \"<body>Mittens <em>really</em> likes the stuff from Humboldt.</body>\",\r\n    \"notes\": \"Mittens really likes the stuff from Humboldt.\",\r\n    \"parent\": null,\r\n    \"projects\": [\r\n      \"1150330099299242\"\r\n    ],\r\n    \"workspace\": \"1150275543490980\"\r\n  }\r\n}"
				},
				"url": {
					"raw": "https://app.asana.com/api/1.0/tasks",
					"protocol": "https",
					"host": [
						"app",
						"asana",
						"com"
					],
					"path": [
						"api",
						"1.0",
						"tasks"
					]
				}
			},
			"response": []
		},
		{
			"name": "Update task",
			"request": {
				"auth": {
					"type": "bearer",
					"bearer": [
						{
							"key": "token",
							"value": "0/10319618feef414db90cbec591926a9e",
							"type": "string"
						}
					]
				},
				"method": "PUT",
				"header": [
					{
						"key": "Content-Type",
						"name": "Content-Type",
						"type": "text",
						"value": "application/json"
					}
				],
				"body": {
					"mode": "raw",
					"raw": "{\r\n  \"data\": {\r\n    \"name\": \"Extra urgent priority\",\r\n    \"workspace\": \"1150275543490980\"\r\n  }\r\n}"
				},
				"url": {
					"raw": "https://app.asana.com/api/1.0/tasks/1150332145108466",
					"protocol": "https",
					"host": [
						"app",
						"asana",
						"com"
					],
					"path": [
						"api",
						"1.0",
						"tasks",
						"1150332145108466"
					]
				}
			},
			"response": []
		},
		{
			"name": "Delete task",
			"request": {
				"auth": {
					"type": "bearer",
					"bearer": [
						{
							"key": "token",
							"value": "0/10319618feef414db90cbec591926a9e",
							"type": "string"
						}
					]
				},
				"method": "DELETE",
				"header": [
					{
						"key": "Content-Type",
						"name": "Content-Type",
						"type": "text",
						"value": "application/json"
					}
				],
				"body": {
					"mode": "raw",
					"raw": ""
				},
				"url": {
					"raw": "https://app.asana.com/api/1.0/tasks/1150331169079620",
					"protocol": "https",
					"host": [
						"app",
						"asana",
						"com"
					],
					"path": [
						"api",
						"1.0",
						"tasks",
						"1150331169079620"
					]
				}
			},
			"response": []
		},
		{
			"name": "Duplicate task",
			"request": {
				"auth": {
					"type": "bearer",
					"bearer": [
						{
							"key": "token",
							"value": "0/10319618feef414db90cbec591926a9e",
							"type": "string"
						}
					]
				},
				"method": "POST",
				"header": [
					{
						"key": "Content-Type",
						"name": "Content-Type",
						"type": "text",
						"value": "application/json"
					}
				],
				"body": {
					"mode": "raw",
					"raw": "{\r\n  \"data\": {\r\n    \"name\": \"New Task Name\",\r\n    \"include\": [\r\n      \"notes\",\r\n      \"assignee\"\r\n    ]\r\n  }\r\n}"
				},
				"url": {
					"raw": "https://app.asana.com/api/1.0/tasks/1150332145108466/duplicate",
					"protocol": "https",
					"host": [
						"app",
						"asana",
						"com"
					],
					"path": [
						"api",
						"1.0",
						"tasks",
						"1150332145108466",
						"duplicate"
					]
				}
			},
			"response": []
		},
		{
			"name": "Update project",
			"request": {
				"auth": {
					"type": "bearer",
					"bearer": [
						{
							"key": "token",
							"value": "0/10319618feef414db90cbec591926a9e",
							"type": "string"
						}
					]
				},
				"method": "PUT",
				"header": [
					{
						"key": "Content-Type",
						"name": "Content-Type",
						"type": "text",
						"value": "application/json"
					}
				],
				"body": {
					"mode": "raw",
					"raw": "{\r\n  \"data\": {\r\n    \"color\": \"light-green\"\r\n  }\r\n}"
				},
				"url": {
					"raw": "https://app.asana.com/api/1.0/projects/1150330099299242",
					"protocol": "https",
					"host": [
						"app",
						"asana",
						"com"
					],
					"path": [
						"api",
						"1.0",
						"projects",
						"1150330099299242"
					]
				}
			},
			"response": []
		},
		{
			"name": "Create tag",
			"request": {
				"auth": {
					"type": "bearer",
					"bearer": [
						{
							"key": "token",
							"value": "0/10319618feef414db90cbec591926a9e",
							"type": "string"
						}
					]
				},
				"method": "POST",
				"header": [
					{
						"key": "Content-Type",
						"name": "Content-Type",
						"type": "text",
						"value": "application/json"
					}
				],
				"body": {
					"mode": "raw",
					"raw": "{\r\n  \"data\": {\r\n    \"name\": \"MA Test Project\",\r\n    \"notes\": \"For tracking learning Postman basics\",\r\n    \"workspace\": \"1150275543490980\"\r\n  }\r\n}"
				},
				"url": {
					"raw": "https://app.asana.com/api/1.0/projects",
					"protocol": "https",
					"host": [
						"app",
						"asana",
						"com"
					],
					"path": [
						"api",
						"1.0",
						"projects"
					]
				}
			},
			"response": []
		}
	]
}