{
    "openapi": "3.0.0",
    "info": {
        "title": "Airport Service (API)",
        "description": "<b>Описание:</b> Сервис включает функционал по получению информации по аэропортам",
        "version": "1.0.0"
    },
    "paths": {
        "/airport/healthcheck/healthcheck": {
            "get": {
                "tags": [
                    "health-check"
                ],
                "summary": "Service healthchecking",
                "operationId": "6164041bb250100cc8b0059cd183f987",
                "responses": {
                    "200": {
                        "description": "OK"
                    }
                }
            }
        },
        "/airport/healthcheck/liveness": {
            "get": {
                "tags": [
                    "health-check"
                ],
                "summary": "Service availability checking",
                "operationId": "887f4bf3014bc14fbb540defd2149c61",
                "responses": {
                    "200": {
                        "description": "OK"
                    }
                }
            }
        },
        "/airport/healthcheck/readiness": {
            "get": {
                "tags": [
                    "health-check"
                ],
                "summary": "Service healthchecking",
                "operationId": "f5cc4b2dbd33d3bf3301a94b58769967",
                "responses": {
                    "200": {
                        "description": "OK"
                    }
                }
            }
        },
        "/airport/v1/airport/get-airport-by-name": {
            "post": {
                "tags": [
                    "airport v1"
                ],
                "summary": "Recieving airport's info by name of airport",
                "operationId": "ec4f60672643de6e4b9afb5e3a6caa04",
                "requestBody": {
                    "content": {
                        "application/json": {
                            "schema": {
                                "$ref": "#/components/schemas/AirportRequest"
                            }
                        }
                    }
                },
                "responses": {
                    "200": {
                        "description": "Order payment successefully placed in the shop",
                        "content": {
                            "application/json": {
                                "schema": {
                                    "properties": {
                                        "status": {
                                            "type": "integer"
                                        },
                                        "details": {
                                            "properties": {
                                                "response": {
                                                    "type": "string"
                                                }
                                            },
                                            "type": "object"
                                        }
                                    },
                                    "type": "object"
                                }
                            }
                        }
                    },
                    "500": {
                        "description": "Invalid payload or code error is happened",
                        "content": {
                            "application/json": {}
                        }
                    },
                    "422": {
                        "description": "Validation error",
                        "content": {
                            "application/json": {}
                        }
                    },
                    "401": {
                        "description": "Full authentication is required to access this resource",
                        "content": {
                            "application/json": {}
                        }
                    },
                    "403": {
                        "description": "Access forbidden",
                        "content": {
                            "application/json": {}
                        }
                    }
                }
            }
        }
    },
    "components": {
        "schemas": {
            "AirportRequest": {
                "title": "AirportRequest",
                "description": "Airport request params",
                "properties": {
                    "airport_name": {
                        "title": "airport_name",
                        "type": "string"
                    }
                },
                "type": "object",
                "example": {
                    "airport_name": "Эль-Меллах"
                }
            }
        }
    },
    "tags": [
        {
            "name": "Airport Service",
            "description": "API Endpoints of Airport"
        }
    ]
}