192.168.36.1 - - [04/Jan/2024:07:31:52 -0800] "GET / HTTP/1.1" 200 11230
192.168.36.1 - - [04/Jan/2024:07:31:53 -0800] "GET /tomcat.svg HTTP/1.1" 200 67795
192.168.36.1 - - [04/Jan/2024:07:31:53 -0800] "GET /tomcat.css HTTP/1.1" 200 5542
192.168.36.1 - - [04/Jan/2024:07:31:53 -0800] "GET /bg-nav.png HTTP/1.1" 200 1401
192.168.36.1 - - [04/Jan/2024:07:31:53 -0800] "GET /bg-middle.png HTTP/1.1" 200 1918
192.168.36.1 - - [04/Jan/2024:07:31:53 -0800] "GET /bg-upper.png HTTP/1.1" 200 3103
192.168.36.1 - - [04/Jan/2024:07:31:53 -0800] "GET /bg-button.png HTTP/1.1" 200 713
192.168.36.1 - - [04/Jan/2024:07:31:53 -0800] "GET /asf-logo-wide.svg HTTP/1.1" 200 27235
192.168.36.1 - - [04/Jan/2024:07:31:53 -0800] "GET /favicon.ico HTTP/1.1" 200 21630
192.168.36.1 - - [04/Jan/2024:07:32:00 -0800] "GET /sample HTTP/1.1" 302 -
192.168.36.1 - - [04/Jan/2024:07:32:00 -0800] "GET /sample/ HTTP/1.1" 200 636
192.168.36.1 - - [04/Jan/2024:07:32:00 -0800] "GET /sample/images/tomcat.gif HTTP/1.1" 200 1441
192.168.36.1 - - [04/Jan/2024:07:43:05 -0800] "GET /sample/ HTTP/1.1" 200 636
192.168.36.1 - - [04/Jan/2024:07:43:21 -0800] "GET /sample/ HTTP/1.1" 200 637
