{
  "frames": {
    "run-1": {
      "frame": {
        "x": 0,
        "y": 0,
        "w": 67,
        "h": 32
      },
      "rotated": false,
      "trimmed": false,
      "spriteSourceSize": {
        "x": 0,
        "y": 0,
        "w": 67,
        "h": 32
      },
      "sourceSize": {
        "w": 67,
        "h": 32
      }
    },
    "run-2": {
      "frame": {
        "x": 67,
        "y": 0,
        "w": 67,
        "h": 32
      },
      "rotated": false,
      "trimmed": false,
      "spriteSourceSize": {
        "x": 0,
        "y": 0,
        "w": 67,
        "h": 32
      },
      "sourceSize": {
        "w": 67,
        "h": 32
      }
    },
    "run-3": {
      "frame": {
        "x": 134,
        "y": 0,
        "w": 67,
        "h": 32
      },
      "rotated": false,
      "trimmed": false,
      "spriteSourceSize": {
        "x": 0,
        "y": 0,
        "w": 67,
        "h": 32
      },
      "sourceSize": {
        "w": 67,
        "h": 32
      }
    },
    "run-4": {
      "frame": {
        "x": 201,
        "y": 0,
        "w": 67,
        "h": 32
      },
      "rotated": false,
      "trimmed": false,
      "spriteSourceSize": {
        "x": 0,
        "y": 0,
        "w": 67,
        "h": 32
      },
      "sourceSize": {
        "w": 67,
        "h": 32
      }
    },
    "run-5": {
      "frame": {
        "x": 268,
        "y": 0,
        "w": 67,
        "h": 32
      },
      "rotated": false,
      "trimmed": false,
      "spriteSourceSize": {
        "x": 0,
        "y": 0,
        "w": 67,
        "h": 32
      },
      "sourceSize": {
        "w": 67,
        "h": 32
      }
    }
  },
  "meta": {
    "app": "https://www.leshylabs.com/apps/sstool/",
    "version": "Leshy SpriteSheet Tool v0.8.4",
    "image": "hell-hound-run.png",
    "size": {
      "w": 335,
      "h": 32
    },
    "scale": 1
  }
}