{
  "dab": "http:\/\/image-cdn.neatoshop.com\/styleimg\/64165\/none\/gray\/default\/364943-19;1506817718i.jpg",
  "deeznuts": "https:\/\/media.giphy.com\/media\/cyu3d3bqnllik\/giphy.gif",
  "senate": "https:\/\/i.redditmedia.com\/pir1ofe-36plbmjuinatkhgchlyjxvkjktubeil2nlk.jpg?s=4c2acc9fc4e8acfa56943c5f05a20efd",
  "tweenangst": "https:\/\/media.discordapp.net\/attachments\/317338406801637380\/448575472859873291\/unknown.png?width=626&height=473",
  "saddab": "https:\/\/ih1.redbubble.net\/image.498324897.8392\/flat,800x800,075,f.jpg",
  "sloth": "https:\/\/cdn.discordapp.com\/attachments\/433756954163281920\/449527374699036672\/unknown.png",
  "fliptable": "https:\/\/media.giphy.com\/media\/n4hhdmm1dk9gy\/giphy.gif",
  "crycat": "https:\/\/pic.chinesefontdesign.com\/uploads\/2016\/09\/chinesefontdesign.com_2016-09-02_18-57-12.gif",
  "meme": "meme",
  "starcrossedcontractors": "https:\/\/i.redd.it\/1hw0qgp3ohmz.png",
  "fear": "https:\/\/i.redd.it\/kafghelp13pz.png",
  "fastasfuckboi": "https:\/\/giant.gfycat.com\/impishimpolitebichonfrise.webm",
  "catonosis": "https:\/\/i.redditmedia.com\/uxhrlum1bqvkxkyczhobh76ay0rwv5kbye2kg1rc8zi.jpg?w=1024&s=8bfd3e39f692a764a32e47d71356cae6",
  "schiang": "https:\/\/i.imgur.com\/qjake9c.png",
  "foodstamp": "https:\/\/qph.ec.quoracdn.net\/main-qimg-b99d4776f2b99f60e323d4493091d404-c",
  "communismkid": "https:\/\/pbs.twimg.com\/media\/c40erotxaaa7jwq.jpg",
  "hart": "http:\/\/i0.kym-cdn.com\/photos\/images\/facebook\/001\/252\/990\/6f4.jpg",
  "chocolatemen": "https:\/\/pm1.narvii.com\/6174\/fcad1f6a32394d99983ffecfff6a714357e94df6_hq.jpg",
  "inspirational": "http:\/\/i0.kym-cdn.com\/photos\/images\/original\/001\/151\/979\/5e7.png",
  "literalhumantrash": "https:\/\/cdn.vox-cdn.com\/thumbor\/cbusnsk9wy5zg2zgzv2scdnvn18=\/0x0:1436x727\/1200x800\/filters:focal(623x104:851x332)\/cdn.vox-cdn.com\/uploads\/chorus_image\/image\/58182757\/screen_shot_2018_01_02_at_1.48.07_pm.0.png",
  "goteem": "https:\/\/media.giphy.com\/media\/zw5nieyxfor6o\/giphy.gif",
  "duane": "https:\/\/78.media.tumblr.com\/84d3fc67ee05930640a5d403444e6037\/tumblr_od1tkuldeg1u3zx2go1_500.gif",
  "goodmeme": "https:\/\/pics.me.me\/this-pleases-me-greatly-14228864.png",
  "onlymonika": "https:\/\/i.ytimg.com\/vi\/0nxuoft97ha\/maxresdefault.jpg",
  "microaggression": "https:\/\/www.youtube.com\/watch?v=MxNMJ39FfyI",
  "faggot": "https:\/\/cdn.discordapp.com\/attachments\/318486560565886984\/404968569500336128\/1516211472056-1.jpg",
  "vsauce": "https:\/\/zippy.gfycat.com\/daringgaseousbluebottlejellyfish.webm",
  "communism": "https:\/\/i.ytimg.com\/vi\/ux1n4w2zy70\/maxresdefault.jpg",
  "furry": "http:\/\/i0.kym-cdn.com\/photos\/images\/original\/001\/117\/902\/4a1.gif",
  "canyoudothis": "https:\/\/media1.tenor.com\/images\/ecedecd45958c923a44a20bb04e1997c\/tenor.gif?itemid=10722056",
  "sweating": "https:\/\/media3.giphy.com\/media\/lrvnpyqm8dlag\/giphy.gif",
  "reflect": "https:\/\/cdn.discordapp.com\/attachments\/318486560565886984\/417689016021024768\/jpeg_20180226_142613.jpg",
  "hackerman": "https:\/\/cdn.discordapp.com\/attachments\/318486560565886984\/421699216117858304\/hackerman.jpg",
  "collin": "https:\/\/cdn.discordapp.com\/attachments\/318486560565886984\/427763830378987520\/hoverhand.png",
  "collin1": "https:\/\/cdn.discordapp.com\/attachments\/318486560565886984\/428146753565622282\/unknown.png",
  "lisy": "kys",
  "nou": "https:\/\/cdn.discordapp.com\/attachments\/469886630228918283\/471796768284344320\/28661370_195996041161551_1747985121567895572_n.jpg",
  "truth": "https:\/\/cdn.discordapp.com\/attachments\/409004139419402241\/449574364992503811\/image-6.jpg",
  "forgiveme": "https:\/\/cdn.discordapp.com\/attachments\/382788739619094529\/399998574626340864\/image.jpg",
  "bitch": "https:\/\/cdn.discordapp.com\/attachments\/404834711991746570\/449788373423620097\/bitch.png",
  "steak": "https:\/\/cdn.discordapp.com\/attachments\/404834711991746570\/449791115042881537\/meat.jpg",
  "footlong": "https:\/\/cdn.discordapp.com\/attachments\/404834711991746570\/449793882918617088\/IMG_1028.JPG",
  "leetgamer": "http:\/\/imgur.com\/MdPGCwS",
  "gimme": "https:\/\/cdn.discordapp.com\/attachments\/426843226943520804\/450008845029212160\/Photo_Editor-20180526_112118.jpg",
  "begone": "http:\/\/i.imgur.com\/f65yPgA.png",
  "controlme": "http:\/\/i.imgur.com\/RjDP2aE.gif",
  "weeb": "http:\/\/i.imgur.com\/N0TS31W.jpg",
  "bananaman": "http:\/\/i.imgur.com\/qDs7g6I.png",
  "breadcat": "http:\/\/i.imgur.com\/hW0hsL2.gif",
  "chocolateboiv2": "https:\/\/i.imgur.com\/VoQEkJl.jpg",
  "sugoi": "https:\/\/i.imgur.com\/C18qZtL.png",
  "kawaii": "https:\/\/i.imgur.com\/0pVXo3U.png",
  "arcadsdayout": "http:\/\/i.imgur.com\/qjQSvB3.jpg",
  "tweaking": "http:\/\/i.imgur.com\/nbLrWCt.jpg",
  "cappa": "http:\/\/i.imgur.com\/0EtzlB7.png",
  "killme": "https:\/\/i.imgur.com\/OMyZ6vu.png",
  "littlebitchboy": "https:\/\/i.imgur.com\/VseD7hK.jpg",
  "kupcake-inator": "https:\/\/youtu.be\/m1vUrHKvH3o?t=49",
  "timzod": "https:\/\/i.imgur.com\/TUyFymx.png",
  "collinsbiggestregret": "https:\/\/i.imgur.com\/LVgVMNa.png",
  "emergencyhug": "https:\/\/i.imgur.com\/RqyRPCX.gifv",
  "pimpin": "https:\/\/i.imgur.com\/1dqlZQ7.jpg",
  "fuckoff": "https:\/\/i.imgur.com\/6e6UQ2Q.gifv",
  "ripmagicschoolbus": "https:\/\/i.imgur.com\/rVvC9aw.jpg",
  "tim2.0": "https:\/\/imgur.com\/OpTvbAX",
  "hellothere": "https:\/\/i.imgur.com\/235woP5.gifv",
  "josh": "https:\/\/i.imgur.com\/SS19rxy.jpg",
  "yougotgamesonyourphone": "https:\/\/imgur.com\/a\/BqOGY",
  "it": "https:\/\/i.imgur.com\/glRq6Ps.png",
  "slimeball": "https:\/\/i.imgur.com\/d77fIYs.png",
  "sorrymate": "https:\/\/i.imgur.com\/Otqznoz.png",
  "uaghospitality": "https:\/\/i.imgur.com\/feWAr62.png",
  "imtiredofyourshit": "https:\/\/i.imgur.com\/BNRJmeQ.jpg",
  "dinkletwerk": "https:\/\/i.imgur.com\/uMs22vd.gif",
  "mylife": "https:\/\/i.imgur.com\/bTRD6WE.gifv",
  "thejoke": "https:\/\/i.imgur.com\/L85IbAt.png",
  "tachankaunmasked": "https:\/\/i.imgur.com\/4UlElpz.jpg",
  "top10animebetrayals": "https:\/\/i.imgur.com\/rAaEPXr.gif",
  "whatarewedoinghere": "https:\/\/i.imgur.com\/QzKGJNi.png",
  "prg": "https:\/\/i.imgur.com\/RgkCd31.jpg",
  "sidpaul": "https:\/\/i.imgur.com\/uCbG5hL.jpg",
  "mirin": "https:\/\/i.imgur.com\/aYTs9CN.png",
  "furries": "https:\/\/i.imgur.com\/Cjc9iE3.png",
  "snak": "https:\/\/i.imgur.com\/pkwkL1d.png",
  "thebiggestlieofall": "https:\/\/i.imgur.com\/cw4Xjyc.png",
  "junglar": "https:\/\/cdn.discordapp.com\/attachments\/433756954163281920\/452511829734719508\/unknown.png",
  "jfbean": "https:\/\/cdn.discordapp.com\/attachments\/433756954163281920\/452526954948722689\/unknown.png",
  "cute": "https:\/\/cdn.discordapp.com\/attachments\/338533212261187594\/453671089780948992\/cute.png",
  "yesvore": "https:\/\/cdn.discordapp.com\/attachments\/338533212261187594\/453984260001366017\/unknown_2.png",
  "zune": "http:\/\/s.quickmeme.com\/img\/61\/619d86631ae6f17bab29179f6e65102c5bef11a364ca209f049d478af555af52.jpg",
  "animepolice": "https:\/\/i.imgur.com\/eosWkVE.jpg",
  "nosoup2": "https:\/\/media3.giphy.com\/media\/3xz2BtrwQ2wIBeciAw\/giphy-downsized.gif",
  "nosoup": "http:\/\/i0.kym-cdn.com\/entries\/icons\/original\/000\/012\/980\/soup_nazi_large.jpg",
  "nosoup3": "http:\/\/i0.kym-cdn.com\/photos\/images\/original\/000\/538\/463\/399.jpg",
  "nosoup4": "https:\/\/i.imgflip.com\/zffl6.jpg",
  "nosoup5": "http:\/\/4.bp.blogspot.com\/-3Hlx_09cck8\/U3Q9o_O6dLI\/AAAAAAAAvaI\/RsQ9akOB8xI\/s1600\/500soupnazi.gif",
  "nosoup6": "https:\/\/image.slidesharecdn.com\/seinfeldquotesmarketing-150223140342-conversion-gate01\/95\/17-seinfeld-quotes-to-inspire-your-marketing-strategy-21-638.jpg?cb=1424771414",
  "nosoup7": "https:\/\/images.thewest.com.au\/publication\/B88510925Z\/G9R1399MA.2-1.jpg?imwidth=1024",
  "nosoup8": "http:\/\/ticobull.com\/wp-content\/uploads\/2016\/10\/nosoupforyou.jpg",
  "nosoup9": "http:\/\/i0.kym-cdn.com\/photos\/images\/facebook\/000\/538\/476\/504.jpg",
  "noramen": "http:\/\/i1.kym-cdn.com\/photos\/images\/newsfeed\/000\/538\/524\/288.jpg",
  "nosoupx": "http:\/\/payload282.cargocollective.com\/1\/1\/54868\/7943645\/10536887_656127241143148_1873579659_n.jpg",
  "nosoup11": "https:\/\/orig00.deviantart.net\/a66d\/f\/2010\/075\/a\/1\/no_soup_for_you_by_m26gil.png",
  "soupshirtwhatthefuckishestilltalking": "https:\/\/pre00.deviantart.net\/5b88\/th\/pre\/f\/2018\/014\/8\/8\/no_soup_for_you_by_skribleskrable-dc000w6.jpg",
  "nosoup10": "https:\/\/pics.me.me\/no-soup-for-you-why-no-so-for-me-14238486.png",
  "soupsopawhat": "https:\/\/img.memecdn.com\/sorry-rainbow-but-no-soup-for-you_o_4001055.jpg",
  "nonukes4u": "https:\/\/static.fjcdn.com\/pictures\/No+soup+for+you_fea178_4536986.png",
  "nosoupforthehomelessfuckshahagetajobyouhippies": "https:\/\/i.redd.it\/2r7kr7a8g1901.png",
  "noturtlesoup": "http:\/\/nipple-dippers.com\/wp-content\/uploads\/memeone-memes\/560db5939fc9f.jpg",
  "queenno": "https:\/\/i.imgur.com\/AGuWcuz.png",
  "woah": "https:\/\/i.imgur.com\/nnGdgyc.png",
  "quotedab": "https:\/\/cdn.discordapp.com\/attachments\/338532982384230400\/457621136453271572\/Death.png",
  "quotedabspaghet": "https:\/\/cdn.discordapp.com\/attachments\/338532982384230400\/457621672724529163\/image.png",
  "fullcircle": "https:\/\/memestatic.fjcdn.com\/pictures\/Weird+new+gender_181897_6639298.jpg",
  "toospicy": "https:\/\/cdn.discordapp.com\/attachments\/404834711991746570\/457719908130881547\/unknown.png",
  "ahegao": "https:\/\/cdn.discordapp.com\/attachments\/381916320423215104\/458132630609854466\/image.png",
  "owo": "https:\/\/i.imgur.com\/crfs3ZJ.gif",
  "downinfront": "https:\/\/giphy.com\/gifs\/repost-npGfqI1yU90w8",
  "repost": "https:\/\/i.imgur.com\/6DSO9nT.gif",
  "(o)w(o)": "https:\/\/i.imgur.com\/UKvRkhA.png",
  "meyiff": "https:\/\/cdn.discordapp.com\/attachments\/338532982384230400\/459582553381273600\/4y9z6jlpmvf01.gif",
  "disbuff": "https:\/\/i.imgur.com\/CEOqD07.gif",
  "tobythedestroyer": "https:\/\/cdn.discordapp.com\/attachments\/433756954163281920\/459834123247288326\/08marlantes2-facebookJumbo.png",
  "devotion": "https:\/\/cdn.discordapp.com\/attachments\/433756954163281920\/460547521203273739\/Forum.png",
  "howtohandlecriticism": "https:\/\/i.imgur.com\/sh4MnxN.png",
  "xisgoingtogiveittoyou": "https:\/\/i.imgur.com\/7HkoOEy.jpg",
  "dogcollin": "https:\/\/imgur.com\/3Ge0nD0",
  "owothology": "https:\/\/cdn.discordapp.com\/attachments\/338533212261187594\/461614709469216769\/owo.mp4",
  "oof": "https:\/\/i.imgur.com\/j7KrfUj.jpg",
  "codydick": "https:\/\/i.imgur.com\/64k0jsR.png",
  "memestar": "https:\/\/cdn.discordapp.com\/attachments\/433756954163281920\/463030524353445888\/unknown.png",
  "ineedtoshit": "https:\/\/thumbs.gfycat.com\/ScaryHonoredAlbino-size_restricted.gif",
  "reee": "https:\/\/risibank.fr\/cache\/stickers\/d798\/79847-full.gif",
  "heresy": "https:\/\/i.imgur.com\/mnito1e.gifv",
  "cokhed": "https:\/\/cdn.discordapp.com\/attachments\/401055657505325058\/454032707794632704\/20180606_232128.jpg",
  "yum": "https:\/\/i.imgur.com\/r9jNmuf.jpg",
  "dontlewdtheloli": "https:\/\/cdn.discordapp.com\/attachments\/262289590239363072\/434093408932462612\/1484528734598.png",
  "triggered": "https:\/\/giphy.com\/gifs\/triggered-3o7aD4h0wC20QBySuA",
  "notdad": "https:\/\/cdn.discordapp.com\/attachments\/433756954163281920\/464533034021027860\/unknown.png",
  "stealthboi": "https:\/\/cdn.discordapp.com\/attachments\/433756954163281920\/465270547077398539\/unknown.png",
  "amish": "https:\/\/www.youtube.com\/watch?v=2eNYis7E5k0",
  "swiggity": "https:\/\/giphy.com\/gifs\/jchMgBKJxKZW",
  "ayy": "https:\/\/cdn.discordapp.com\/attachments\/268885947192573952\/466880361188818944\/28c12101-7a76-4159-a155-de5f83585453.gif",
  "animelogic": "https:\/\/cdn.discordapp.com\/attachments\/433756954163281920\/466892448497664000\/d4a.png",
  "chaos": "https:\/\/giphy.com\/gifs\/jurassic-park-jeff-goldblum-ian-malcolm-oFpAvbDkk5jEI?utm_source=media-link&utm_medium=landing&utm_campaign=Media%20Links&utm_term=https:\/\/www.google.co.uk\/",
  "letmegetthewine": "https:\/\/cdn.discordapp.com\/attachments\/433756954163281920\/467842483041075201\/image.jpg",
  "uagorg": "https:\/\/armapmc.com\/files\/uag\/documents\/org-cheatsheet.png",
  "disappoint": "https:\/\/i.imgur.com\/ZjFqmXy.png",
  "wholesome": "https:\/\/i.imgur.com\/vyDQHJw.gifv",
  "christianserver": "https:\/\/imgur.com\/euu1xFH",
  "notok": "https:\/\/cdn.discordapp.com\/attachments\/433756954163281920\/469050323592544256\/Screenshot_20180718-085630.png",
  "\/f": "http:\/\/gifimage.net\/wp-content\/uploads\/2018\/04\/press-f-to-pay-respects-gif-4.gif",
  "combatman": "http:\/\/www.actionmanhq.co.uk\/figures\/marine-combat\/action-man-marine-combat-1.JPG",
  "whatthefuck": "http:\/\/d.facdn.net\/art\/keadonger\/1532068599\/1532068599.keadonger_momo_.png",
  "tyfrank": "https:\/\/media.discordapp.net\/attachments\/433756954163281920\/469812043478728705\/unknown.png?width=645&height=484",
  "kawaiicollin": "https:\/\/cdn.discordapp.com\/attachments\/433756954163281920\/467131168756727818\/Snapchat-2041545781.jpg",
  "collinkun": "https:\/\/cdn.discordapp.com\/attachments\/433756954163281920\/470875967166873602\/Snapchat-65884466.jpg",
  "tobysan": "https:\/\/cdn.discordapp.com\/attachments\/433756954163281920\/467131168756727818\/Snapchat-2041545781.jpg",
  "breakfastmilkfuck": "https:\/\/giphy.com\/gifs\/obama-thanks-5yaCPstUOV9Kw",
  "mykindofmilk": "https:\/\/giphy.com\/gifs\/milk-clockwork-orange-dKJyOhxvZwBfq",
  "perfection": "https:\/\/imgur.com\/0AXlBTh",
  "sorrydad": "https:\/\/sd.keepcalm-o-matic.co.uk\/i-w600\/im-sorry-and-i-love-you-daddy.jpg",
  "meirl": "https:\/\/scontent.flhr3-1.fna.fbcdn.net\/v\/t1.0-9\/38055934_641345269566690_275534049097809920_n.jpg?_nc_cat=0&oh=5e4c0f93e01603f224e3e60ee79c2afb&oe=5BCDD366",
  "trapcard": "https:\/\/i.imgur.com\/quQTD0q.jpg",
  "mhh": "https:\/\/i.imgur.com\/jGCDqfn.png",
  "gonnapre": "http:\/\/svgur.com\/i\/2KF.png",
  "ooferino": "https:\/\/thumbs.gfycat.com\/ThoseImprobableIberianemeraldlizard-size_restricted.gif",
  "shook": "https:\/\/media.giphy.com\/media\/3o72F8t9TDi2xVnxOE\/giphy.gif",
  "knowing": "https:\/\/cdn.discordapp.com\/attachments\/433756954163281920\/478490959395684354\/Knowing.png",
  "getbent": "https:\/\/lastfm-img2.akamaized.net\/i\/u\/770x0\/2a2bc64597764c1b8f8626725059a742.jpg",
  "learned": "https:\/\/media.tenor.com\/images\/289dc1e3ada331232203d5f342178506\/tenor.gif",
  "rember": "https:\/\/cdn.discordapp.com\/attachments\/338532982384230400\/479324248767463432\/images_1.jpeg",
  "goldenrules": "https:\/\/i.imgur.com\/1jZKGxJ.jpg",
  "franksdick": "https:\/\/i.imgur.com\/ShJpC4T.jpg",
  "codysdick": "https:\/\/cdn.discordapp.com\/attachments\/338532982384230400\/480467303465484299\/image0.jpg",
  "codysfetish": "https:\/\/cms.qz.com\/wp-content\/uploads\/2014\/03\/vid_global_migration_datasheet_web-gimp3_colorcorrected.jpeg?quality=80&strip=all",
  "spermwhale": "https:\/\/media.discordapp.net\/attachments\/433756954163281920\/480477034175266817\/image.gif",
  "jesse": "https:\/\/mindpersuasion-com-mindpersuasion.netdna-ssl.com\/wp-content\/uploads\/2018\/01\/betahero.png",
  "burn": "https:\/\/i.pinimg.com\/originals\/88\/bc\/c3\/88bcc3bef0dbf5bcd262d3b6a27d6a18.jpg",
  "wariolaments": "https:\/\/cdn.discordapp.com\/attachments\/433756954163281920\/481022752451723264\/unknown.png",
  "britpain": "https:\/\/cdn.discordapp.com\/attachments\/433756954163281920\/481019892087128074\/Screenshot_from_2018-08-20_09-40-27.png",
  "leer": "https:\/\/i.imgur.com\/KfxCK7F.png",
  "numberone": "https:\/\/cdn.discordapp.com\/attachments\/433756954163281920\/481775172802576385\/39835102_2356148127954301_5500728280010981376_n.jpg",
  "rude": "https:\/\/cdn8.bigcommerce.com\/s-wkp9y2ej\/images\/stencil\/500x659\/products\/7917\/9996\/dude-that-s-rude-get-some-manners-12__87101.1459892154.gif?c=2&imbypass=on",
  "chadesse": "https:\/\/media.discordapp.net\/attachments\/459831756003082261\/482174156285280256\/XUkN1khD27r5W7y5rW3ERMNxHzSg935dynviCACRbFM.png?width=327&height=439",
  "frank": "https:\/\/i1.trekearth.com\/photos\/53304\/swiss_guard_1951.jpg",
  "ow": "https:\/\/images-ext-1.discordapp.net\/external\/5A7HT5LtUpvxhyDfSBYap3nVGaD1d9T95_FNHnntOFM\/https\/cdn.discordapp.com\/attachments\/450033183401181204\/482245363772686336\/image0.png?width=336&height=440",
  "fuckingwhynot": "https:\/\/giphy.com\/gifs\/please-why-U7vfs20P2ulU0uKp6w",
  "ok": "https:\/\/scontent.flhr3-1.fna.fbcdn.net\/v\/t1.0-9\/40080763_2343282052354555_8764657946115178496_n.jpg?_nc_cat=0&oh=2fb4d5cfe63c52cef58597a1852309e0&oe=5BFA020C",
  "zyrtolean": "https:\/\/i.imgur.com\/re2b1Ey.jpg",
  "breeder": "https:\/\/static1.e621.net\/data\/sample\/99\/c2\/99c2d99a2ea6749a3b05399e390d7edd.jpg",
  "fbi": "https:\/\/www.youtube.com\/watch?v=Egl-d0o9hZc",
  "newboy": "https:\/\/pa1.narvii.com\/6386\/8283b8300dfcbb4b23500733d5c16b1ab3d611c2_hq.gif",
  "swamp": "https:\/\/media1.tenor.com\/images\/7d3f352b46140c04db37c92f71d4e157\/tenor.gif?itemid=8966840",
  "shrek": "https:\/\/media0.giphy.com\/media\/SW5k2eirzkzAc\/giphy-downsized-medium.gif",
  "collin4": "https:\/\/i.redd.it\/1yszazozdavz.jpg",
  "normie": "http:\/\/pa1.narvii.com\/6536\/320d726881159d5ef4a666a294e1a12d51d09928_00.gif",
  "danny": "https:\/\/cdn.discordapp.com\/attachments\/422437762893873172\/486685022590337024\/Danny_2.gif",
  "thottin": "https:\/\/cdn.discordapp.com\/attachments\/381925382598950922\/489073133467205653\/21231803_1561038007273298_4381564687213313676_n.jpg",
  "weakmeme": "https:\/\/media.makeameme.org\/created\/weak-effort-but.jpg",
  "nudes": "https:\/\/cdn.discordapp.com\/attachments\/433756954163281920\/490069867580358666\/Screenshot_from_2018-09-14_09-02-26.png",
  "beacons": "https:\/\/i.gifer.com\/9Puq.gif",
  "hypercody": "https:\/\/cdn.discordapp.com\/attachments\/433756954163281920\/490617224844017675\/Capture.PNG",
  "aaa": "https:\/\/cdn.discordapp.com\/attachments\/426843226943520804\/490987149194297354\/AAAAAAA-1.gif",
  "chocolateboi": "https:\/\/i.imgur.com\/V2ShG2D.jpg",
  "notfeelinggood": "https:\/\/cdn.discordapp.com\/emojis\/458630517303148554.gif?v=1",
  "noweebs": "https:\/\/i.imgur.com\/D4exY3G.png",
  "noawuu": "https:\/\/cdn.discordapp.com\/attachments\/404834711991746570\/493219724025397253\/inuokami-unlawful-awoo.png",
  "dathrob": "https:\/\/cdn.discordapp.com\/attachments\/426843226943520804\/493530012188803087\/eggplant-1.gif",
  "epic": "https:\/\/www.youtube.com\/watch?v=BpMGqKWX-as",
  "bongo": "https:\/\/imgur.com\/gallery\/JJcJkR7",
  "lewd": "https:\/\/vignette.wikia.nocookie.net\/joke-battles\/images\/8\/8f\/Lewd.jpg\/revision\/latest\/scale-to-width-down\/180?cb=20161022022952",
  "meme2": "meme2",
  "archlector": "https:\/\/cdn.discordapp.com\/attachments\/317338406801637380\/499525314318434308\/unknown.png"
}