{
  "root": "packages/guard/guard.string",
  "sourceRoot": "packages/guard/guard.string/src",
  "targets": {
    "build": {
      "executor": "@nrwl/workspace:run-commands",
      "options": {
        "commands": [
          "rm -f dist/packages/guard/guard.string/*",
          "rollup -c packages/guard/guard.string/rollup.config.ts",
          "mv dist/packages/guard/guard.string/esm.d.ts dist/packages/guard/guard.string/index.d.ts",
          "cp packages/guard/guard.string/README.md dist/packages/guard/guard.string/README.md",
          "cp packages/guard/guard.string/package.json dist/packages/guard/guard.string/package.json",
          "uglifyjs dist/packages/guard/guard.string/esm.js -o dist/packages/guard/guard.string/esm.js -c --annotations --comments /@source/",
          "uglifyjs dist/packages/guard/guard.string/cjs.js -o dist/packages/guard/guard.string/cjs.js -c --annotations --comments /@source/",
          "uglifyjs dist/packages/guard/guard.string/umd.js -o dist/packages/guard/guard.string/umd.js -c --annotations --comments /@source/",
          "rm dist/packages/guard/guard.string/cjs.d.ts",
          "rm dist/packages/guard/guard.string/umd.d.ts"
        ],
        "parallel": false
      }
    },
    "lint": {
      "executor": "@nrwl/linter:eslint",
      "outputs": ["{options.outputFile}"],
      "options": {
        "lintFilePatterns": ["packages/guard/guard.string/**/*.ts"]
      }
    },
    "test": {
      "executor": "@nrwl/jest:jest",
      "outputs": ["coverage/packages/guard/guard.string"],
      "options": {
        "jestConfig": "packages/guard/guard.string/jest.config.ts",
        "passWithNoTests": true
      }
    },
    "packageFix": {
      "executor": "@nrwl/workspace:run-commands",
      "options": {
        "command": "npm-sort && fixpack",
        "cwd": "packages/guard/guard.string"
      }
    },
    "publish": {
      "executor": "@nrwl/workspace:run-commands",
      "options": {
        "command": "npm publish --access public",
        "cwd": "dist/packages/guard/guard.string"
      }
    }
  },
  "tags": []
}
