{
  "root": "packages/is/is.boolean",
  "sourceRoot": "packages/is/is.boolean/src",
  "targets": {
    "build": {
      "executor": "@nrwl/workspace:run-commands",
      "options": {
        "commands": [
          "rm -f dist/packages/is/is.boolean/*",
          "rollup -c packages/is/is.boolean/rollup.config.ts",
          "mv dist/packages/is/is.boolean/esm.d.ts dist/packages/is/is.boolean/index.d.ts",
          "cp packages/is/is.boolean/README.md dist/packages/is/is.boolean/README.md",
          "cp packages/is/is.boolean/package.json dist/packages/is/is.boolean/package.json",
          "uglifyjs dist/packages/is/is.boolean/esm.js -o dist/packages/is/is.boolean/esm.js -c --annotations --comments /@source/",
          "uglifyjs dist/packages/is/is.boolean/cjs.js -o dist/packages/is/is.boolean/cjs.js -c --annotations --comments /@source/",
          "uglifyjs dist/packages/is/is.boolean/umd.js -o dist/packages/is/is.boolean/umd.js -c --annotations --comments /@source/",
          "rm dist/packages/is/is.boolean/cjs.d.ts",
          "rm dist/packages/is/is.boolean/umd.d.ts"
        ],
        "parallel": false
      }
    },
    "lint": {
      "executor": "@nrwl/linter:eslint",
      "outputs": ["{options.outputFile}"],
      "options": {
        "lintFilePatterns": ["packages/is/is.boolean/**/*.ts"]
      }
    },
    "test": {
      "executor": "@nrwl/jest:jest",
      "outputs": ["coverage/packages/is/is.boolean"],
      "options": {
        "jestConfig": "packages/is/is.boolean/jest.config.ts",
        "passWithNoTests": true
      }
    },
    "packageFix": {
      "executor": "@nrwl/workspace:run-commands",
      "options": {
        "command": "npm-sort && fixpack",
        "cwd": "packages/is/is.boolean"
      }
    },
    "publish": {
      "executor": "@nrwl/workspace:run-commands",
      "options": {
        "command": "npm publish --access public",
        "cwd": "dist/packages/is/is.boolean"
      }
    }
  },
  "tags": []
}
