{
  "name": "react-boilerplate",
  "dockerComposeFile": "docker-compose.yml",
  "service": "app",
  "workspaceFolder": "/workspace",
  // Set *default* container specific settings.json values on container create.
  "settings": {
    "terminal.integrated.shell.linux": "/bin/zsh",
    "files.watcherExclude": {
      "**/.git/objects/**": true,
      "**/.git/subtree-cache/**": true,
      "**/node_modules/*/**": true
    }
  },
  // Add the IDs of extensions you want installed when the container is created.
  "extensions": [
    "dbaeumer.vscode-eslint",
    "eamodio.gitlens",
    "mrmlnc.vscode-scss",
    "vscode-icons-team.vscode-icons",
    "esbenp.prettier-vscode",
    "visualstudioexptteam.vscodeintellicode",
    "mutantdino.resourcemonitor",
    "ritwickdey.liveserver",
    "ckolkman.vscode-postgres"
  ],
  // Use 'forwardPorts' to make a list of ports inside the container available locally.
  // "forwardPorts": [],
  "forwardPorts": [
    3000
  ],
  "postCreateCommand": "yarn"
}