{
	"info": {
		"_postman_id": "1a013681-b396-4694-ba8f-d8be36263bad",
		"name": "Cosmos",
		"schema": "https://schema.getpostman.com/json/collection/v2.1.0/collection.json"
	},
	"item": [
		{
			"name": "CosmosPOSTJAR",
			"request": {
				"method": "POST",
				"header": [
					{
						"key": "cosmos-access",
						"value": "z0wiPrbTNe9Ctt8OxeqT",
						"type": "text"
					}
				],
				"body": {
					"mode": "formdata",
					"formdata": [
						{
							"key": "file",
							"type": "file",
							"src": []
						}
					]
				},
				"url": {
					"raw": "https://flink.fiware.opendata-CITY.de/jars/upload",
					"protocol": "https",
					"host": [
						"flink",
						"fiware",
						"opendata-CITY",
						"de"
					],
					"path": [
						"jars",
						"upload"
					]
				}
			},
			"response": []
		},
		{
			"name": "CosmosPOSTJAR",
			"request": {
				"method": "DELETE",
				"header": [
					{
						"key": "cosmos-access",
						"value": "z0wiPrbTNe9Ctt8OxeqT",
						"type": "text"
					}
				],
				"url": {
					"raw": "https://flink.fiware.opendata-CITY.de/jars/INTERNAL_JARFILENAME_HERE",
					"protocol": "https",
					"host": [
						"flink",
						"fiware",
						"opendata-CITY",
						"de"
					],
					"path": [
						"jars",
						"INTERNAL_JARFILENAME_HERE"
					]
				}
			},
			"response": []
		}
	],
	"protocolProfileBehavior": {}
}