<?xml version="1.0" encoding="UTF-8" standalone="no"?>
<!-- Created with Inkscape (http://www.inkscape.org/) -->

<svg
   xmlns:dc="http://purl.org/dc/elements/1.1/"
   xmlns:cc="http://creativecommons.org/ns#"
   xmlns:rdf="http://www.w3.org/1999/02/22-rdf-syntax-ns#"
   xmlns:svg="http://www.w3.org/2000/svg"
   xmlns="http://www.w3.org/2000/svg"
   xmlns:sodipodi="http://sodipodi.sourceforge.net/DTD/sodipodi-0.dtd"
   xmlns:inkscape="http://www.inkscape.org/namespaces/inkscape"
   width="1920px"
   height="1080px"
   viewBox="0 0 1920 1080"
   version="1.1"
   id="SVGRoot"
   inkscape:version="0.92.4 (5da689c313, 2019-01-14)"
   sodipodi:docname="zazen.svg"
   inkscape:export-filename="/home/olivier/Vidéos/videos/zen-interviews-camp-hiver-2019/zazen.png"
   inkscape:export-xdpi="96"
   inkscape:export-ydpi="96">
  <defs
     id="defs10" />
  <sodipodi:namedview
     id="base"
     pagecolor="#ffffff"
     bordercolor="#666666"
     borderopacity="1.0"
     inkscape:pageopacity="0"
     inkscape:pageshadow="2"
     inkscape:zoom="0.49497475"
     inkscape:cx="-347.7861"
     inkscape:cy="529.95795"
     inkscape:document-units="px"
     inkscape:current-layer="layer1"
     showgrid="false"
     inkscape:window-width="1850"
     inkscape:window-height="1016"
     inkscape:window-x="70"
     inkscape:window-y="27"
     inkscape:window-maximized="1" />
  <metadata
     id="metadata13">
    <rdf:RDF>
      <cc:Work
         rdf:about="">
        <dc:format>image/svg+xml</dc:format>
        <dc:type
           rdf:resource="http://purl.org/dc/dcmitype/StillImage" />
        <dc:title />
      </cc:Work>
    </rdf:RDF>
  </metadata>
  <g
     inkscape:label="Calque 1"
     inkscape:groupmode="layer"
     id="layer1">
    <text
       xml:space="preserve"
       style="font-style:normal;font-weight:normal;font-size:40px;line-height:1.25;font-family:sans-serif;letter-spacing:0px;word-spacing:0px;fill:#ffffff;fill-opacity:1;stroke:#000000;stroke-opacity:1"
       x="23.253046"
       y="340.45538"
       id="text44"><tspan
         sodipodi:role="line"
         x="23.253046"
         y="340.45538"
         id="tspan46"
         style="font-style:normal;font-variant:normal;font-weight:normal;font-stretch:normal;font-size:96px;font-family:Belleza;-inkscape-font-specification:Cabin;fill:#ffffff;fill-opacity:1;stroke:#000000;stroke-opacity:1">Zazen :</tspan><tspan
         sodipodi:role="line"
         x="23.253046"
         y="433.78873"
         style="font-style:normal;font-variant:normal;font-weight:normal;font-stretch:normal;font-size:96px;font-family:Belleza;-inkscape-font-specification:Cabin;fill:#ffffff;fill-opacity:1;stroke:#000000;stroke-opacity:1"
         id="tspan4585">posture de</tspan><tspan
         sodipodi:role="line"
         x="23.253046"
         y="527.12207"
         style="font-style:normal;font-variant:normal;font-weight:normal;font-stretch:normal;font-size:96px;font-family:Belleza;-inkscape-font-specification:Cabin;fill:#ffffff;fill-opacity:1;stroke:#000000;stroke-opacity:1"
         id="tspan4587">méditation assise</tspan><tspan
         sodipodi:role="line"
         x="23.253046"
         y="620.45538"
         style="font-style:normal;font-variant:normal;font-weight:normal;font-stretch:normal;font-size:96px;font-family:Belleza;-inkscape-font-specification:Cabin;fill:#ffffff;fill-opacity:1;stroke:#000000;stroke-opacity:1"
         id="tspan4589">du bouddhisme zen.</tspan></text>
  </g>
</svg>
