425999 244787 449
290536 236418 407
184558 504219 449
848125 60582 525
356017 384128 423
444396 285079 449
366940 292484 441
179229 68047 383
849738 601165 525
203750 437716 449
911477 402107 525
720674 209565 509
939426 324018 525
53118 909296 525
70798 535526 470
975243 721344 525
881088 720360 525
794680 175686 509
34408 57934 340
313422 33849 443
980762 265132 525
631823 707989 504
466957 544095 470
827214 648421 504
715169 541164 509
380522 162214 443
266380 153317 443
191399 452680 449
319069 511023 449
560357 460304 470
903937 421016 525
751776 879340 525
174536 955922 525
132361 607808 470
361298 978059 525
352706 798404 509
912083 444912 525
491330 831784 509
633773 278889 509
882796 615654 525
507655 540383 470
311746 260441 407
511611 643159 509
464991 349697 449
99873 646159 509
668212 789496 504
300553 954107 525
647603 71975 509
67081 178249 383
879466 351547 525
168814 771150 509
985968 379814 525
706567 745730 424
69254 543913 470
554030 973229 525
981188 961812 458
594900 692766 509
641998 385132 509
9967 607353 470
358083 8621 443
935853 912087 476
664354 181923 509
406397 520368 470
128466 378867 443
687829 805074 504
451140 59438 449
338603 291700 384
246157 158623 443
316787 847189 525
557633 229891 470
829489 492606 509
419737 644122 509
336048 823703 509
117903 125450 336
124731 305372 443
28413 203745 383
443470 717424 509
333846 217624 443
845631 194619 525
83991 356009 443
134528 53827 354
441836 429007 400
507164 410052 444
759757 831235 468
986411 316946 525
635001 46300 509
693847 26969 509
324429 521199 470
623015 4645 470
908533 479347 525
488160 22493 449
151721 120742 375
964867 834027 525
324238 872381 525
391750 935666 525
552847 821280 509
671862 435376 509
914017 316532 525
397039 858284 525
452366 818798 509
27251 294790 443
247054 942481 525
826585 767313 468
718752 135898 509
959479 591554 525
415964 259876 449
410664 582828 470
264108 832006 509
73286 89758 351
818327 561873 509
522709 553005 452
749197 728593 424
804464 243114 509
258040 701596 509
724420 315910 509
967415 842850 507
6601 432300 449
374423 117600 443
907846 12378 525
112811 136898 349
728520 933576 525
172571 208907 373
168783 615175 470
718677 191149 509
143945 203072 383
507282 833665 509
384138 30470 443
326202 480883 449
349491 91923 443
99878 199717 383
430986 114088 449
604010 135187 470
62252 732005 509
20947 127137 354
712708 69375 509
396244 218193 443
346895 914610 525
96418 206740 383
794041 231735 509
970463 13224 525
530327 855784 525
351200 604315 470
625457 276398 470
44097 688776 509
269660 672487 509
613724 683561 509
980544 851788 507
577090 36924 470
556703 565996 421
893518 347677 525
428559 195948 449
292593 603982 470
945051 314858 525
460795 552842 470
129386 904393 525
119975 350483 443
922635 736382 525
940374 489061 525
229873 643955 509
399688 75535 443
939182 330270 525
116975 534406 470
945781 545653 525
734459 193213 509
986330 886688 507
953905 265262 525
383746 421548 449
58107 323974 443
461100 954943 525
962575 303947 525
823008 201772 509
36264 873129 525
138784 463572 449
484076 254992 449
81261 350464 443
276642 299186 389
933754 950998 507
459198 529282 470
258046 158141 443
767660 873774 525
642225 505096 509
745075 373107 509
987287 389749 525
826485 570291 509
931408 704479 525
890684 732246 525
235959 470611 449
709230 692403 504
587607 277491 470
46080 885592 525
895217 429267 525
482618 159547 449
863810 677713 525
606690 498907 470
865919 190657 525
694336 452138 509
223350 576076 470
393648 994632 525
232806 993027 525
95517 868543 525
194648 467465 449
972808 788567 525
766581 196313 509
728089 373669 509
307039 928499 525
848224 403714 525
705985 894488 525
37536 456321 449
975487 317168 525
821551 710414 468
559541 462084 470
909701 760116 525
100730 877508 525
708279 536661 509
955647 846066 507
663785 640269 429
166360 98269 383
781754 260297 509
238951 283760 407
531189 970045 525
233334 793145 509
889266 272730 525
150287 176060 383
17763 497789 449
874248 421427 525
300197 195071 443
41169 931419 525
163835 724295 509
256201 406613 441
9402 557054 470
198744 173266 365
233430 442234 449
906566 959402 507
919070 470939 525
947257 113964 525
251559 21987 443
388288 36460 443
609748 443907 470
455920 138816 449
142587 726918 509
593891 122097 470
359311 718403 509
970078 120736 525
507300 142279 449
673607 458142 509
681739 903308 525
870921 487010 525
922284 707203 525
481236 692613 509
364560 673799 509
