616839 523396 452
823245 693283 504
126362 504818 449
139910 498544 449
351290 861884 525
779081 742004 468
542269 846906 525
194077 422859 449
627496 448182 509
163369 196075 365
99102 654533 509
663815 326571 509
427555 10222 449
876839 12429 525
221802 660971 509
533356 975079 525
701999 485917 509
229946 379933 443
861291 914218 476
244090 322340 407
76724 620134 470
705261 818239 468
749893 806866 468
715477 22069 509
896924 786799 525
218130 543468 470
890518 384672 525
673799 49914 509
551218 942511 525
204259 698709 509
980560 296190 525
641302 238361 509
216126 256059 443
790550 719900 468
532795 890299 525
725767 582741 509
262521 461415 449
8878 286876 443
251852 854121 525
227344 419649 449
933483 548370 525
315200 125904 443
800640 82257 509
150216 141550 375
118659 870519 525
131623 515957 470
282204 669867 509
614935 871949 525
188032 762686 509
471614 359091 449
100831 148910 375
958874 185428 525
774426 27673 509
638205 35908 509
261546 568616 470
745940 838203 525
496715 869956 525
609141 848598 525
529267 227415 470
795508 547073 509
812948 11954 509
674797 637368 442
339195 843954 525
686845 693716 442
402199 328895 441
14165 467194 449
851179 197457 525
245499 705837 509
500873 330222 449
821325 636414 504
129409 199517 383
524064 982407 525
647282 715316 504
101762 47162 351
585393 251189 470
668552 262154 509
56248 817060 509
294186 382425 441
581605 986711 525
341328 557343 470
503524 204723 449
134041 230118 386
820635 329657 509
928228 214265 525
76856 536249 470
49385 217318 386
398777 5291 443
973164 663277 525
501426 820908 509
518672 11449 470
293258 117351 443
322469 369156 441
212003 67650 383
668883 501734 509
624506 501295 470
318372 925390 525
774784 358525 509
718772 965923 525
765547 531239 509
75717 967515 525
737502 645906 504
325451 932180 525
440499 356905 449
907788 109750 525
529790 684500 509
806869 305388 509
865786 699074 525
174003 574697 470
385198 930347 525
548474 614847 434
676601 958879 525
990037 925458 507
819302 274005 509
169819 418953 449
837111 5635 509
472429 485957 413
873582 695849 525
944066 931784 507
447892 747788 509
497313 180112 449
491821 528201 470
479628 227471 449
353944 668339 509
96494 86236 333
424974 98019 449
63756 472498 449
987584 3304 525
248563 172945 443
748918 800468 468
219746 81631 386
792732 996919 525
412059 219080 449
790391 290060 509
39582 663791 509
223412 592730 470
247281 377544 441
166351 649848 509
189749 579012 470
930679 730975 525
120093 198899 383
489961 648242 509
417199 834059 509
990385 898076 507
662154 833197 504
593540 354644 470
852744 200373 525
154735 749312 509
343014 887861 525
552868 772239 509
261545 764623 509
780670 413680 509
159391 645599 509
306185 25380 443
17545 343107 443
632845 303845 509
534257 363081 470
848027 139445 525
997092 250585 525
881088 411032 525
897843 390660 525
268960 619488 470
509501 633291 509
497224 597561 470
822001 978446 525
776905 916872 525
200551 634169 509
94390 258776 443
356227 808848 509
826256 763043 468
655894 196036 509
666676 977043 525
873211 752550 525
9218 739871 509
97953 52072 351
345705 187804 443
875223 334846 525
722168 939862 525
285454 529719 470
927820 224599 525
103353 525875 470
145413 295499 443
573385 897389 525
634371 717113 504
38426 914818 525
24798 561804 470
686187 889149 525
96097 521475 470
510481 598270 470
880906 918632 476
180391 207715 373
300316 695290 509
804885 551922 509
678169 824927 504
595345 232424 470
22660 840180 525
175895 297351 443
374827 790948 509
78302 563110 470
875609 500402 525
923280 599500 525
518530 457485 470
44082 853736 525
187881 381280 443
123706 387229 443
642317 209907 509
612123 825412 509
459957 374502 449
319316 484122 449
992519 136076 525
278591 335813 389
394560 828436 509
37980 16485 324
81866 670831 509
372183 705911 509
458688 905011 525
104412 61360 351
349613 127991 443
100717 559133 470
242993 538870 470
940454 498509 525
343909 764064 509
720808 136278 509
11451 124646 354
272219 389532 441
828996 96250 509
130307 742244 509
183891 549987 470
957019 852690 507
648906 896743 525
201303 966186 525
243707 366063 441
773935 368359 509
711646 387207 509
124046 548044 470
72012 403255 443
40679 823947 509
301029 890919 525
970693 456148 525
234513 62369 443
855013 59388 525
100462 743139 509
609279 985569 525
384211 57271 443
595411 819804 509
403839 993351 525
383320 820671 509
946069 505494 525
378939 371162 423
883562 468628 525
357699 301 443
626237 686221 509
795263 355813 509
230396 406719 443
278764 373770 441
641343 975443 525
846742 571021 525
339985 34831 443
813599 343021 509
226701 521400 470
302539 404603 441
138526 726045 509
322433 950253 525
33457 683800 509
659136 478135 509
154403 976582 525
402753 293911 441
827322 690597 504
736505 514161 509
245680 335623 407
192278 97069 383
289630 915710 525
951237 425593 525
767369 222531 509
586446 542547 452
713726 445908 509
69122 94797 351
593589 295984 470
936648 105426 525
771505 694768 504
898547 45295 525
510589 392481 449
952565 902348 507
844690 456556 525
4386 730239 509
921441 594766 525
39300 70375 340
654360 588091 509
659570 170630 509
441302 972555 525
445194 112903 449
944733 754141 525
323130 64606 443
10469 534499 470
516676 74139 470
791531 747318 468
884193 218821 525
898674 843201 445
666039 836713 504
91710 255390 443
503969 987166 525
