// Jest Snapshot v1, https://goo.gl/fbAQLP

exports[`should match snapshot 1`] = `
Array [
  "A-B",
  "A-C",
  "B-C",
]
`;

exports[`should match snapshot 2`] = `
Array [
  "A-B",
  "A-C",
]
`;

exports[`should match snapshot 3`] = `
Array [
  "A-B",
  "A-C",
]
`;
