// Jest Snapshot v1, https://goo.gl/fbAQLP

exports[`SearchBar should check SearchBar 1`] = `
<styled.div>
  <SearchBar
    handleChange={[Function]}
    placeholder="components.products.search"
    value="product"
  />
</styled.div>
`;
