// Jest Snapshot v1, https://goo.gl/fbAQLP

exports[`Input should render Input 1`] = `
<OnboardingForm>
  <FormItem
    hasFeedback={false}
    validateStatus="success"
  >
    <Input
      fieldDecorator={[Function]}
      label=""
      name="password"
      onChange={[Function]}
      prefix={
        <Icon
          type="lock"
        />
      }
      type="password"
      value="test@123"
    />
  </FormItem>
  <FormItem
    hasFeedback={false}
    validateStatus="success"
  >
    <Input
      fieldDecorator={[Function]}
      label=""
      name="confirmPassword"
      onChange={[Function]}
      prefix={
        <Icon
          type="lock"
        />
      }
      type="password"
      value="test@123"
    />
  </FormItem>
  <styled.div>
    <Error
      dangerous={true}
    >
      Password should be 6 digit
    </Error>
  </styled.div>
</OnboardingForm>
`;
