// Jest Snapshot v1, https://goo.gl/fbAQLP

exports[`SurveyLogin should render SurveyLogin 1`] = `
<ApolloProvider
  client={MockedClient {}}
>
  <Router
    history={
      Object {
        "listen": [Function],
        "location": Object {
          "pathname": "",
        },
        "push": [Function],
      }
    }
  >
    <SurveyLogin
      match={
        Object {
          "params": Object {
            "surveyId": "survey-1",
          },
        }
      }
    >
      <Component
        mergeNavbarToContent={true}
      >
        <div>
          children
        </div>
      </Component>
    </SurveyLogin>
  </Router>
</ApolloProvider>
`;
