// Jest Snapshot v1, https://goo.gl/fbAQLP

exports[`QuestionCreationCardSettings should render QuestionCreationCardSettings 1`] = `
<Row
  gutter={24}
>
  <Col
    xs={24}
  >
    <Memo(QuestionCreationCardTypeSelect)
      questionInfo={
        Object {
          "mandatoryQuestion": "",
          "question": Object {
            "id": "question-1",
            "prompt": "What is your email?",
            "type": "choose-product",
          },
          "questionIndex": 1,
        }
      }
    />
  </Col>
</Row>
`;
