// Jest Snapshot v1, https://goo.gl/fbAQLP

exports[`TooltipWrapper should render TooltipWrapper 1`] = `
<Styled(Tooltip)
  arrowPointAtCenter={true}
  isTab={false}
  placement="placement"
  title={
    <styled.div
      dangerouslySetInnerHTML={
        Object {
          "__html": "Click here",
        }
      }
    />
  }
>
  'this is a tooltip children'
</Styled(Tooltip)>
`;
