{
    "happyTasting": "¡Feliz degustación!",
    "emailUs": "Si tiene alguna pregunta, utilice el cuadro de ayuda a continuación o envíe un correo electrónico",
    "theFlavorWikiTeam": "El equipo de FlavorWiki",
    "components": {
        "editQrCode": {
            "save": "Actualizar"
        },
        "surveyInstructions": {
            "title": "Instrucciones de degustación"
        },
        "surveyLogIn": {
            "loginTo": "Iniciar sesión en",
            "notARobot": "Confirme que no es un robot para poder comenzar.",
            "welcome": "¡Bienvenido a la degustación!",
            "pressToStart": "Presione el botón de abajo para comenzar.",
            "askForEmail": "Ingrese su correo electrónico para continuar.",
            "nextTimeDetails": "Si deja la degustación antes de completarla, puede continuar donde la dejó ingresando su correo electrónico en la página de inicio.",
            "accessLogin": "Si tiene acceso a esta encuesta, inicie sesión primero.",
            "access": "Haga clic aquí para acceder a la página de inicio de sesión.",
            "surveyAvailable": "Esta encuesta solo está disponible para usuarios específicos.",
            "notSelectedToParticipate": "No se encuentra entre los usuarios seleccionados para participar en esta encuesta."
        },
        "surveyNavigation": {
            "skipProgressText": "Ha contestado por $t(countProduct, { 'count': {{products}} }). Puede saltar a la siguiente después de contestar al menos $t(countProduct, { 'count': {{minimumProducts}} })."
        },
        "surveyInfoTest": {
            "completed": "Degustación completada",
            "rejected": "Has sido rechazado",
            "answered": "Respondido",
            "of": "de",
            "atLeast": "Responder al menos",
            "pair": "par",
            "pairs": "pares",
            "information": "Información",
            "pairedQuestionInfo": "En las siguientes preguntas, habrá múltiples pares de términos descriptivos. Seleccione el término que, en su opinión, describe mejor el producto. Responda lo mejor que pueda. No hay respuesta correcta o incorrecta.",
            "close": "cerrar",
            "screeningOk": "Usted ha calificado para la degustación. Por favor, haga clic en el botón de abajo para continuar. También recibirá un correo electrónico en breve con este enlace como recordatorio.",
            "congratulations": "Felicitaciones",
            "uploadPicture": "Cargue una foto de su producto abierto para verificar que ha completado todo correctamente. Se requiere una foto que muestre claramente el producto durante la degustación para poder optar a sus recompensas.",
            "cantDecide": "No puedo decidir",
            "otherOptions": "Otras Opciones",
            "customOption": "Descriptor personalizado",
            "pickOption": "Elija la opción que mejor describa su situación.",
            "optionsModalTitle": "¿Descriptores incorrectos?",
            "bothOptionsPresent": "Ambos descriptores están presentes",
            "noDescriptorPresent": "Ninguno de los descriptores está presente",
            "noMorePairs": "No más pares, haga clic en 'Siguiente' para continuar",
            "isPresent": "está presente",
            "isNotPresent": "no está presente",
            "addYourOwn": "Agregue su propio",
            "writeOption": "Escriba su propia opción a continuación",
            "rejectedReasonFirst": "Lo sentimos, pero estamos buscando un perfil diferente al suyo para esta degustación.",
            "rejectedReasonSecond": "Pero no se desanime, consideraremos su participación en nuestras futuras degustaciones."
        },
        "socialMedia": {
            "shareFB": "Compartir en Facebook",
            "shareTW": "Compartir en Twitter",
            "shareLI": "Compartir en LinkedIn"
        },
        "userSurveyCard": {
            "products": "{{number}} Producto {{plural}}",
            "seeShops": "(Ver tiendas)"
        },
        "bottomNavBar": {
            "steps": "{{currentStep}} de {{totalSteps}}"
        },
        "requestAccountForm": {
            "submit": "Enviar"
        },
        "alertModal": {
            "delete": "Eliminar",
            "cancel": "Cancelar"
        },
        "backNavigation": {
            "back": "Volver"
        },
        "additionalInfo": {
            "ethnicity": "1. Origen étnico",
            "ethnicityPlaceholder": "Seleccione una opción",
            "income": "2. Ingresos",
            "incomePlaceholder": "Moneda",
            "incomeRangePlaceholder": "Rango de ingresos",
            "childrenAtHome": "3. Niños en casa",
            "childrenAtHomePlaceholder": "Seleccione una opción",
            "childrenAtHomeMsg": "Ingrese el número de niños",
            "childrenAgeLabel": "Edad de los niños",
            "childrenAgePlaceholder": "Seleccione una opción",
            "smokerTitle": "4. Fumador o no",
            "productTypeTitle": "5. Tipos de productos",
            "productTypePlaceholder": "Seleccione una opción o más",
            "dietaryTitle": "6. Restricciones dietéticas",
            "dietaryPlaceholder": "Seleccione una opción",
            "updateButton": "Actualizar información"
        },
        "changePassword": {
            "currentPassword": "Contraseña actual",
            "newPassword": "Nueva contraseña",
            "confirmPassword": "Confirmación de contraseña",
            "passwordPrompt": "Debe proporcionar su contraseña actual para poder cambiarla.",
            "savePasswordButton": "Guardar contraseña",
            "forgotPasswordButton": "Olvidé la contraseña"
        },
        "tasterProfile": {
            "fullName": "Su nombre completo",
            "birthYear": "Su año de nacimiento",
            "gender": "Su género",
            "nationality": "El país donde vive actualmente",
            "submitButton": "Enviar"
        },
        "footer": {
            "privacyPolicy": "Política de privacidad",
            "termsAndConditions": "Términos y condiciones",
            "aboutText": "FlavorWiki ayuda a la industria de alimentos y bebidas a evaluar la percepción y preferencia de los consumidores en un tiempo récord, desde cualquier parte del mundo."
        },
        "forgotPasswordForm": {
            "sendButton": "Enviar correo electrónico"
        },
        "paymentDetailsForm": {
            "payPalCard": "Con PayPal",
            "paypalEmail": "Dirección de correo electrónico de PayPal",
            "submitButton": "Actualizar información"
        },
        "privacyForm": {
            "marketingNotifications": "Notificaciones de marketing",
            "marketingEmails": {
                "title": "Correos electrónicos de marketing",
                "description": "Hoy en día, las empresas a menudo se conocen a través de un marketing eficaz."
            },
            "marketingPushes": {
                "title": "Emergentes de marketing",
                "description": "Quiero que FlavorWiki me envíe notificaciones emergentes de marketing que puedan interesarme."
            },
            "pushNotifications": {
                "title": "Notificaciones emergentes",
                "description": "Quiero recibir notificaciones para ver nuevas encuestas."
            }
        },
        "profile": {
            "title": "Mi perfil"
        },
        "personalDetailsForm": {
            "firstName": "Nombre",
            "lastName": "Apellido",
            "gender": "Género",
            "language": "Idioma",
            "submitButton": "Actualizar información"
        },
        "paypalEmailModal": {
            "prompt": "Para recibir su recompensa, necesitaremos el correo electrónico de su cuenta PayPal",
            "title": "Ingrese su correo electrónico de PayPal"
        },
        "register": {
            "nextStep": "Siguiente paso",
            "doLater": "Hacerlo más tarde"
        },
        "userSurvey": {
            "inProgress": "Encuesta en curso",
            "productsPurchase": "Productos para comprar y degustar",
            "timeLeftInProgress": "para completar la encuesta",
            "timeLeftSurveyOngoing": "dejado para comprar y degustar productos"
        },
        "surveyComplete": {
            "text": "Acabo de terminar una encuesta, mírenla"
        },
        "createTasterAccount": {
            "steps": {
                "second": {
                    "title": "Información personal",
                    "description": "Necesitamos saber un poco más sobre usted.",
                    "okText": "Siguiente paso"
                },
                "third": {
                    "title": "Información adicional",
                    "description": "Esta información adicional nos ayudará a seleccionar las mejores encuestas de productos para usted.",
                    "okText": "Guardar"
                }
            }
        },
        "question": {
            "chooseProduct": {
                "noImage": "Sin imagen",
                "reward": "Recompensa:"
            }
        },
        "retakes": {
            "header": "Esta encuesta solo se puede realizar una vez.",
            "subHeader": "Ya ha completado la encuesta."
        },
        "surveyQuestion": {
            "minAnswerValues": "Debe seleccionar un mínimo de $t(countAnswer, {\"count\": {{minAnswerValues}} }) y un máximo de $t(countAnswer, {\"count\": {{maxAnswerValues}} })",
            "maxAnswerValues": "Debe seleccionar un máximo de $t(countAnswer, {\"count\": {{maxAnswerValues}} }) respuestas"
        }
    },
    "defaultValues": {
        "customButtons": {
            "continue": "Continuar",
            "start": "Empezar",
            "next": "Siguiente",
            "skip": "Saltar"
        },
        "instructionSteps": [
            "Asegúrese de tener todos los productos seleccionados antes de comenzar la degustación."
        ],
        "screeningText": "<p><strong><span style=\"font-size: 20pt;\" data-mce-style=\"font-size: 20pt;\">Felicitaciones<\/span><\/strong><\/p>\n<p>Ha calificado para la degustación. Haga clic en el botón de abajo para continuar.<br\/>\nEn breve también recibirá un correo electrónico con este enlace a modo de recordatorio.<\/p>\n<p>Si tiene alguna pregunta, utilice el cuadro de ayuda a continuación o envíe un correo electrónico:<\/p>\n<p><a href=\"mailto:support@flavorwiki.com\">support@flavorwiki.com<\/a><\/p>\n<p>¡Feliz degustación!<\/p>\n<p>El equipo FlavorWiki<\/p>",
        "rejectionText": "<p><strong><span style=\"font-size: 20pt;\" data-mce-style=\"font-size: 20pt;\">Lo sentimos mucho... ¡No esta vez!<\/span><\/strong><\/p>\n<p>Lo sentimos, pero estamos buscando un perfil diferente al stuyo para esta degustación.<br\/>Pero no se desanime, consideraremos su participación en nuestras futuras degustaciones.<\/p>\n<p>Si tiene alguna pregunta, utilice el cuadro de ayuda a continuación o envíe un correo electrónico:<\/p>\n<p><a href=\"mailto:support@flavorwiki.com\">support@flavorwiki.com<\/a><\/p>\n<p>¡Feliz degustación!<\/p>\n<p>El equipo FlavorWiki<\/p>"
    },
    "placeholders": {
        "email": "Ingrese su correo electrónico",
        "addOpinion": "Agregue su opinión aquí...",
        "writeAnswer": "Escriba su respuesta aquí",
        "selectBrand": "Seleccione una marca",
        "addOption": "Agregue su propia opción",
        "selectOne": "Seleccione una opción",
        "addDescriptor": "Introduzca su propio descriptor",
        "inputOption": "Seleccione su propia opción",
        "companyName": "El nombre de su empresa",
        "category": "Seleccione una categoría",
        "country": "País",
        "username": "Nombre de usuario",
        "password": "Contraseña",
        "currentPassword": "Ingrese la contraseña actual",
        "newPassword": "Ingrese una nueva contraseña",
        "confirmPassword": "Confirme la nueva contraseña",
        "emailAddress": "Dirección de correo electrónico"
    },
    "errors": {
        "inputValidEmail": "Introduzca un correo electrónico válido.",
        "UNAUTHORIZED": "No autorizado",
        "E_REQUEST_ACCOUNT": "Error al solicitar una nueva cuenta."
    },
    "buttons": {
        "cancel": "Cancelar",
        "submit": "Enviar"
    },
    "requestOneButton": "Solicitar uno",
    "signIn": "Iniciar sesión",
    "signOut": "Cerrar sesión",
    "changePassword": "Cambiar la contraseña",
    "forgotPassword": "Olvidé la contraseña",
    "dontHaveAccount": "¿No tiene una cuenta?",
    "containers": {
        "authenticatedLayut": {
            "home": "Inicio",
            "signOut": "Cerrar sesión"
        },
        "changePassword": {
            "userPasswordError": "Su contraseña actual es incorrecta.",
            "error": "Error al actualizar su perfil, revise el formulario e intente nuevamente.",
            "success": "Actualizó con éxito su contraseña."
        },
        "CompleteTasterProfileForm": {
            "validation": {
                "fullnameRequire": "Se requiere su nombre completo",
                "birthYearRequire": "Se requiere su año de nacimiento",
                "birthYearMin": "Este año no es válido",
                "birthYearMax": "Es demasiado joven",
                "genderRequire": "Se requiere su género",
                "nationalityRequire": "Se requiere su país de residencia"
            }
        },
        "createAccount": {
            "additionalInfo": {
                "numberOfChildError": "El número de niños debe ser un número",
                "childrenAgesRequire": "Se requiere la edad de los niños",
                "childrenAgesMin": "Ingrese la edad de los niños",
                "incomeRangeRequire": "Debe seleccionar un rango de ingresos"
            },
            "personalInfo": {
                "recaptchaError": "Compruebe de nuevo"
            }
        },
        "forgotPassword": {
            "emailValid": "Esta no es una dirección de correo electrónico válida",
            "emailRequire": "Se requiere dirección de correo electrónico",
            "infoMessage": "Recibirá instrucciones en la dirección proporcionada.",
            "error": "Hubo un error al enviar el correo electrónico. Verifique la dirección provista e intente nuevamente."
        },
        "loginForm": {
            "incomingValidError": "Su correo electrónico o contraseña no es válido.",
            "incomingLoginError": "No se pudo iniciar sesión",
            "validation": {
                "emailValid": "El correo electrónico no es válido",
                "emailRequire": "Se requiere correo electrónico",
                "passwordMin": "La contraseña debe tener al menos 8 caracteres.",
                "passwordRequire": "Se requiere la contraseña"
            }
        },
        "newPasswordF": {
            "success": "Su contraseña se ha cambiado correctamente.",
            "error": "Se produjo un error al cambiar la contraseña.",
            "validation": {
                "passwordMin": "La contraseña debe tener al menos 8 caracteres.",
                "passwordRequire": "Se requiere la contraseña",
                "confirmMatch": "Las contraseñas no coinciden",
                "confirmRequire": "Se requiere confirmación de la contraseña"
            }
        },
        "profileLayout": {
            "privacy": "Privacidad",
            "changePassword": "Cambiar contraseña"
        },
        "requestAccountForm": {
            "firstName": "Se requiere su nombre.",
            "lastName": "Se requiere su nombre.",
            "companyName": "Este campo es obligatorio.",
            "number": "Se requiere su número de teléfono.",
            "code": "Se requiere el código telefónico de su país.",
            "emailValid": "No es un correo electrónico válido",
            "emailRequired": "Se requiere correo electrónico"
        },
        "completeTasterProfile": {
            "title": "Complete su perfil"
        },
        "page": {
            "operator": {
                "menu": {
                    "termsOfUse": "Términos de Uso"
                }
            },
            "notFound": {
                "styledText": "Lo sentimos, la página que visitó no existe."
            }
        },
        "surveyLogIn": {
            "loginTo": "Iniciar sesión en",
            "notARobot": "Confirme que no es un robot para poder comenzar.",
            "welcome": "¡Bienvenido a la degustación!",
            "pressToStart": "Presione el botón de abajo para comenzar.",
            "askForEmail": "Ingrese su correo electrónico para continuar.",
            "nextTimeDetails": "Si deja la degustación antes de completarla, puede continuar donde la dejó ingresando su correo electrónico en la página de inicio.",
            "accessLogin": "Si tiene acceso a esta encuesta, inicie sesión primero.",
            "surveyAvailable": "Esta encuesta solo está disponible para usuarios específicos.",
            "notSelectedToParticipate": "No se encuentra entre los usuarios seleccionados para participar en esta encuesta."
        },
        "userProfile": {
            "mainTitle": "Mi perfil",
            "tabs": {
                "personal": "Datos personales",
                "password": "Cambiar contraseña",
                "privacy": "Privacidad"
            },
            "validations": {
                "password": {
                    "currentPassword": {
                        "minChars": "La contraseña debe tener al menos 8 caracteres.",
                        "required": "Se requiere la contraseña actual.",
                        "sameAsBefore": "La nueva contraseña debe ser diferente de la actual."
                    },
                    "newPassword": {
                        "minChars": "La nueva contraseña debe tener al menos 8 caracteres.",
                        "required": "Se requiere una nueva contraseña."
                    },
                    "confirmNewPassword": {
                        "shouldMatch": "La nueva contraseña no coincide.",
                        "required": "Se requiere confirmación de la contraseña."
                    }
                }
            },
            "messages": {
                "password": {
                    "success": "La contraseña se actualizó correctamente.",
                    "error": "La contraseña actual no es correcta."
                }
            }
        },
        "useSurveyValidate": {
            "showOnlyMandatoryQuestionErrors": "Se requiere al menos una pregunta."
        },
        "surveyStats": {
            "productsTab": {
                "maxNumberError": "Debe seleccionar un mínimo de {{minNumber}} producto(s) y un máximo de {{maxNumber}}. Actualmente tiene {{currentNumber}} producto(s) seleccionado(s)."
            }
        },
        "surveySharing": {
            "shareTextFirst": "¡Comparta esta degustación y gane {{amount}} por cada amigo que recomiende y la complete!",
            "shareTextMiddle": "aquí",
            "shareTextLast": " para copiar su enlace para compartir.",
            "copiedMessage": "Enlace copiado al portapapeles.",
            " shareTextMiddle": "Haga clic aquí para copiar su enlace para compartir."
        }
    },
    "validation": {
        "currentPassword": {
            "required": "Ingrese la contraseña actual"
        },
        "confirmPassword": {
            "required": "Ingrese la nueva contraseña"
        },
        "newPassword": {
            "required": "¡Confirme su contraseña!"
        },
        "userForm": {
            "email": {
                "required": "Se requiere correo electrónico"
            },
            "fullName": {
                "required": "Se requiere el nombre completo",
                "nameWithoutSpaces": "El nombre completo no debe comenzar con espacios en blanco"
            }
        }
    },
    "profileLink": "Perfil",
    "requestAccount": "Solicitar un",
    "requestAccountOr": "o regístrese para ser un",
    "requestOperatorAccount": "Cuenta de usuario",
    "requestTasterAccount": "Degustador",
    "countAnswer": "{{count}} respuesta",
    "countAnswer_plural": "{{count}} respuestas"
}