// Jest Snapshot v1, https://goo.gl/fbAQLP

exports[`CreationButtonContainer should render CreationButtonContainer 1`] = `
<styled.div>
  <TooltipWrapper
    onVisibleChange={[Function]}
    visible={false}
  >
    <CustomButton
      onClick={[Function]}
      rest={Object {}}
    >
      Create survey
    </CustomButton>
  </TooltipWrapper>
</styled.div>
`;
