// Jest Snapshot v1, https://goo.gl/fbAQLP

exports[`DeleteSurveyButton should render DeleteSurveyButton 1`] = `
<ApolloProvider
  client={MockedClient {}}
>
  <Router
    history={
      Object {
        "action": "POP",
        "block": [Function],
        "createHref": [Function],
        "go": [Function],
        "goBack": [Function],
        "goForward": [Function],
        "length": 1,
        "listen": [Function],
        "location": Object {
          "hash": "",
          "pathname": "/",
          "search": "",
          "state": undefined,
        },
        "push": [Function],
        "replace": [Function],
      }
    }
  >
    <withRouter(DeleteSurveyButton)
      onMenuItemClick={[Function]}
      state="draft"
      surveyId="survey-1"
    >
      <Route>
        <DeleteSurveyButton
          history={
            Object {
              "action": "POP",
              "block": [Function],
              "createHref": [Function],
              "go": [Function],
              "goBack": [Function],
              "goForward": [Function],
              "length": 1,
              "listen": [Function],
              "location": Object {
                "hash": "",
                "pathname": "/",
                "search": "",
                "state": undefined,
              },
              "push": [Function],
              "replace": [Function],
            }
          }
          location={
            Object {
              "hash": "",
              "pathname": "/",
              "search": "",
              "state": undefined,
            }
          }
          match={
            Object {
              "isExact": true,
              "params": Object {},
              "path": "/",
              "url": "/",
            }
          }
          onMenuItemClick={[Function]}
          state="draft"
          surveyId="survey-1"
        >
          <Text
            onClick={[Function]}
          >
            <styled.span
              onClick={[Function]}
            >
              <span
                className="sc-bdVaJa lbzbgo"
                onClick={[Function]}
              >
                Delete survey
              </span>
            </styled.span>
          </Text>
        </DeleteSurveyButton>
      </Route>
    </withRouter(DeleteSurveyButton)>
  </Router>
</ApolloProvider>
`;
