// Jest Snapshot v1, https://goo.gl/fbAQLP

exports[`MapChart should render MapChart 1`] = `
<MapChart
  chartIndex={1}
  inputData={
    Object {
      "chart_id": "121",
      "chart_type": "map",
      "country_geo_data": Object {
        "features": Array [
          Object {
            "properties": Object {
              "value": 0,
            },
          },
          Object {
            "properties": Object {
              "value": 0,
            },
          },
          Object {
            "properties": Object {
              "value": 0,
            },
          },
          Object {
            "properties": Object {
              "value": 0,
            },
          },
        ],
      },
      "labels": Array [
        "Alabama",
        "Alaska",
        "Arizona",
      ],
      "results": Object {
        "data": Array [
          Object {
            "label": "Alabama",
            "value": 2,
          },
          Object {
            "label": "Alaska",
            "value": 2,
          },
          Object {
            "label": "Arizona",
            "value": 9,
          },
        ],
      },
      "title": "What state do you live in?",
      "trial": "",
    }
  }
>
  <Styled(styled.div)>
    <styled.div
      className="sc-htoDjs ffoOHv"
    >
      <div
        className="sc-htoDjs ffoOHv sc-bwzfXH hmimBi"
      >
        <div
          id="geochart_121"
        />
      </div>
    </styled.div>
  </Styled(styled.div)>
</MapChart>
`;

exports[`MapChart should render MapChart 2`] = `"<div id=\\"geochart_121\\"><div class=\\"geochart_121\\"><svg width=\\"NaN\\" height=\\"NaN\\"><g class=\\"countryShapes\\"><path class=\\"mapShape\\" style=\\"stroke: #eee; stroke-width: 0.5; fill: #eee;\\"></path><path class=\\"mapShape\\" style=\\"stroke: #eee; stroke-width: 0.5; fill: #eee;\\"></path><path class=\\"mapShape\\" style=\\"stroke: #eee; stroke-width: 0.5; fill: #eee;\\"></path><path class=\\"mapShape\\" style=\\"stroke: #eee; stroke-width: 0.5; fill: #eee;\\"></path></g><g class=\\"mapLabels\\"></g><g class=\\"mouseListeners\\"><path style=\\"opacity: 0;\\"></path><path style=\\"opacity: 0;\\"></path><path style=\\"opacity: 0;\\"></path><path style=\\"opacity: 0;\\"></path></g></svg></div></div>"`;

exports[`MapChart should render MapChart 3`] = `"<div id=\\"geochart_121\\"><div class=\\"geochart_121\\"><svg width=\\"NaN\\" height=\\"NaN\\"><g class=\\"countryShapes\\"><path class=\\"mapShape\\" style=\\"stroke: #eee; stroke-width: 0.5; fill: #eee;\\"></path><path class=\\"mapShape\\" style=\\"stroke: #eee; stroke-width: 0.5; fill: #eee;\\"></path><path class=\\"mapShape\\" style=\\"stroke: #eee; stroke-width: 0.5; fill: #eee;\\"></path><path class=\\"mapShape\\" style=\\"stroke: #eee; stroke-width: 0.5; fill: #eee;\\"></path></g><g class=\\"mapLabels\\"></g><g class=\\"mouseListeners\\"><path style=\\"opacity: 0;\\"></path><path style=\\"opacity: 0;\\"></path><path style=\\"opacity: 0;\\"></path><path style=\\"opacity: 0;\\"></path></g></svg></div></div>"`;
