// Jest Snapshot v1, https://goo.gl/fbAQLP

exports[`Divider should render Divider 1`] = `
<Row
  gutter={0}
>
  <Col
    xs={
      Object {
        "span": 24,
      }
    }
  >
    <DividerLine />
  </Col>
</Row>
`;
