// Jest Snapshot v1, https://goo.gl/fbAQLP

exports[`MarketingEmails should render MarketingEmails 1`] = `
<ToggableSetting
  defaultChecked={true}
  description="components.privacyForm.marketingEmails.description"
  handleChange={[Function]}
  icon={<Email />}
  title="components.privacyForm.marketingEmails.title"
/>
`;
