{
  "privacyPolicy": "Politique de confidentialité",
  "resetPassword": {
    "subject": "Reset your password",
    "content": "<div class=\"heading1\">Reset password</div>\n  <div class=\"text align-left\">Dear User,</div>\n  <div class=\"text align-left\">To reset your password please click the button bellow. You'll be taken\n    into a webpage where you'll be able to choose a new password.</div>\n  <div class=\"btn-group\">\n    <a class=\"btn btn-primary\"\n      href=\"__RESET_LINK__\">Reset\n      password</a>\n  </div>"
  },
  "newAccount": {
    "subject": "Welcome To Flavorwiki",
    "content": "<div class=\"heading1\">New Account</div>\n  <div class=\"text align-left\">Dear User,</div>\n  <div class=\"text align-left\">Welcome to Flavorwiki.</div>"
  },
  "surveyRejected": {
    "subject": "Rejected from survey",
    "content": "Merci d'avoir participé à cette enquête. <br> <br> Si vous partagez le lien ci-dessous avec vos amis, vous pouvez gagner une EXTRA <strong> {{SSHARING_REWARD}} </strong> récompense en argent pour chaque ami que vous recommandez et qui termine la dégustation. <br> <br> {{SHARING_LINK}} <br> <br> Si vous avez des questions, veuillez envoyer un e-mail à <a href=\"mailto:support@flavorwiki.com\"> support@flavorwiki.com </a> . <br> <br> Bonne dégustation! <br> L'équipe FlavorWiki"
  }
}
