// Jest Snapshot v1, https://goo.gl/fbAQLP

exports[`LoginCarousel should render LoginCarousel 1`] = `
<LoginCarousel
  match={
    Object {
      "params": Object {
        "step": 1,
      },
    }
  }
>
  <Carousel
    renderSlideBottomContent={[Function]}
    renderSlideTopContent={[Function]}
    slides={
      Array [
        "1.png",
        "2.png",
        "3.png",
        "4.png",
        "5.png",
        "6.png",
      ]
    }
  >
    <Carousel
      afterSlide={[Function]}
      autoGenerateStyleTag={true}
      autoplay={true}
      autoplayInterval={5000}
      autoplayReverse={false}
      beforeSlide={[Function]}
      cellAlign="left"
      cellSpacing={0}
      defaultControlsConfig={Object {}}
      disableAnimation={false}
      disableEdgeSwiping={false}
      dragging={true}
      easing="easeCircleOut"
      edgeEasing="easeElasticOut"
      enableKeyboardControls={false}
      frameOverflow="hidden"
      framePadding="0px"
      getControlsContainerStyles={[Function]}
      height="inherit"
      heightMode="max"
      keyCodeConfig={Object {}}
      onDragStart={[Function]}
      onResize={[Function]}
      pauseOnHover={true}
      renderAnnounceSlideMessage={[Function]}
      renderBottomCenterControls={[Function]}
      renderCenterLeftControls={[Function]}
      renderCenterRightControls={[Function]}
      scrollMode="remainder"
      slideIndex={0}
      slideListMargin={10}
      slideOffset={25}
      slideWidth={1}
      slidesToScroll={1}
      slidesToShow={1}
      speed={500}
      style={Object {}}
      swiping={true}
      transitionMode="scroll"
      vertical={false}
      width="100%"
      withoutControls={false}
      wrapAround={true}
    >
      <div
        className="slider"
        onBlur={[Function]}
        onFocus={[Function]}
        style={
          Object {
            "MozBoxSizing": "border-box",
            "boxSizing": "border-box",
            "display": "block",
            "height": "inherit",
            "position": "relative",
            "width": "100%",
          }
        }
        tabIndex={0}
      >
        <div
          className="slider-frame"
          onClickCapture={[Function]}
          onMouseDown={[Function]}
          onMouseLeave={[Function]}
          onMouseMove={[Function]}
          onMouseOut={[Function]}
          onMouseOver={[Function]}
          onMouseUp={[Function]}
          onTouchCancel={[Function]}
          onTouchEnd={[Function]}
          onTouchMove={[Function]}
          onTouchStart={[Function]}
          style={
            Object {
              "MozBoxSizing": "border-box",
              "WebkitTransform": "translate3d(0, 0, 0)",
              "boxSizing": "border-box",
              "display": "block",
              "height": "100%",
              "margin": "0px",
              "msTransform": "translate(0, 0)",
              "overflow": "hidden",
              "padding": 0,
              "position": "relative",
              "touchAction": "pinch-zoom pan-y",
              "transform": "translate3d(0, 0, 0)",
            }
          }
        >
          <Animate
            interpolation={[Function]}
            show={true}
            start={
              Object {
                "tx": 0,
                "ty": 0,
              }
            }
            update={[Function]}
          >
            <NodeGroup
              data={
                Array [
                  Object {
                    "tx": 0,
                    "ty": 0,
                  },
                ]
              }
              enter={[Function]}
              interpolation={[Function]}
              keyAccessor={[Function]}
              leave={[Function]}
              start={[Function]}
              update={[Function]}
            >
              <ScrollTransition
                cellAlign="left"
                cellSpacing={0}
                currentSlide={0}
                deltaX={0}
                deltaY={0}
                dragging={true}
                frameWidth={0}
                heightMode="max"
                isWrappingAround={false}
                left={0}
                slideCount={6}
                slideHeight={0}
                slideListMargin={10}
                slideOffset={25}
                slideWidth={0}
                slidesToScroll={1}
                slidesToShow={1}
                top={0}
                vertical={false}
                wrapAround={true}
                zoomScale={0.85}
              >
                <ul
                  className="slider-list"
                  style={
                    Object {
                      "MozBoxSizing": "border-box",
                      "WebkitTransform": "translate3d(0px, 0px, 0)",
                      "boxSizing": "border-box",
                      "cursor": "pointer",
                      "display": "block",
                      "height": 0,
                      "margin": "0px 0px",
                      "msTransform": "translate(0px, 0px)",
                      "padding": 0,
                      "position": "relative",
                      "touchAction": "pinch-zoom pan-y",
                      "transform": "translate3d(0px, 0px, 0)",
                      "width": "auto",
                    }
                  }
                >
                  <li
                    className="slider-slide slide-visible"
                    onClick={[Function]}
                    style={
                      Object {
                        "MozBoxSizing": "border-box",
                        "boxSizing": "border-box",
                        "display": "inline-block",
                        "height": "auto",
                        "left": 0,
                        "listStyleType": "none",
                        "marginBottom": "auto",
                        "marginLeft": 0,
                        "marginRight": 0,
                        "marginTop": "auto",
                        "position": "absolute",
                        "top": 0,
                        "transform": "scale(1)",
                        "transition": "transform .4s linear",
                        "verticalAlign": "top",
                        "width": 0,
                      }
                    }
                    tabIndex={-1}
                  >
                    <styled.div>
                      <div
                        className="sc-htpNat huERCN"
                      >
                        <styled.div>
                          <div
                            className="sc-bxivhb fifJXl"
                          />
                        </styled.div>
                        <styled.div>
                          <div
                            className="sc-ifAKCX dbjXZA"
                          />
                        </styled.div>
                        <styled.div
                          src="1.png"
                        >
                          <div
                            className="sc-gZMcBi fMwioi"
                            src="1.png"
                          />
                        </styled.div>
                      </div>
                    </styled.div>
                  </li>
                  <li
                    className="slider-slide"
                    onClick={[Function]}
                    style={
                      Object {
                        "MozBoxSizing": "border-box",
                        "boxSizing": "border-box",
                        "display": "inline-block",
                        "height": "auto",
                        "left": 0,
                        "listStyleType": "none",
                        "marginBottom": "auto",
                        "marginLeft": 0,
                        "marginRight": 0,
                        "marginTop": "auto",
                        "position": "absolute",
                        "top": 0,
                        "transform": "scale(1)",
                        "transition": "transform .4s linear",
                        "verticalAlign": "top",
                        "width": 0,
                      }
                    }
                    tabIndex={-1}
                  >
                    <styled.div>
                      <div
                        className="sc-htpNat huERCN"
                      >
                        <styled.div>
                          <div
                            className="sc-bxivhb fifJXl"
                          />
                        </styled.div>
                        <styled.div>
                          <div
                            className="sc-ifAKCX dbjXZA"
                          />
                        </styled.div>
                        <styled.div
                          src="2.png"
                        >
                          <div
                            className="sc-gZMcBi fVUgiV"
                            src="2.png"
                          />
                        </styled.div>
                      </div>
                    </styled.div>
                  </li>
                  <li
                    className="slider-slide"
                    onClick={[Function]}
                    style={
                      Object {
                        "MozBoxSizing": "border-box",
                        "boxSizing": "border-box",
                        "display": "inline-block",
                        "height": "auto",
                        "left": 0,
                        "listStyleType": "none",
                        "marginBottom": "auto",
                        "marginLeft": 0,
                        "marginRight": 0,
                        "marginTop": "auto",
                        "position": "absolute",
                        "top": 0,
                        "transform": "scale(1)",
                        "transition": "transform .4s linear",
                        "verticalAlign": "top",
                        "width": 0,
                      }
                    }
                    tabIndex={-1}
                  >
                    <styled.div>
                      <div
                        className="sc-htpNat huERCN"
                      >
                        <styled.div>
                          <div
                            className="sc-bxivhb fifJXl"
                          />
                        </styled.div>
                        <styled.div>
                          <div
                            className="sc-ifAKCX dbjXZA"
                          />
                        </styled.div>
                        <styled.div
                          src="3.png"
                        >
                          <div
                            className="sc-gZMcBi jVDrmE"
                            src="3.png"
                          />
                        </styled.div>
                      </div>
                    </styled.div>
                  </li>
                  <li
                    className="slider-slide"
                    onClick={[Function]}
                    style={
                      Object {
                        "MozBoxSizing": "border-box",
                        "boxSizing": "border-box",
                        "display": "inline-block",
                        "height": "auto",
                        "left": 0,
                        "listStyleType": "none",
                        "marginBottom": "auto",
                        "marginLeft": 0,
                        "marginRight": 0,
                        "marginTop": "auto",
                        "position": "absolute",
                        "top": 0,
                        "transform": "scale(1)",
                        "transition": "transform .4s linear",
                        "verticalAlign": "top",
                        "width": 0,
                      }
                    }
                    tabIndex={-1}
                  >
                    <styled.div>
                      <div
                        className="sc-htpNat huERCN"
                      >
                        <styled.div>
                          <div
                            className="sc-bxivhb fifJXl"
                          />
                        </styled.div>
                        <styled.div>
                          <div
                            className="sc-ifAKCX dbjXZA"
                          />
                        </styled.div>
                        <styled.div
                          src="4.png"
                        >
                          <div
                            className="sc-gZMcBi kdowjC"
                            src="4.png"
                          />
                        </styled.div>
                      </div>
                    </styled.div>
                  </li>
                  <li
                    className="slider-slide"
                    onClick={[Function]}
                    style={
                      Object {
                        "MozBoxSizing": "border-box",
                        "boxSizing": "border-box",
                        "display": "inline-block",
                        "height": "auto",
                        "left": 0,
                        "listStyleType": "none",
                        "marginBottom": "auto",
                        "marginLeft": 0,
                        "marginRight": 0,
                        "marginTop": "auto",
                        "position": "absolute",
                        "top": 0,
                        "transform": "scale(1)",
                        "transition": "transform .4s linear",
                        "verticalAlign": "top",
                        "width": 0,
                      }
                    }
                    tabIndex={-1}
                  >
                    <styled.div>
                      <div
                        className="sc-htpNat huERCN"
                      >
                        <styled.div>
                          <div
                            className="sc-bxivhb fifJXl"
                          />
                        </styled.div>
                        <styled.div>
                          <div
                            className="sc-ifAKCX dbjXZA"
                          />
                        </styled.div>
                        <styled.div
                          src="5.png"
                        >
                          <div
                            className="sc-gZMcBi bJVxaD"
                            src="5.png"
                          />
                        </styled.div>
                      </div>
                    </styled.div>
                  </li>
                  <li
                    className="slider-slide"
                    onClick={[Function]}
                    style={
                      Object {
                        "MozBoxSizing": "border-box",
                        "boxSizing": "border-box",
                        "display": "inline-block",
                        "height": "auto",
                        "left": 0,
                        "listStyleType": "none",
                        "marginBottom": "auto",
                        "marginLeft": 0,
                        "marginRight": 0,
                        "marginTop": "auto",
                        "position": "absolute",
                        "top": 0,
                        "transform": "scale(1)",
                        "transition": "transform .4s linear",
                        "verticalAlign": "top",
                        "width": 0,
                      }
                    }
                    tabIndex={-1}
                  >
                    <styled.div>
                      <div
                        className="sc-htpNat huERCN"
                      >
                        <styled.div>
                          <div
                            className="sc-bxivhb fifJXl"
                          />
                        </styled.div>
                        <styled.div>
                          <div
                            className="sc-ifAKCX dbjXZA"
                          />
                        </styled.div>
                        <styled.div
                          src="6.png"
                        >
                          <div
                            className="sc-gZMcBi cuuRqR"
                            src="6.png"
                          />
                        </styled.div>
                      </div>
                    </styled.div>
                  </li>
                </ul>
              </ScrollTransition>
            </NodeGroup>
          </Animate>
        </div>
        <div
          className="slider-control-bottomcenter"
          style={
            Object {
              "WebkitTransform": "translateX(-50%)",
              "bottom": 0,
              "left": "50%",
              "msTransform": "translateX(-50%)",
              "position": "absolute",
              "transform": "translateX(-50%)",
            }
          }
        >
          <Dots
            currentSlide={0}
            goToSlide={[Function]}
            slideCount={6}
          >
            <styled.div>
              <div
                className="sc-bdVaJa bpvTV"
              >
                <styled.div
                  active={true}
                  last={false}
                  onClick={[Function]}
                >
                  <div
                    className="sc-bwzfXH kxsqDD"
                    onClick={[Function]}
                  />
                </styled.div>
                <styled.div
                  active={false}
                  last={false}
                  onClick={[Function]}
                >
                  <div
                    className="sc-bwzfXH cBohum"
                    onClick={[Function]}
                  />
                </styled.div>
                <styled.div
                  active={false}
                  last={false}
                  onClick={[Function]}
                >
                  <div
                    className="sc-bwzfXH cBohum"
                    onClick={[Function]}
                  />
                </styled.div>
                <styled.div
                  active={false}
                  last={false}
                  onClick={[Function]}
                >
                  <div
                    className="sc-bwzfXH cBohum"
                    onClick={[Function]}
                  />
                </styled.div>
                <styled.div
                  active={false}
                  last={false}
                  onClick={[Function]}
                >
                  <div
                    className="sc-bwzfXH cBohum"
                    onClick={[Function]}
                  />
                </styled.div>
                <styled.div
                  active={false}
                  last={true}
                  onClick={[Function]}
                >
                  <div
                    className="sc-bwzfXH gxbbMh"
                    onClick={[Function]}
                  />
                </styled.div>
              </div>
            </styled.div>
          </Dots>
        </div>
        <style
          dangerouslySetInnerHTML={
            Object {
              "__html": ".slider-slide > img { width: 100%; display: block; }
                      .slider-slide > img:focus { margin: auto; }",
            }
          }
          type="text/css"
        />
      </div>
    </Carousel>
  </Carousel>
</LoginCarousel>
`;

exports[`LoginCarousel should render LoginCarousel 2`] = `
<LoginCarousel
  match={
    Object {
      "params": Object {
        "step": "create-account",
      },
    }
  }
>
  <Carousel
    renderSlideBottomContent={[Function]}
    renderSlideTopContent={[Function]}
    slides={
      Array [
        "1.png",
        "2.png",
        "3.png",
        "4.png",
      ]
    }
  >
    <Carousel
      afterSlide={[Function]}
      autoGenerateStyleTag={true}
      autoplay={true}
      autoplayInterval={5000}
      autoplayReverse={false}
      beforeSlide={[Function]}
      cellAlign="left"
      cellSpacing={0}
      defaultControlsConfig={Object {}}
      disableAnimation={false}
      disableEdgeSwiping={false}
      dragging={true}
      easing="easeCircleOut"
      edgeEasing="easeElasticOut"
      enableKeyboardControls={false}
      frameOverflow="hidden"
      framePadding="0px"
      getControlsContainerStyles={[Function]}
      height="inherit"
      heightMode="max"
      keyCodeConfig={Object {}}
      onDragStart={[Function]}
      onResize={[Function]}
      pauseOnHover={true}
      renderAnnounceSlideMessage={[Function]}
      renderBottomCenterControls={[Function]}
      renderCenterLeftControls={[Function]}
      renderCenterRightControls={[Function]}
      scrollMode="remainder"
      slideIndex={0}
      slideListMargin={10}
      slideOffset={25}
      slideWidth={1}
      slidesToScroll={1}
      slidesToShow={1}
      speed={500}
      style={Object {}}
      swiping={true}
      transitionMode="scroll"
      vertical={false}
      width="100%"
      withoutControls={false}
      wrapAround={true}
    >
      <div
        className="slider"
        onBlur={[Function]}
        onFocus={[Function]}
        style={
          Object {
            "MozBoxSizing": "border-box",
            "boxSizing": "border-box",
            "display": "block",
            "height": "inherit",
            "position": "relative",
            "width": "100%",
          }
        }
        tabIndex={0}
      >
        <div
          className="slider-frame"
          onClickCapture={[Function]}
          onMouseDown={[Function]}
          onMouseLeave={[Function]}
          onMouseMove={[Function]}
          onMouseOut={[Function]}
          onMouseOver={[Function]}
          onMouseUp={[Function]}
          onTouchCancel={[Function]}
          onTouchEnd={[Function]}
          onTouchMove={[Function]}
          onTouchStart={[Function]}
          style={
            Object {
              "MozBoxSizing": "border-box",
              "WebkitTransform": "translate3d(0, 0, 0)",
              "boxSizing": "border-box",
              "display": "block",
              "height": "100%",
              "margin": "0px",
              "msTransform": "translate(0, 0)",
              "overflow": "hidden",
              "padding": 0,
              "position": "relative",
              "touchAction": "pinch-zoom pan-y",
              "transform": "translate3d(0, 0, 0)",
            }
          }
        >
          <Animate
            interpolation={[Function]}
            show={true}
            start={
              Object {
                "tx": 0,
                "ty": 0,
              }
            }
            update={[Function]}
          >
            <NodeGroup
              data={
                Array [
                  Object {
                    "tx": 0,
                    "ty": 0,
                  },
                ]
              }
              enter={[Function]}
              interpolation={[Function]}
              keyAccessor={[Function]}
              leave={[Function]}
              start={[Function]}
              update={[Function]}
            >
              <ScrollTransition
                cellAlign="left"
                cellSpacing={0}
                currentSlide={0}
                deltaX={0}
                deltaY={0}
                dragging={true}
                frameWidth={0}
                heightMode="max"
                isWrappingAround={false}
                left={0}
                slideCount={4}
                slideHeight={0}
                slideListMargin={10}
                slideOffset={25}
                slideWidth={0}
                slidesToScroll={1}
                slidesToShow={1}
                top={0}
                vertical={false}
                wrapAround={true}
                zoomScale={0.85}
              >
                <ul
                  className="slider-list"
                  style={
                    Object {
                      "MozBoxSizing": "border-box",
                      "WebkitTransform": "translate3d(0px, 0px, 0)",
                      "boxSizing": "border-box",
                      "cursor": "pointer",
                      "display": "block",
                      "height": 0,
                      "margin": "0px 0px",
                      "msTransform": "translate(0px, 0px)",
                      "padding": 0,
                      "position": "relative",
                      "touchAction": "pinch-zoom pan-y",
                      "transform": "translate3d(0px, 0px, 0)",
                      "width": "auto",
                    }
                  }
                >
                  <li
                    className="slider-slide slide-visible"
                    onClick={[Function]}
                    style={
                      Object {
                        "MozBoxSizing": "border-box",
                        "boxSizing": "border-box",
                        "display": "inline-block",
                        "height": "auto",
                        "left": 0,
                        "listStyleType": "none",
                        "marginBottom": "auto",
                        "marginLeft": 0,
                        "marginRight": 0,
                        "marginTop": "auto",
                        "position": "absolute",
                        "top": 0,
                        "transform": "scale(1)",
                        "transition": "transform .4s linear",
                        "verticalAlign": "top",
                        "width": 0,
                      }
                    }
                    tabIndex={-1}
                  >
                    <styled.div>
                      <div
                        className="sc-htpNat huERCN"
                      >
                        <styled.div>
                          <div
                            className="sc-bxivhb fifJXl"
                          >
                            <OnboardingIllustration
                              illustration="illus1.svg"
                              text="containers.page.onboarding.loginCarousel.text.welcomeText"
                              title="containers.page.onboarding.loginCarousel.titles.welcome"
                            >
                              <styled.div>
                                <div
                                  className="sc-EHOje fVRIkV"
                                >
                                  <styled.img
                                    src="illus1.svg"
                                  >
                                    <img
                                      className="sc-bZQynM UDDll"
                                      src="illus1.svg"
                                    />
                                  </styled.img>
                                  <Styled(styled.span)>
                                    <styled.span
                                      className="sc-dnqmqq gvwBEa"
                                    >
                                      <span
                                        className="sc-dnqmqq gvwBEa sc-htoDjs iPvtJo"
                                      >
                                        containers.page.onboarding.loginCarousel.titles.welcome
                                      </span>
                                    </styled.span>
                                  </Styled(styled.span)>
                                  <Styled(styled.span)>
                                    <styled.span
                                      className="sc-iwsKbI koezya"
                                    >
                                      <span
                                        className="sc-iwsKbI koezya sc-htoDjs iPvtJo"
                                      >
                                        containers.page.onboarding.loginCarousel.text.welcomeText
                                      </span>
                                    </styled.span>
                                  </Styled(styled.span)>
                                </div>
                              </styled.div>
                            </OnboardingIllustration>
                          </div>
                        </styled.div>
                        <styled.div>
                          <div
                            className="sc-ifAKCX dbjXZA"
                          />
                        </styled.div>
                        <styled.div
                          src="1.png"
                        >
                          <div
                            className="sc-gZMcBi fMwioi"
                            src="1.png"
                          />
                        </styled.div>
                      </div>
                    </styled.div>
                  </li>
                  <li
                    className="slider-slide"
                    onClick={[Function]}
                    style={
                      Object {
                        "MozBoxSizing": "border-box",
                        "boxSizing": "border-box",
                        "display": "inline-block",
                        "height": "auto",
                        "left": 0,
                        "listStyleType": "none",
                        "marginBottom": "auto",
                        "marginLeft": 0,
                        "marginRight": 0,
                        "marginTop": "auto",
                        "position": "absolute",
                        "top": 0,
                        "transform": "scale(1)",
                        "transition": "transform .4s linear",
                        "verticalAlign": "top",
                        "width": 0,
                      }
                    }
                    tabIndex={-1}
                  >
                    <styled.div>
                      <div
                        className="sc-htpNat huERCN"
                      >
                        <styled.div>
                          <div
                            className="sc-bxivhb fifJXl"
                          >
                            <OnboardingIllustration
                              illustration="illus2.svg"
                              text="containers.page.onboarding.loginCarousel.text.discoverProductText"
                              title="containers.page.onboarding.loginCarousel.titles.discoverProduct"
                            >
                              <styled.div>
                                <div
                                  className="sc-EHOje fVRIkV"
                                >
                                  <styled.img
                                    src="illus2.svg"
                                  >
                                    <img
                                      className="sc-bZQynM UDDll"
                                      src="illus2.svg"
                                    />
                                  </styled.img>
                                  <Styled(styled.span)>
                                    <styled.span
                                      className="sc-dnqmqq gvwBEa"
                                    >
                                      <span
                                        className="sc-dnqmqq gvwBEa sc-htoDjs iPvtJo"
                                      >
                                        containers.page.onboarding.loginCarousel.titles.discoverProduct
                                      </span>
                                    </styled.span>
                                  </Styled(styled.span)>
                                  <Styled(styled.span)>
                                    <styled.span
                                      className="sc-iwsKbI koezya"
                                    >
                                      <span
                                        className="sc-iwsKbI koezya sc-htoDjs iPvtJo"
                                      >
                                        containers.page.onboarding.loginCarousel.text.discoverProductText
                                      </span>
                                    </styled.span>
                                  </Styled(styled.span)>
                                </div>
                              </styled.div>
                            </OnboardingIllustration>
                          </div>
                        </styled.div>
                        <styled.div>
                          <div
                            className="sc-ifAKCX dbjXZA"
                          />
                        </styled.div>
                        <styled.div
                          src="2.png"
                        >
                          <div
                            className="sc-gZMcBi fVUgiV"
                            src="2.png"
                          />
                        </styled.div>
                      </div>
                    </styled.div>
                  </li>
                  <li
                    className="slider-slide"
                    onClick={[Function]}
                    style={
                      Object {
                        "MozBoxSizing": "border-box",
                        "boxSizing": "border-box",
                        "display": "inline-block",
                        "height": "auto",
                        "left": 0,
                        "listStyleType": "none",
                        "marginBottom": "auto",
                        "marginLeft": 0,
                        "marginRight": 0,
                        "marginTop": "auto",
                        "position": "absolute",
                        "top": 0,
                        "transform": "scale(1)",
                        "transition": "transform .4s linear",
                        "verticalAlign": "top",
                        "width": 0,
                      }
                    }
                    tabIndex={-1}
                  >
                    <styled.div>
                      <div
                        className="sc-htpNat huERCN"
                      >
                        <styled.div>
                          <div
                            className="sc-bxivhb fifJXl"
                          >
                            <OnboardingIllustration
                              illustration="illus3.svg"
                              text="containers.page.onboarding.loginCarousel.text.buyProductText"
                              title="containers.page.onboarding.loginCarousel.titles.buyProduct"
                            >
                              <styled.div>
                                <div
                                  className="sc-EHOje fVRIkV"
                                >
                                  <styled.img
                                    src="illus3.svg"
                                  >
                                    <img
                                      className="sc-bZQynM UDDll"
                                      src="illus3.svg"
                                    />
                                  </styled.img>
                                  <Styled(styled.span)>
                                    <styled.span
                                      className="sc-dnqmqq gvwBEa"
                                    >
                                      <span
                                        className="sc-dnqmqq gvwBEa sc-htoDjs iPvtJo"
                                      >
                                        containers.page.onboarding.loginCarousel.titles.buyProduct
                                      </span>
                                    </styled.span>
                                  </Styled(styled.span)>
                                  <Styled(styled.span)>
                                    <styled.span
                                      className="sc-iwsKbI koezya"
                                    >
                                      <span
                                        className="sc-iwsKbI koezya sc-htoDjs iPvtJo"
                                      >
                                        containers.page.onboarding.loginCarousel.text.buyProductText
                                      </span>
                                    </styled.span>
                                  </Styled(styled.span)>
                                </div>
                              </styled.div>
                            </OnboardingIllustration>
                          </div>
                        </styled.div>
                        <styled.div>
                          <div
                            className="sc-ifAKCX dbjXZA"
                          />
                        </styled.div>
                        <styled.div
                          src="3.png"
                        >
                          <div
                            className="sc-gZMcBi jVDrmE"
                            src="3.png"
                          />
                        </styled.div>
                      </div>
                    </styled.div>
                  </li>
                  <li
                    className="slider-slide"
                    onClick={[Function]}
                    style={
                      Object {
                        "MozBoxSizing": "border-box",
                        "boxSizing": "border-box",
                        "display": "inline-block",
                        "height": "auto",
                        "left": 0,
                        "listStyleType": "none",
                        "marginBottom": "auto",
                        "marginLeft": 0,
                        "marginRight": 0,
                        "marginTop": "auto",
                        "position": "absolute",
                        "top": 0,
                        "transform": "scale(1)",
                        "transition": "transform .4s linear",
                        "verticalAlign": "top",
                        "width": 0,
                      }
                    }
                    tabIndex={-1}
                  >
                    <styled.div>
                      <div
                        className="sc-htpNat huERCN"
                      >
                        <styled.div>
                          <div
                            className="sc-bxivhb fifJXl"
                          >
                            <OnboardingIllustration
                              illustration="illus4.svg"
                              text="containers.page.onboarding.loginCarousel.text.cashInText"
                              title="containers.page.onboarding.loginCarousel.titles.cashIn"
                            >
                              <styled.div>
                                <div
                                  className="sc-EHOje fVRIkV"
                                >
                                  <styled.img
                                    src="illus4.svg"
                                  >
                                    <img
                                      className="sc-bZQynM UDDll"
                                      src="illus4.svg"
                                    />
                                  </styled.img>
                                  <Styled(styled.span)>
                                    <styled.span
                                      className="sc-dnqmqq gvwBEa"
                                    >
                                      <span
                                        className="sc-dnqmqq gvwBEa sc-htoDjs iPvtJo"
                                      >
                                        containers.page.onboarding.loginCarousel.titles.cashIn
                                      </span>
                                    </styled.span>
                                  </Styled(styled.span)>
                                  <Styled(styled.span)>
                                    <styled.span
                                      className="sc-iwsKbI koezya"
                                    >
                                      <span
                                        className="sc-iwsKbI koezya sc-htoDjs iPvtJo"
                                      >
                                        containers.page.onboarding.loginCarousel.text.cashInText
                                      </span>
                                    </styled.span>
                                  </Styled(styled.span)>
                                </div>
                              </styled.div>
                            </OnboardingIllustration>
                          </div>
                        </styled.div>
                        <styled.div>
                          <div
                            className="sc-ifAKCX dbjXZA"
                          />
                        </styled.div>
                        <styled.div
                          src="4.png"
                        >
                          <div
                            className="sc-gZMcBi kdowjC"
                            src="4.png"
                          />
                        </styled.div>
                      </div>
                    </styled.div>
                  </li>
                </ul>
              </ScrollTransition>
            </NodeGroup>
          </Animate>
        </div>
        <div
          className="slider-control-bottomcenter"
          style={
            Object {
              "WebkitTransform": "translateX(-50%)",
              "bottom": 0,
              "left": "50%",
              "msTransform": "translateX(-50%)",
              "position": "absolute",
              "transform": "translateX(-50%)",
            }
          }
        >
          <Dots
            currentSlide={0}
            goToSlide={[Function]}
            slideCount={4}
          >
            <styled.div>
              <div
                className="sc-bdVaJa bpvTV"
              >
                <styled.div
                  active={true}
                  last={false}
                  onClick={[Function]}
                >
                  <div
                    className="sc-bwzfXH kxsqDD"
                    onClick={[Function]}
                  />
                </styled.div>
                <styled.div
                  active={false}
                  last={false}
                  onClick={[Function]}
                >
                  <div
                    className="sc-bwzfXH cBohum"
                    onClick={[Function]}
                  />
                </styled.div>
                <styled.div
                  active={false}
                  last={false}
                  onClick={[Function]}
                >
                  <div
                    className="sc-bwzfXH cBohum"
                    onClick={[Function]}
                  />
                </styled.div>
                <styled.div
                  active={false}
                  last={true}
                  onClick={[Function]}
                >
                  <div
                    className="sc-bwzfXH gxbbMh"
                    onClick={[Function]}
                  />
                </styled.div>
              </div>
            </styled.div>
          </Dots>
        </div>
        <style
          dangerouslySetInnerHTML={
            Object {
              "__html": ".slider-slide > img { width: 100%; display: block; }
                      .slider-slide > img:focus { margin: auto; }",
            }
          }
          type="text/css"
        />
      </div>
    </Carousel>
  </Carousel>
</LoginCarousel>
`;
