// Jest Snapshot v1, https://goo.gl/fbAQLP

exports[`BankAccountCard should render BankAccountCard 1`] = `
<PaymentCard
  colors={
    Array [
      "#8aba5c",
      "#407b07",
    ]
  }
  logo={
    <Bank
      color="#ffffff"
    />
  }
  title="components.paymentDetailsForm.bankAccount"
/>
`;
