// Jest Snapshot v1, https://goo.gl/fbAQLP

exports[`Body should render Body 1`] = `
<Fragment>
  <Row
    gutter={0}
  >
    <Styled(Col)
      lg={
        Object {
          "offset": 6,
          "span": 12,
        }
      }
      xs={
        Object {
          "span": 24,
        }
      }
    >
      <Styled(Text)>
        <Styled(Text)>
          1
        </Styled(Text)>
        <Styled(Text)>
          Please be sure you have all of your selected products before starting the tasting.
        </Styled(Text)>
      </Styled(Text)>
      <Styled(Text)>
        <Styled(Text)>
          2
        </Styled(Text)>
        <Styled(Text)>
          Find a quiet place.
        </Styled(Text)>
      </Styled(Text)>
      <Styled(Text)>
        <Styled(Text)>
          3
        </Styled(Text)>
        <Styled(Text)>
          You will be given additional instructions during the tasting.
        </Styled(Text)>
      </Styled(Text)>
    </Styled(Col)>
  </Row>
  <Row
    gutter={0}
    justify="center"
    type="flex"
  >
    <Styled(Col)
      lg={
        Object {
          "span": 12,
        }
      }
      xs={
        Object {
          "span": 24,
        }
      }
    >
      <Styled(Text)
        dangerouslySetInnerHTML={
          Object {
            "__html": "When you are ready, click ‘Start Tasting’ below.",
          }
        }
      />
    </Styled(Col)>
  </Row>
</Fragment>
`;
