// Jest Snapshot v1, https://goo.gl/fbAQLP

exports[`Header should render Header 1`] = `
<Fragment>
  <Styled(Header)>
    <styled.div>
      <styled.button>
        <Icon
          type="menu-fold"
        />
      </styled.button>
    </styled.div>
    <withRouter(ActionsDropdown)
      username="Flovor-wiki"
    />
  </Styled(Header)>
  <withRouter(ImpersonateHeader) />
</Fragment>
`;
