// Jest Snapshot v1, https://goo.gl/fbAQLP

exports[`LoadSurvey should render 1`] = `
<ApolloProvider
  addTypename={false}
  client={MockedClient {}}
>
  <Router
    history={
      Object {
        "listen": [Function],
        "location": Object {
          "pathname": "",
        },
        "push": [Function],
        "replace": [Function],
      }
    }
  >
    <LoadSurvey
      location={
        Object {
          "pathname": "/operator/survey/edit/survey-1",
        }
      }
      match={
        Object {
          "params": Object {
            "surveyId": "survey-1",
          },
        }
      }
    >
      <FillerLoader
        loading={true}
      >
        <styled.div>
          <div
            className="sc-bdVaJa ldlKfG"
          >
            <Loader
              loading={true}
            >
              <Spin
                indicator={
                  <Icon
                    spin={true}
                    style={
                      Object {
                        "fontSize": 24,
                      }
                    }
                    type="loading"
                  />
                }
                size="default"
                spinning={true}
                wrapperClassName=""
              >
                <div
                  className="ant-spin ant-spin-spinning"
                >
                  <Icon
                    className="ant-spin-dot"
                    spin={true}
                    style={
                      Object {
                        "fontSize": 24,
                      }
                    }
                    type="loading"
                  >
                    <LocaleReceiver
                      componentName="Icon"
                    >
                      <i
                        aria-label="icon: loading"
                        className="anticon anticon-loading ant-spin-dot"
                        style={
                          Object {
                            "fontSize": 24,
                          }
                        }
                      >
                        <IconReact
                          className="anticon-spin"
                          type="loading-o"
                        >
                          <svg
                            aria-hidden="true"
                            className="anticon-spin"
                            data-icon="loading"
                            fill="currentColor"
                            focusable="false"
                            height="1em"
                            viewBox="0 0 1024 1024"
                            width="1em"
                          >
                            <path
                              d="M988 548c-19.9 0-36-16.1-36-36 0-59.4-11.6-117-34.6-171.3a440.45 440.45 0 0 0-94.3-139.9 437.71 437.71 0 0 0-139.9-94.3C629 83.6 571.4 72 512 72c-19.9 0-36-16.1-36-36s16.1-36 36-36c69.1 0 136.2 13.5 199.3 40.3C772.3 66 827 103 874 150c47 47 83.9 101.8 109.7 162.7 26.7 63.1 40.2 130.2 40.2 199.3.1 19.9-16 36-35.9 36z"
                            />
                          </svg>
                        </IconReact>
                      </i>
                    </LocaleReceiver>
                  </Icon>
                </div>
              </Spin>
            </Loader>
          </div>
        </styled.div>
      </FillerLoader>
    </LoadSurvey>
  </Router>
</ApolloProvider>
`;

exports[`LoadSurvey survey has Multiple Tastings 1`] = `
<ApolloProvider
  client={MockedClient {}}
>
  <Router
    history={
      Object {
        "listen": [Function],
        "location": Object {
          "pathname": "",
        },
        "push": [Function],
        "replace": [Function],
      }
    }
  >
    <LoadSurvey
      cation={true}
      location={
        Object {
          "pathname": "/operator/draft/edit/survey-1",
        }
      }
      match={
        Object {
          "params": Object {
            "surveyId": "survey-1",
          },
        }
      }
    >
      <FillerLoader
        loading={true}
      >
        <styled.div>
          <div
            className="sc-bdVaJa ldlKfG"
          >
            <Loader
              loading={true}
            >
              <Spin
                indicator={
                  <Icon
                    spin={true}
                    style={
                      Object {
                        "fontSize": 24,
                      }
                    }
                    type="loading"
                  />
                }
                size="default"
                spinning={true}
                wrapperClassName=""
              >
                <div
                  className="ant-spin ant-spin-spinning"
                >
                  <Icon
                    className="ant-spin-dot"
                    spin={true}
                    style={
                      Object {
                        "fontSize": 24,
                      }
                    }
                    type="loading"
                  >
                    <LocaleReceiver
                      componentName="Icon"
                    >
                      <i
                        aria-label="icon: loading"
                        className="anticon anticon-loading ant-spin-dot"
                        style={
                          Object {
                            "fontSize": 24,
                          }
                        }
                      >
                        <IconReact
                          className="anticon-spin"
                          type="loading-o"
                        >
                          <svg
                            aria-hidden="true"
                            className="anticon-spin"
                            data-icon="loading"
                            fill="currentColor"
                            focusable="false"
                            height="1em"
                            viewBox="0 0 1024 1024"
                            width="1em"
                          >
                            <path
                              d="M988 548c-19.9 0-36-16.1-36-36 0-59.4-11.6-117-34.6-171.3a440.45 440.45 0 0 0-94.3-139.9 437.71 437.71 0 0 0-139.9-94.3C629 83.6 571.4 72 512 72c-19.9 0-36-16.1-36-36s16.1-36 36-36c69.1 0 136.2 13.5 199.3 40.3C772.3 66 827 103 874 150c47 47 83.9 101.8 109.7 162.7 26.7 63.1 40.2 130.2 40.2 199.3.1 19.9-16 36-35.9 36z"
                            />
                          </svg>
                        </IconReact>
                      </i>
                    </LocaleReceiver>
                  </Icon>
                </div>
              </Spin>
            </Loader>
          </div>
        </styled.div>
      </FillerLoader>
    </LoadSurvey>
  </Router>
</ApolloProvider>
`;
