{
    "buttons": {
        "cancel": "취소",
        "submit": "제출"
    },
    "changePassword": "비밀번호 변경",
    "chartRegions": {
        "br": "",
        "ca": "",
        "de": "",
        "fr": "",
        "fr-dep": "",
        "uk": "",
        "us": ""
    },
    "charts": {
        "axis": {
            "stackedAnswerName": ""
        },
        "lineChart": {
            "answers": "",
            "percentage": ""
        },
        "noResults": "",
        "table": {
            "answer": "",
            "attribute": "",
            "mean": "",
            "score": "",
            "stdev": "",
            "value": ""
        },
        "tooltip": {
            "percentageOfProductGroup": "",
            "percentageOfTehGroup": "",
            "percentageOfTotal": "",
            "responses": "",
            "total": ""
        },
        "totalRespondents": ""
    },
    "chartTypes": {
        "bar": "",
        "column": "",
        "columns-mean": "",
        "horizontal-bars-mean": "",
        "line": "",
        "map": "",
        "no-chart": "",
        "pearson-table": "",
        "pie": "",
        "spearmann-table": "",
        "spider": "",
        "stacked-bar": "",
        "stacked-column": "",
        "stacked-column-horizontal-bars": "",
        "table": "",
        "tags-list": ""
    },
    "components": {
        "additionalInfo": {
            "childrenAgeLabel": "자녀의 연령",
            "childrenAgePlaceholder": "한 가지 옵션 선택",
            "childrenAtHome": "3 - 자녀 여부",
            "childrenAtHomeMsg": "자녀 수 입력",
            "childrenAtHomePlaceholder": "한 가지 옵션 선택",
            "dietaryPlaceholder": "한 가지 선택",
            "dietaryTitle": "6 - 식이 제한 사항",
            "ethnicity": "1 - 인종",
            "ethnicityPlaceholder": "한 가지 선택",
            "income": "2 - 소득",
            "incomePlaceholder": "통화",
            "incomeRangePlaceholder": "소득 범위",
            "productTypePlaceholder": "하나 이상 선택",
            "productTypeTitle": "5 - 제품 유형",
            "smokerPlaceholder": "",
            "smokerTitle": "4 - 흡연 여부",
            "updateButton": "정보 업데이트"
        },
        "alertModal": {
            "cancel": "취소",
            "delete": "삭제"
        },
        "backNavigation": {
            "back": "뒤로"
        },
        "bottomNavBar": {
            "steps": "{{currentStep}}\/{{totalSteps}}"
        },
        "changePassword": {
            "confirmPassword": "비밀번호 확인",
            "currentPassword": "현재 비밀번호",
            "forgotPasswordButton": "",
            "newPassword": "새 비밀번호",
            "passwordPrompt": "",
            "savePasswordButton": "비밀번호 저장"
        },
        "chooseMultipleSkipOptions": {
            "answersToBeSelected": "",
            "maxCondintionalOptions": "",
            "showQuestions": ""
        },
        "coverProduct": {
            "empty": "",
            "prompt": "",
            "remove": ""
        },
        "createQrCode": {
            "save": "저장"
        },
        "createTasterAccount": {
            "forms": {
                "first": {
                    "confirm": {
                        "label": "",
                        "placeholder": ""
                    },
                    "email": {
                        "label": "",
                        "placeholder": ""
                    },
                    "password": {
                        "label": "",
                        "placeholder": ""
                    }
                },
                "second": {
                    "country": {
                        "label": "",
                        "placeholder": ""
                    },
                    "dateofbirth": {
                        "label": "",
                        "placeholder": ""
                    },
                    "firstName": {
                        "label": "",
                        "placeholder": ""
                    },
                    "gender": {
                        "label": "",
                        "placeholder": ""
                    },
                    "langugage": {
                        "label": "",
                        "placeholder": ""
                    },
                    "lastName": {
                        "label": "",
                        "placeholder": ""
                    },
                    "state": {
                        "label": "",
                        "placeholder": ""
                    }
                },
                "third": {
                    "childrenAges": {
                        "label": "",
                        "placeholder": ""
                    },
                    "ethnicity": {
                        "label": "",
                        "placeholder": ""
                    },
                    "foodAllergies": {
                        "label": "",
                        "placeholder": ""
                    },
                    "incomeRange": {
                        "label": "",
                        "placeholder": ""
                    },
                    "marketResearchParticipation": {
                        "label": "",
                        "placeholder": ""
                    },
                    "numberOfChildren": {
                        "label": "",
                        "placeholder": ""
                    },
                    "paypalEmailAddress": {
                        "label": "",
                        "placeholder": ""
                    },
                    "smokerKind": {
                        "label": "",
                        "placeholder": ""
                    }
                }
            },
            "main": {
                "cancelText": "",
                "extraActionText": "",
                "nextStepDefault": "",
                "stepsText": ""
            },
            "steps": {
                "first": {
                    "description": "",
                    "okText": "",
                    "title": ""
                },
                "second": {
                    "description": "귀하에 대한 더 많은 정보를 알고 싶습니다.",
                    "okText": "다음 단계",
                    "title": "개인 정보"
                },
                "third": {
                    "description": "이 추가 정보는 귀하에게 가장 적합한 제품 설문 조사를 선택하는 데 도움이 됩니다.",
                    "okText": "저장",
                    "title": "추가 정보"
                }
            },
            "validations": {
                "first": {
                    "confirm": {
                        "oneOf": "",
                        "required": ""
                    },
                    "email": {
                        "required": "",
                        "valid": ""
                    },
                    "password": {
                        "min": "",
                        "required": ""
                    }
                },
                "second": {
                    "firstName": {
                        "required": ""
                    },
                    "lastName": {
                        "required": ""
                    }
                },
                "third": {
                    "childrenAges": {
                        "required": ""
                    },
                    "paypal": {
                        "required": "",
                        "valid": ""
                    }
                }
            }
        },
        "dasboard": {
            "survey": {
                "actions": {
                    "analyzeSurvey": "",
                    "photoValidation": "",
                    "shareStats": {
                        "modal": {
                            "title": ""
                        },
                        "success": {
                            "message": ""
                        }
                    }
                }
            }
        },
        "download": {
            "cancel": "",
            "checking": "",
            "download": "",
            "goToDashboard": "",
            "subTitle": "",
            "title": ""
        },
        "downloadMenu": {
            "downloadJpeg": "",
            "downloadPdf": "",
            "downloadPng": ""
        },
        "editQrCode": {
            "save": "업데이트"
        },
        "footer": {
            "aboutText": "FlavorWiki는 전 세계 식음료 업계가 소비자의 인식과 선호도를 신속하게 평가하도록 도와드립니다.",
            "privacyPolicy": "개인정보 처리방침",
            "termsAndConditions": "이용 약관"
        },
        "forgotPasswordForm": {
            "sendButton": "이메일 보내기"
        },
        "impersonate": {
            "impersonate": "",
            "impersonatedAs": "",
            "impersonateUser": "",
            "toGoToAdmin": ""
        },
        "inputArea": {
            "addImage": "",
            "linkTitle": ""
        },
        "inputList": {
            "addStep": ""
        },
        "maxProductStatCount": {
            "label": ""
        },
        "ongoingSurveysGrid": {
            "notFound": ""
        },
        "operatorQrCode": {
            "createQr": ""
        },
        "operatorQrCodeDownload": {
            "prompt": "",
            "title": ""
        },
        "operatorQrCodeForm": {
            "alert": {
                "description": "",
                "okText": "",
                "title": ""
            },
            "cancel": "",
            "copy": "",
            "download": "",
            "draft": "",
            "generateQrCodeNotice": "",
            "linkToSurvey": "",
            "linkToUrl": "",
            "name": "",
            "notFound": "",
            "suspended": "",
            "uniqueName": "",
            "uniqueNameHelper": "",
            "validate": {
                "name": {
                    "required": ""
                },
                "redirectLink": "",
                "survey": {
                    "required": ""
                },
                "targetLink": {
                    "required": "",
                    "urlValid": ""
                },
                "uniqueName": {
                    "matches": "",
                    "max": "",
                    "required": ""
                }
            }
        },
        "operatorSurveyDetailBar": {
            "after": "",
            "basics": "",
            "before": "",
            "emailSettings": "",
            "linkedSurveys": "",
            "payments": "",
            "products": "",
            "screening": "",
            "settings": "",
            "tasting": "",
            "tastingNotes": ""
        },
        "operatorSurveyDetailBarChrHansen": {
            "after": ""
        },
        "operatorSurveys": {
            "actions": "",
            "activeSurveys": "",
            "createNew": "",
            "multipleProducts": "",
            "multipleTastings": "",
            "screenerOnly": "",
            "singleProduct": "",
            "title": ""
        },
        "organizationForm": {
            "addedSuccessfully": "",
            "addTitle": "",
            "deletedSuccessfully": "",
            "editTitle": "",
            "organizationName": "",
            "uniqueName": "",
            "uniqueNameTooltip": {
                "add": "",
                "edit": ""
            },
            "updateSuccessfully": ""
        },
        "organizationsList": {
            "actionsColumnTitle": "",
            "add": "",
            "createdColumnTitle": "",
            "delete": "",
            "edit": "",
            "modifiedColumnTitle": "",
            "nameColumnTitle": "",
            "search": "",
            "usersColumnTitle": ""
        },
        "paymentDetailsForm": {
            "bankAccount": "",
            "bankAccountName": "",
            "bankAccountNumber": "",
            "bankBIC": "",
            "bankDescription": "",
            "bankIBAN": "",
            "bankName": "",
            "payPalCard": "PayPal로",
            "paypalEmail": "PayPal 이메일 주소",
            "submitButton": "정보 업데이트"
        },
        "paypalEmailModal": {
            "prompt": "보상을 받으려면 PayPal 계정 이메일이 필요합니다.",
            "title": "PayPal 이메일을 입력해 주십시오"
        },
        "personalDetailsForm": {
            "birthday": "",
            "email": "",
            "firstName": "이름",
            "gender": "성별",
            "language": "언어",
            "lastName": "성",
            "submitButton": "정보 업데이트"
        },
        "privacyForm": {
            "marketingEmails": {
                "description": "비즈니스는 보통 효과적인 마케팅을 통해 유명해집니다.",
                "title": "마케팅 이메일"
            },
            "marketingNotifications": "마케팅 알림",
            "marketingPushes": {
                "description": "FlavorWiki가 관심 있을 만한 마케팅 푸시 알림을 보내기를 원합니다.",
                "title": "마케팅 푸시"
            },
            "pushNotifications": {
                "description": "새 설문 조사 알림을 받고 싶습니다.",
                "title": "푸시 알림"
            }
        },
        "product": {
            "brand": "",
            "isAvailable": "",
            "name": "",
            "reward": ""
        },
        "productDisplayOptions": {
            "dragAndDropSort": "",
            "forced": "",
            "none": "",
            "note": "",
            "permutation": "",
            "productDisable": "",
            "productDisplayType": "",
            "randomise": "",
            "reverse": ""
        },
        "products": {
            "addProducts": "",
            "apply": "",
            "category": "",
            "columns": {
                "action": "",
                "add": "",
                "name": "",
                "photo": ""
            },
            "search": ""
        },
        "productsTable": {
            "actionEdit": "",
            "actionRemove": "",
            "alertModaldescription": "",
            "alertModalTitle": "",
            "columnAction": "",
            "columnCategory": "",
            "columnClient": "",
            "columnDate": "",
            "columnProductName": ""
        },
        "profile": {
            "title": "내 프로필"
        },
        "qrCode": {
            "actionsTitle": "",
            "missed": "",
            "nameTitle": ""
        },
        "question": {
            "chooseProduct": {
                "noImage": "이미지가 없음",
                "reward": "보상:"
            }
        },
        "questionCreation": {
            "addOtherConditions": "",
            "analyticalValueOfAnswer": "",
            "chartSection": {
                "chartSettings": "",
                "chartTitle": "",
                "chartTopic": "",
                "chartType": ""
            },
            "chooseMultiple": {
                "maxAnswerValues": "",
                "minAnswerValues": ""
            },
            "chooseOne": {
                "optionsSection": ""
            },
            "chooseProduct": {
                "maxProductsToTaste": "",
                "minProductsToTaste": "",
                "notSelected": ""
            },
            "displayAll": "",
            "displaySurveyName": "",
            "dropdown": {
                "optionsSection": "",
                "prompt": "",
                "secondaryPrompt": ""
            },
            "duplicateButton": "",
            "existingAnswer": "",
            "hideConditionButton": "",
            "hideSkip": "",
            "hideSkipOptions": "",
            "imageAndLabelSettings": {
                "imageAndLabel": "",
                "imageDisplayOptions": "",
                "imageOnly": "",
                "labelOnly": "",
                "questionSettings": "",
                "removeImage": ""
            },
            "infoForm": {
                "prompt": "",
                "secondaryPrompt": ""
            },
            "jumpTo": "",
            "jumpToQuestions": "",
            "location": {
                "region": "",
                "regionRestricted": "국가를 변경할 수 없습니다."
            },
            "mandatory": "",
            "markAll": "",
            "newQuestion": "",
            "numeric": {
                "labels": {
                    "additionalInformationText": "",
                    "maximum": "",
                    "minimum": "",
                    "numberFormat": "",
                    "questionText": "",
                    "sampleOfNumber": ""
                }
            },
            "openAnswer": "",
            "optionsSection": {
                "addAnswer": "",
                "notSelected": ""
            },
            "paired": {
                "bothPresent": "",
                "customDescriptor": "",
                "descriptors": "",
                "hasFollowUpProfile": "",
                "likingQuestion": "",
                "maximumPairs": "",
                "maxPairs": "",
                "minimumPairs": "",
                "minPairs": "",
                "missingBoth": "",
                "missingOne": "",
                "noverticalRating": "",
                "options": "",
                "pairsOptions": {
                    "bothFlavorsPresentEnabled": "",
                    "customFlavorEnabled": "",
                    "neitherFlavorPresentEnabled": "",
                    "oneFlavorNotPresentEnabled": ""
                },
                "profilePrompt": ""
            },
            "pictureOnAll": "",
            "prompt": "",
            "questionDuplicateError": "질문을 복제하는 동안 오류가 발생했습니다.",
            "questionDuplicateSuccess": "질문 복제됨",
            "questionSectionSelect": "",
            "questionSectionSelectOption": {
                "begin": "",
                "middle": "",
                "screening": ""
            },
            "questionType": "",
            "removeButton": "",
            "removeButtonHelper": "",
            "secondaryPrompt": "",
            "selectAndJustify": {
                "options": "",
                "prompt": "",
                "secondaryPrompt": ""
            },
            "showConditionButton": "",
            "showSkip": "",
            "showSkipOptions": "",
            "slider": {
                "addMarks": "",
                "addSlider": "",
                "addSliders": "",
                "alert": {
                    "deleteMark": "",
                    "deleteSlider": "",
                    "description": "",
                    "okText": ""
                },
                "isInOneRow": "",
                "marks": {
                    "add": "",
                    "isMajor": ""
                },
                "max": "",
                "min": "",
                "profileStepTitle": "",
                "prompt": "",
                "secondaryPrompt": "",
                "showProfile": "",
                "step": ""
            },
            "tagInput": {
                "add": ""
            },
            "tasterName": {
                "allowSpaces": "",
                "answerFormat": "",
                "answerFormats": {
                    "any": "",
                    "digits": "",
                    "letters-and-digits": ""
                },
                "maxLength": "",
                "minLength": ""
            },
            "timestamp": {
                "info": ""
            },
            "verticalRating": {
                "additionalText": "",
                "addSkipingRule": "",
                "maximum": "",
                "minimum": "",
                "noSkipingRule": "",
                "questionText": "",
                "scaleLabels": "",
                "startingFrom": "",
                "upTo": ""
            }
        },
        "register": {
            "back": "",
            "creatingError": "",
            "creatingErrorCheckAgain": "",
            "doLater": "나중에 하기",
            "nextStep": "다음 단계"
        },
        "requestAccountForm": {
            "submit": "제출"
        },
        "retakes": {
            "header": "본 설문조사는 한 번만 가능합니다.",
            "subHeader": "귀하는 설문조사를 이미 완료했습니다."
        },
        "shareStatsForm": {
            "organizations": {
                "label": "",
                "tabs": {
                    "all": "",
                    "selected": ""
                }
            },
            "users": {
                "label": "",
                "tabs": {
                    "all": "",
                    "selected": ""
                }
            }
        },
        "socialMedia": {
            "shareFB": "Facebook에 공유",
            "shareLI": "LinkedIn에 공유",
            "shareTW": "Twitter에 공유"
        },
        "storesTable": {
            "actionEdit": "",
            "actionRemove": "",
            "alertModaldescription": "",
            "alertModalTitle": "",
            "columnAction": "",
            "columnCompanyName": "",
            "columnCountry": "",
            "columnDate": "",
            "columnState": ""
        },
        "survey": {
            "notAuthorized": {
                "content": "",
                "title": ""
            }
        },
        "surveyBasicInfoForm": {
            "alert": {
                "description": "",
                "okText": "",
                "title": ""
            },
            "allowedDaysToFillTheTasting": "",
            "allowedUsers": "",
            "authorizationType": "",
            "continueButton": "",
            "copy": "",
            "copySuccessfull": "",
            "country": "",
            "customizeSharing": {
                "description": "",
                "title": ""
            },
            "forceAccount": {
                " end": "",
                "end": "",
                "start": ""
            },
            "forceTasterAccount": "",
            "instruction": "",
            "instructionSteps": "설명 단계",
            "loginText": "",
            "minimumNumber": "",
            "name": "",
            "nextButton": "",
            "pauseText": "",
            "rejection": "",
            "requireRecaptcha": "",
            "screening": "",
            "securitySettings": "",
            "selectLanguage": "",
            "skipButton": "",
            "startSurveyButton": "",
            "surveyUrl": "",
            "takeSurveyMultipleTimes": "",
            "tastingSettings": "",
            "thankYou": "",
            "uniqueName": "",
            "uniqueNameExists": ""
        },
        "surveyComplete": {
            "backToDashboard": "대시보드로 돌아가기",
            "text": "설문조사가 끝났습니다. 종료"
        },
        "surveyFunnel": {
            "columns": {
                "product": "",
                "question": "",
                "responses": ""
            },
            "mainHeader": ""
        },
        "surveyInfoTest": {
            "addYourOwn": "직접 추가",
            "answered": "답변 완료",
            "atLeast": "최소 답변 수",
            "bothOptionsPresent": "두 가지 설명이 모두 있습니다",
            "cantDecide": "결정할 수 없음",
            "close": "닫기",
            "completed": "시식 완료",
            "congratulations": "축하합니다",
            "customOption": "사용자 맞춤 설명",
            "information": "정보",
            "isNotPresent": "있지 않습니다",
            "isPresent": "있습니다",
            "noDescriptorPresent": "두 가지 설명이 모두 있지 않습니다",
            "noMorePairs": "더 이상 단어가 없습니다. '다음'을 눌러 진행하세요.",
            "optionsModalTitle": "설명이 잘못되었나요?",
            "otherOptions": "기타 옵션",
            "pair": "쌍",
            "pairedQuestionInfo": "다음 질문에는 두 개씩 묶여 있는 한 쌍의 설명 단어 여러 개가 있습니다. 제품을 가장 잘 설명한 것 같은 단어를 선택하세요. 최선을 다해 답변해주세요. 답변에 정답은 없습니다.",
            "pairs": "쌍",
            "pickOption": "귀하의 상황을 가장 잘 설명하는 옵션을 선택하세요.",
            "rejected": "거부되었습니다",
            "rejectedReasonFirst": "죄송합니다. 본 시식에는 귀하가 아닌 다른 사람의 정보가 필요합니다.",
            "rejectedReasonSecond": "아쉬워하지 마세요. 다음 시식에 귀하의 참여가 필요할 수 있으니까요.",
            "screeningOk": "귀하는 시식 자격이 있습니다. 계속하려면 아래의 버튼을 클릭하세요. 알림용으로 해당 링크가 첨부된 이메일이 수신됩니다.",
            "uploadPicture": "개봉한 제품의 사진을 업로드하여 모든 것을 올바르게 완료했는지 확인하세요. 보상을 받으려면 시식 도중 제품을 명확하게 보여주는 사진이 필요합니다.",
            "writeOption": "아래에 옵션을 직접 작성하세요"
        },
        "surveyInstructions": {
            "title": "시식 지침"
        },
        "surveyList": {
            "completed": "",
            "finished": "",
            "ready": "",
            "rejected": "",
            "retake": ""
        },
        "surveyLogIn": {
            "access": "로그인 페이지에 액세스하려면 여기를 클릭하십시오.",
            "accessLogin": "이 설문조사에 대한 접근 권한이 있는 경우 먼저 로그인해주십시오.",
            "askForAccount": "",
            "askForEmail": "계속하려면 이메일을 입력하세요.",
            "loginText": "<p>시식회에 오신 것을 환영합니다!<\/p>\n<p>계속하려면 이메일을 입력하세요.<\/p>\n<p>설문 완료 전에 페이지에서 벗어나는 경우, 이메일을 입력하면 중단한 위치에서부터 설문을 계속 진행할 수 있습니다.<\/p>",
            "loginTo": "로그인",
            "nextTimeDetails": "시식 완료 전에 페이지에서 벗어나는 경우, 시작 페이지에서 이메일을 입력하면 중단한 위치에서부터 설문을 계속할 수 있습니다.",
            "notARobot": "로봇이 아님을 확인하여 시작하세요.",
            "notSelectedToParticipate": "귀하는 본 설문조사 참여 대상이 아닙니다.",
            "pauseText": "<p style='text-align: left;'><strong>관심에 감사드립니다.<\/strong><\/p><p style='text-align: left;'><strong>본 설문조사는 이미 종료되었습니다.<\/strong><\/p><p style='text-align: left;'><strong>다른 질문이 있으면 support@flavorwiki.com으로 문의 바랍니다.<\/strong><\/p><br><p style='text-align: left;'><strong>감사합니다,<\/strong><\/p><p style='text-align: left;'><strong>FlavorWiki 팀.<\/strong><\/p>",
            "pressToStart": "아래 버튼을 눌러 시작하세요.",
            "signupFor": "",
            "surveyAvailable": "본 설문조사는 특정한 사용자만 가능합니다.",
            "surveyExpired": "시장조사에 관심 가져 주셔서 감사합니다. 시식 완료 기간이 만료되었습니다.",
            "welcome": "시식에 오신 것을 환영합니다!"
        },
        "surveyNavigation": {
            "skipProgressText": "$t(countProduct, { 'count': {{products}} })개에 답변하셨습니다. 적어도 $t(countProduct, { 'count': {{minimumProducts}} })개에 답변하신 이후 건너뛸 수 있습니다."
        },
        "surveyPhotos": {
            "mainHeader": "",
            "noneAvailable": "",
            "successPopup": ""
        },
        "surveyQuestion": {
            "maxAnswerValues": "최대 $t(countAnswer, { \"count\": {{maxAnswerValues}} })개를 선택해야 합니다.",
            "minAnswerValues": "최소 $t(countAnswer, { \"count\": {{minAnswerValues}} })개, 최대 $t(countAnswer, { \"count\": {{maxAnswerValues}} })개의 답변을 선택해야 합니다.",
            "minMaxDiffAnswerValues": "$t(countAnswer, { \"count\": {{minAnswerValues}} })개에서 $t(countAnswer, { \"count\": {{maxAnswerValues}} })개를 선택해야 합니다.",
            "minMaxSameAnswerValues": "$t(countAnswer, { \"count\": {{maxAnswerValues}} })개를 선택했습니다.",
            "onlyMaxAnswerValues": "최대 $t(countAnswer, { \"count\": {{maxAnswerValues}} })개를 선택해야 합니다.",
            "onlyMinAnswerValues": "최소 $t(countAnswer, { \"count\": {{minAnswerValues}} })개를 선택해야 합니다."
        },
        "surveysList": {
            "answeredSurveys": ""
        },
        "surveyValidate": {
            "filters": {
                "email": "",
                "total": ""
            }
        },
        "table": {
            "actionRemove": "",
            "alertModalDescription": "",
            "alertModalTitle": "",
            "dateColumnActionTitle": "",
            "dateColumnTitle": "",
            "nameColumnTitle": "",
            "productsColumnTitle": ""
        },
        "tagInput": {
            "add": ""
        },
        "tasterProfile": {
            "birthYear": "내 생년월일",
            "fullName": "내 이름",
            "gender": "내 성별",
            "nationality": "현재 거주 중인 국가",
            "submitButton": "제출"
        },
        "userList": {
            "addFormTitle": "",
            "editFormTitle": ""
        },
        "usersList": {
            "add": "",
            "emailAddress": "",
            "fullName": "",
            "selectOrganization": "",
            "selectType": "",
            "table": {
                "actions": "",
                "delete": "",
                "edit": "",
                "email": "",
                "name": "",
                "organization": "",
                "type": ""
            }
        },
        "userSurvey": {
            "inProgress": "진행 중인 설문 조사",
            "productsPurchase": "구매하고 시식할 수 있는 제품",
            "timeLeftInProgressDays": "이 설문조사를 완료하려면",
            "timeLeftInProgressHours": "",
            "timeLeftSurveyOngoingDays": "제품 구매 및 시식하러 가기",
            "timeLeftSurveyOngoingHours": ""
        },
        "userSurveyCard": {
            "products": "{{number}}개 제품{{plural}}",
            "seeShops": "(쇼핑몰 참조)"
        },
        "verticalRating": {
            "additionalText": "",
            "maximum": "",
            "minimum": "",
            "questionText": "",
            "scaleLabels": "",
            "startingFrom": "",
            "upTo": ""
        }
    },
    "containers": {
        "additionalInfo": {
            "error": "",
            "success": ""
        },
        "addProductsToCreate": {
            "newProduct": ""
        },
        "addQuestionsToCreate": {
            "newStep": ""
        },
        "addQuestionToCreate": {
            "error": "",
            "success": ""
        },
        "authenticatedLayut": {
            "home": "홈",
            "signOut": "로그아웃"
        },
        "changePassword": {
            "error": "",
            "success": "",
            "userPasswordError": ""
        },
        "cloneSurveyButton": {
            "alertModalDescriptionNo": "",
            "alertModalDescriptionYes": "",
            "alertModalOkText": "",
            "alertModalTitleNo": "",
            "alertModalTitleYes": "",
            "error": "",
            "success": ""
        },
        "completeTasterProfile": {
            "home": "",
            "signOut": "",
            "subtitle": "",
            "title": "프로필을 완성해 주십시오"
        },
        "CompleteTasterProfileForm": {
            "error": "",
            "submissionError": "",
            "validation": {
                "birthYearMax": "나이가 어립니다",
                "birthYearMin": "올해는 선택할 수 없습니다",
                "birthYearRequire": "생년월일은 필수입니다",
                "fullnameRequire": "이름은 필수입니다",
                "genderRequire": "성별은 필수입니다",
                "nationalityRequire": "거주 국가는 필수입니다"
            }
        },
        "createAccount": {
            "additionalInfo": {
                "childrenAgesMin": "자녀 연령을 입력해 주십시오",
                "childrenAgesRequire": "자녀 연령은 필수입니다",
                "incomeRangeRequire": "소득 범위를 선택해야 합니다",
                "numberOfChildError": "자녀 수는 숫자로 입력해야 합니다",
                "numberOfChildLessthan": "",
                "numberOfChildMorethan": "",
                "numberOfChildRequire": ""
            },
            "personalInfo": {
                "birthdayRequire": "",
                "firstnameRequire": "",
                "lastnameRequire": "",
                "recaptchaError": "다시 확인하십시오",
                "recaptchaRequire": ""
            },
            "welcomeForm": {
                "confirmMatch": "",
                "confirmRequire": "",
                "emailRequire": "",
                "emailValid": "",
                "passwordMin": "",
                "passwordRequire": ""
            }
        },
        "customButtons": {
            "continue": "",
            "next": "",
            "skip": "",
            "start": ""
        },
        "deleteSurveyButton": {
            "alertModalDescriptionNo": "",
            "alertModalDescriptionYes": "",
            "alertModalOkText": "",
            "alertModalTitleNo": "",
            "alertModalTitleYes": "",
            "error": "",
            "success": ""
        },
        "editQrCode": {
            "save": ""
        },
        "editSurveyButton": {
            "alertModalDefaultOption": {
                "AfterHelpText": "",
                "BeforeHelpText": "",
                "HelpText": ""
            },
            "alertModalOkText": "",
            "alertModalStrictedOption": {
                "BeforeHelpText": "",
                "HelpText": ""
            },
            "alertModalTitle": ""
        },
        "exportSharingContainer": {
            "popups": {
                "downloaded": "",
                "downloading": "",
                "error": ""
            }
        },
        "exportSurveyButton": {
            "alertModalDescription": "",
            "alertModalOkText": "",
            "alertModalTitle": "",
            "emailSend": "",
            "notFound": "",
            "selectUser": ""
        },
        "exportSurveyPhotosButton": {
            "alertModalDescription": "",
            "alertModalOkText": "",
            "alertModalTitle": "",
            "emailSend": "",
            "notFound": "",
            "selectUser": ""
        },
        "forgotPassword": {
            "emailRequire": "",
            "emailValid": "",
            "error": "",
            "infoMessage": ""
        },
        "hooks": {
            "useLoginToSurvey": {
                "errorOnRequest": ""
            }
        },
        "impersonate": {
            "impersonate": "",
            "impersonatedAs": "",
            "toGoToAdmin": ""
        },
        "importGiftCardIncentives": {
            "prompt": "",
            "title": ""
        },
        "importGiftCardShares": {
            "prompt": "",
            "title": ""
        },
        "importProductIncentives": {
            "prompt": "",
            "title": ""
        },
        "importSurveyShares": {
            "prompt": "",
            "title": ""
        },
        "loginForm": {
            "incomingLoginError": "",
            "incomingValidError": "",
            "preventMobileOperatorLogin": "",
            "validation": {
                "emailRequire": "",
                "emailValid": "이메일이 유효하지 않습니다.",
                "passwordMin": "비밀번호는 8자 이상이어야 합니다",
                "passwordRequire": "비밀번호는 필수입니다"
            }
        },
        "mandatoryQuestions": {
            "title": ""
        },
        "newPasswordF": {
            "error": "비밀번호를 변경하는 중에 오류가 발생했습니다",
            "success": "비밀번호가 성공적으로 변경되었습니다",
            "validation": {
                "confirmMatch": "비밀번호가 일치하지 않습니다",
                "confirmRequire": "비밀번호 확인은 필수입니다",
                "passwordMin": "비밀번호는 8자 이상이어야 합니다",
                "passwordRequire": "비밀번호는 필수입니다"
            }
        },
        "operatorCreateQrCode": {
            "successMessage": "",
            "title": ""
        },
        "operatorEditQrCode": {
            "successMessage": "",
            "title": ""
        },
        "operatorQrCode": {
            "description": "",
            "okText": "",
            "title": ""
        },
        "operatorSurveyInfo": {
            "alertModalkLanDescription": "",
            "alertModalLanOkText": "",
            "alertModalLanTitle": "",
            "alertModalOkText": "",
            "alertModalTitle": ""
        },
        "organizationForm": {
            "addedSuccessfully": "",
            "addTitle": "",
            "deletedSuccessfully": "",
            "editTitle": "",
            "organizationName": "",
            "uniqueName": "",
            "updateSuccessfully": ""
        },
        "organizationsList": {
            "alertModalDescription": "",
            "alertModalOkText": "",
            "alertModalTitle": ""
        },
        "page": {
            "additionalInfo": {
                "childAgeLabel": "",
                "childAgePlaceholder": "",
                "childAtHome": "",
                "childAtHomePlaceholder": "",
                "dietary": "",
                "dietaryPlaceholder": "",
                "ethnicity": "",
                "ethnicityPlaceholder": "",
                "income": "",
                "incomePlaceholder": "",
                "incomeRangePlaceholder": "",
                "numberChildPlaceholder": "",
                "product": "",
                "productPlaceholder": "",
                "smoke": "",
                "smokePlaceholder": ""
            },
            "categoriesGridSection": {
                "title": ""
            },
            "createAccount": {
                "additionalInformartionStep": {
                    "description": "",
                    "title": ""
                },
                "personalInformationStep": {
                    "description": "",
                    "title": ""
                },
                "welcomeStep": {
                    "description": "",
                    "title": ""
                }
            },
            "main": {
                "cancelText": "",
                "extraActionText": "",
                "nextStepDefault": ""
            },
            "notFound": {
                "styledText": "죄송합니다. 존재하지 않는 페이지입니다"
            },
            "onboarding": {
                "createAccount": {
                    "buttonText": "내 계정 만들기",
                    "msgText": "계정을 생성하고 시식을 시작하여 보상을 받으세요.",
                    "signupBtnText": "로그인",
                    "signupText": "이미 계정이 있습니까?",
                    "title": "새 계정"
                },
                "forgotPassword": {
                    "subTitle": "비밀번호 재설정 링크를 발송할 이메일 주소를 입력해주세요.",
                    "title": "비밀번호 복구"
                },
                "login": {
                    "title": "로그인"
                },
                "loginCarousel": {
                    "text": {
                        "buyProductText": "현지 가맹점에서 선택한 제품을 구매합니다. 걱정 마세요, 결제는 저희가 할게요!",
                        "cashInText": "제품을 맛보고 귀하의 생각을 말씀해주세요. 현금과 독점적이고 훌륭한 시식 보상도 받아보세요.",
                        "discoverProductText": "좋아하는 카테고리의 제품을 시식하려면 가입하세요. 본인에 대한 정보를 알려주면 최고 제품들을 선정해드리겠습니다.",
                        "welcomeText": "오늘의 최고 제품을 시식하면서 미래 식품에 영향력을 미쳐보세요. 현금과 멋진 보상을 받으세요!"
                    },
                    "titles": {
                        "buyProduct": "",
                        "cashIn": "",
                        "discoverProduct": "",
                        "welcome": ""
                    }
                },
                "loginToRole": {
                    "backBtn": "",
                    "styledButton": "",
                    "styledButtonOperator": "",
                    "styledButtonTaster": "",
                    "text": ""
                },
                "newPassword": {
                    "subTitle": "",
                    "title": ""
                },
                "requestAccount": {
                    "subTitle": "",
                    "title": ""
                },
                "requestSubmitted": {
                    "subTitle": "",
                    "title": ""
                }
            },
            "ongoingSurveysSection": {
                "title": ""
            },
            "operator": {
                "menu": {
                    "dashboard": "",
                    "organizations": "",
                    "privacyPolicy": "",
                    "qr-codes": "",
                    "surveys": "",
                    "termsOfUse": "이용 약관",
                    "users": ""
                }
            },
            "operatorCreateBasics": {
                "title": ""
            },
            "operatorCreateEmailSettings": {
                "title": ""
            },
            "operatorCreatePayments": {
                "title": ""
            },
            "operatorCreateSettings": {
                "title": ""
            },
            "operatorCreateSurveyLinkedSurveys": {
                "label": "",
                "tabs": {
                    "all": "",
                    "selected": ""
                },
                "title": ""
            },
            "OperatorCreateSurveyProducts": {
                "title": ""
            },
            "OperatorCreateSurveyQuestions": {
                "title": ""
            },
            "operatorCreateTastingNotes": {
                "title": ""
            },
            "paidSurveysSection": {
                "title": ""
            },
            "personalInfo": {
                "dobLabel": "",
                "firstnameLabel": "",
                "firstnamePlaceholder": "",
                "genderLabel": "",
                "genderPlaceholder": "",
                "languagesLabel": "",
                "languagesPlaceholder": "",
                "lastnameLabel": "",
                "lastnamePlaceholder": ""
            },
            "pointsSurveySection": {
                "title": ""
            },
            "taster": {
                "promt": "",
                "title": ""
            },
            "welcomeForm": {
                "confirmLabel": "",
                "confirmPlaceholder": "",
                "emailLabel": "",
                "emailPlaceholder": "",
                "passwordLabel": "",
                "passwordPlceholder": ""
            }
        },
        "paymentDetails": {
            "error": "",
            "success": ""
        },
        "personalDetails": {
            "error": "",
            "success": ""
        },
        "previewSurveyDraft": {
            "buttonText": ""
        },
        "privacy": {
            "error": ""
        },
        "productsCreateList": {
            "alertModalDescription": "",
            "alertModalOkText": "",
            "alertModalTitle": ""
        },
        "profileLayout": {
            "additionalInfo": "",
            "changePassword": "비밀번호 변경",
            "paymentDetails": "",
            "personalDetails": "",
            "privacy": "개인 정보"
        },
        "publishEditedSurvey": {
            "errorMessage": "",
            "loadingText": "",
            "publishButton": "",
            "successMessage": ""
        },
        "publishSurvey": {
            "errorMessage": "",
            "loadingText": "",
            "publishButton": "",
            "successMessage": ""
        },
        "publishSurveyDraft": {
            "errorMessage": "",
            "loadingText": "",
            "publishButton": "",
            "successMessage": ""
        },
        "questionCreationCardBody": {
            "choose-one": {
                "other": "기타"
            },
            "OptionsSection": {
                "includeOthers": ""
            }
        },
        "questionCreationCardHeader": {
            "description": "",
            "okText": "",
            "title": ""
        },
        "questionsList": {
            "skipToOptions": {
                "finish": "",
                "reject": "",
                "removeSkip": ""
            }
        },
        "requestAccountForm": {
            "code": "국가코드는 필수입니다",
            "companyName": "이 입력란은 필수입니다",
            "emailRequired": "이메일은 필수입니다",
            "emailValid": "유효한 이메일이 아닙니다",
            "firstName": "이름은 필수입니다",
            "lastName": "이름은 필수입니다",
            "number": "전화번호는 필수입니다"
        },
        "saveDraftSurvey": {
            "errorMessage": "",
            "loadingText": "",
            "publishButton": "",
            "successMessage": "",
            "surveyInitialState": ""
        },
        "surveyBasicInfoForm": {
            "alert": {
                "description": "",
                "okText": "",
                "title": ""
            },
            "allowedUsers": "",
            "authorizationType": "",
            "continueButton": "",
            "forceTasterAccount": "",
            "instruction": "",
            "instructionSteps": "설명 단계",
            "minimumNumber": "",
            "name": "",
            "nextButton": "",
            "referralAmount": "",
            "rejection": "",
            "requireRecaptcha": "",
            "screening": "",
            "securitySettings": "",
            "selectLanguage": "",
            "skipButton": "",
            "startSurveyButton": "",
            "takeSurveyMultipleTimes": "",
            "tastingSettings": "",
            "thankYou": "",
            "uniqueName": "",
            "uniqueNameExists": ""
        },
        "surveyList": {
            "completed": ""
        },
        "surveyLogIn": {
            "access": "",
            "accessLogin": "이 설문조사에 대한 접근 권한이 있는 경우 먼저 로그인해주십시오.",
            "askForAccount": "시식을 진행하려면 계정을 만들어야 합니다. 원하는 비밀번호를 입력하고 국가를 선택하십시오.",
            "askForEmail": "계속하려면 이메일을 입력하세요.",
            "loginText": "<p>시식회에 오신 것을 환영합니다!<\/p>\n<p>계속하려면 이메일을 입력하세요.<\/p>\n<p>설문 완료 전에 페이지에서 벗어나는 경우, 이메일을 입력하면 중단한 위치에서부터 설문을 계속 진행할 수 있습니다.<\/p>",
            "loginTo": "로그인",
            "nextTimeDetails": "설문 완료 전에 페이지에서 벗어나는 경우, 시작 페이지에서 이메일을 입력하면 중단한 위치에서부터 설문을 계속 진행할 수 있습니다.",
            "notARobot": "로봇이 아님을 확인하여 시작하세요.",
            "notSelectedToParticipate": "귀하는 본 설문조사 참여 대상이 아닙니다.",
            "pauseText": "<p style='text-align: left;'><strong>관심에 감사드립니다.<\/strong><\/p><p style='text-align: left;'><strong>본 설문조사는 이미 종료되었습니다.<\/strong><\/p><p style='text-align: left;'><strong>다른 질문이 있으면 support@flavorwiki.com으로 문의 바랍니다.<\/strong><\/p><br><p style='text-align: left;'><strong>감사합니다,<\/strong><\/p><p style='text-align: left;'><strong>FlavorWiki 팀.<\/strong><\/p>",
            "pressToStart": "아래 버튼을 눌러 시작하세요.",
            "surveyAvailable": "본 설문조사는 특정한 사용자만 가능합니다.",
            "surveyExpired": "시장조사에 관심 가져 주셔서 감사합니다. 시식 완료 시간이 만료되었습니다.",
            "surveySuspended.line1": "시장조사에 관심 가져 주셔서 감사합니다.",
            "surveySuspended.line2": "이미 종료된 조사입니다.",
            "surveySuspended.line3": "질문이 있는 경우 support@flavorwiki으로 문의하셔도 됩니다.",
            "surveySuspended.line4": "감사합니다,",
            "surveySuspended.line5": "FlavorWiki 팀",
            "welcome": "시식회에 오신 것을 환영합니다!"
        },
        "surveySharing": {
            "copiedMessage": "링크가 클립보드에 복사되었습니다.",
            "shareTextFirst": "본 시식을 공유하고 완료한 친구 한 명당 {{amount}}을(를) 받으세요!",
            "shareTextLast": "공유 링크를 복사합니다.",
            "shareTextMiddle": "여기를 클릭해 공유 링크를 복사합니다."
        },
        "surveyStats": {
            "editOperatorLayout": "",
            "editTasterLayout": "",
            "fetchError": {
                "description": "",
                "message": ""
            },
            "generateReport": {
                "text": ""
            },
            "invalidError": {
                "description": "",
                "message": ""
            },
            "otherFilters": {
                "buttonText": "",
                "filterText": "",
                "noFilter": "",
                "resetText": "",
                "selectProductsFirst": "",
                "title": ""
            },
            "productsTab": {
                "backToProductSelection": "",
                "buttonText": "",
                "maxNumberError": "제품은 최소 {{minNumber}}개, 최대 {{maxNumber}}개를 선택해야 합니다. 현재 귀하는 제품 {{currentNumber}}개를 선택하셨습니다.",
                "title": ""
            },
            "validation": {
                "required": "",
                "typeError": ""
            }
        },
        "updateSurvey": {
            "buttonText": "",
            "errorMessage": "",
            "successMessage": "",
            "updatingText": ""
        },
        "updateSurveyDraft": {
            "buttonText": "",
            "errorMessage": "",
            "successMessage": "",
            "updatingText": ""
        },
        "uploadProductPicture": {
            "label": "",
            "limit": ""
        },
        "userProfile": {
            "mainTitle": "내 프로필",
            "messages": {
                "password": {
                    "error": "현재 비밀번호가 올바르지 않습니다",
                    "success": "비밀번호가 성공적으로 갱신되었습니다"
                }
            },
            "tabs": {
                "additional": "",
                "password": "비밀번호 변경",
                "payment": "",
                "personal": "개인 정보",
                "privacy": "개인정보"
            },
            "validations": {
                "password": {
                    "confirmNewPassword": {
                        "required": "비밀번호 확인은 필수입니다",
                        "shouldMatch": "새 비밀번호가 일치하지 않습니다"
                    },
                    "currentPassword": {
                        "minChars": "비밀번호는 8자 이상이어야 합니다",
                        "required": "현재 비밀번호는 필수입니다",
                        "sameAsBefore": "새 비밀번호는 현재 비밀번호와 달라야 합니다"
                    },
                    "newPassword": {
                        "minChars": "새 비밀번호는 8자 이상이어야 합니다",
                        "required": "새 비밀번호는 필수입니다"
                    }
                }
            }
        },
        "usersListContainer": {
            "added": "",
            "alertModalDescription": "",
            "alertModalokText": "",
            "alertModalTitle": "",
            "deleted": "",
            "updated": ""
        },
        "useSurveyValidate": {
            "showOnlyMandatoryQuestionErrors": "하나 이상의 질문은 필수입니다.",
            "showProductsErrors": "",
            "showQuestionsErrors": ""
        }
    },
    "countAnswer": "답변 {{count}}개",
    "countAnswer_plural": "답변 {{count}}개",
    "countProduct": "{{count}}개 제품",
    "countProduct_plural": "{{count}}개 제품",
    "defaultValues": {
        "customButtons": {
            "continue": "계속",
            "next": "다음",
            "skip": "건너뛰기",
            "start": "시작"
        },
        "customizeSharingMessage": "본 시식을 공유하고 완료한 친구 한 명당 {{amount}}을(를) 받으세요!",
        "instructionSteps": [
            "시식을 시작하기 전에 선택한 제품이 모두 있는지 확인하세요.",
            "조용한 장소를 찾으세요.",
            "시식 중 추가 지침이 제공됩니다.",
            "준비가 되면 아래의 '시식 시작'을 클릭하세요."
        ],
        "instructionsText": "<p><strong><span style=\"font-size: 20pt;\">시식회에 오신 것을 환영합니다!<\/span><\/strong>\n<br \/>본 시식 참여에 동의해주셔서 감사합니다. 본 설문지는 현재 소비하는 제품에 대해 질문하며, 구매 및 시식에 가장 적합한 제품을 매칭하는 데 도움이 됩니다. 본 설문조사는 2분에서 3분 정도 소요됩니다.\n<br \/>답변에 옳고 그름은 없으니 솔직하게 대답해주세요.\n<br \/>질문은 아래의 지원 상자를 이용하거나 이메일(support@flavorwiki.com)로 문의 바랍니다.\n<br \/><strong>행복한 시식 되세요! FlavorWiki Team 팀<\/strong><\/p>",
        "loginText": "<p style='text-align: center;'><strong>시식회에 오신 것을 환영합니다!<\/strong><\/p><p style='text-align: center;'><strong>계속하려면 이메일을 입력하세요.<\/strong><\/p><p style='text-align: center;'><strong>설문 완료 전에 페이지에서 벗어나는 경우, 이메일을 입력하면 중단한 위치에서부터 설문을 계속 진행할 수 있습니다.<\/strong><\/p>",
        "pauseText": "<p style='text-align: left;'><strong>관심을 가져 주셔서 감사합니다.<\/strong><\/p><p style='text-align: left;'><strong>이 연구는 이미 끝났습니다.<\/strong><\/p><p style='text-align: left;'><strong>다른 질문이 있으면 support@flavorwiki.com에 문의 할 수도 있습니다.\n<\/strong><\/p><br><p style='text-align: left;'><strong>감사합니다\n<\/strong><\/p><p style='text-align: left;'><strong>FlavorWiki 팀.<\/strong><\/p>",
        "rejectionText": "<p><strong><span style=\"font-size: 20pt;\" data-mce-style=\"font-size: 20pt;\">정말 죄송합니다... 다음 기회에!<\/span><\/strong><\/p>\n<p>죄송하지만, 이 시식에는 귀하의 인적사항이 적합하지 않은 것 같습니다.<br\/>하지만 실망은 금물입니다. 다음 시식에 귀하가 참여할 수 있도록 자리를 만들어보겠습니다.<\/p>\n<p>질문이 있으시다면, 아래의 지원 상자를 이용하거나 다음의 이메일로 메일을 보내주세요.<\/p>\n<p><a href=\"mailto:support@flavorwiki.com\">support@flavorwiki.com<\/a><\/p>\n<p>행복한 시식 되세요!<\/p>\n<p>FlavorWiki 팀<\/p>",
        "screeningText": "<p><strong><span style=\"font-size: 20pt;\">축하합니다<\/span><\/strong><\/p>\n<p>시식 자격이 있으시군요. 아래 버튼을 클릭하여 계속 진행하세요.<br\/>\n그리고 저희가 알림 차 링크가 담긴 이메일을 보내드렸습니다.<\/p>\n<p>질문이 있으시다면, 아래의 지원 상자를 이용하거나 다음의 이메일로 메일을 보내주세요.<\/p>\n<p><a href=\"mailto:support@flavorwiki.com\">support@flavorwiki.com<\/a><\/p>\n<p>행복한 시식 되세요!<\/p>\n<p>Flavorwiki 팀<\/p>",
        "thankYouText": "<p><strong><span style=\"font-size: 20pt;\">참여해 주셔서 감사합니다!<\/span><\/strong> \n <br \/>시식을 즐기셨다면 Facebook 페이지에서 추천하거나 리뷰를 작성해 주세요. \n <br \/>질문은 아래의 지원 상자를 이용하거나 이메일(support@flavorwiki.com)로 문의 바랍니다. \n <br \/><strong> 행복한 시식 되세요! FlavorWiki 팀<\/strong><\/p>"
    },
    "dontHaveAccount": "계정이 없습니까?",
    "dropDownOptions": {
        "choose-date": "",
        "choose-multiple": "",
        "choose-one": "",
        "choose-payment": "",
        "choose-product": "",
        "dropdown": "",
        "email": "",
        "info": "",
        "location": "",
        "numeric": "",
        "open-answer": "",
        "paired-questions": "",
        "paypal-email": "",
        "select-and-justify": "",
        "slider": "",
        "time-stamp": "",
        "upload-picture": "",
        "vertical-rating": ""
    },
    "email": {
        "rejected": "본 설문조사에 참여해 주셔서 감사합니다.<br><br>\n아래의 링크를 친구에게 공유하고, 친구가 시식을 완료하면 한 명당 추가로 <strong>{{SSHARING_REWARD}}<\/strong>을(를) 받을 수 있습니다.<br><br>\n{{SHARING_LINK}}<br><br>\n질문이 있으시다면 <a href=\"mailto:support@flavorwiki.com\">support@flavorwiki.com<\/a>으로 이메일을 보내주세요.<br><br>\n              즐거운 시식 되세요!<br>\n              FlavorWiki 팀",
        "surveyCompleted": {
            "html": "",
            "subject": "",
            "text": ""
        },
        "surveyRejected": {
            "html": "",
            "subject": "",
            "text": ""
        },
        "surveyWaiting": {
            "html": "",
            "subject": "",
            "text": ""
        }
    },
    "emailUs": "궁금한 점이 있으시면 아래에 있는 지원 상자를 사용하거나 이메일을 보내주세요 ",
    "errors": {
        "ANALYSIS_ERROR": "",
        "E_EXPORT_DEFAULT": "",
        "E_ORG_UNIQUE": "",
        "E_QR_CODE_CREATE": "QR 코드를 생성하는 동안 오류가 발생했습니다.",
        "E_QR_CODE_SEARCH": "QR 코드를 검색하는 동안 오류가 발생했습니다.",
        "E_QR_CODE_UNIQUE": "해당 고유 이름은 이미 다른 QR 코드에서 사용 중입니다.",
        "E_QR_CODE_UPDATE": "QR 코드를 업데이트하는 동안 오류가 발생했습니다.",
        "E_REQUEST_ACCOUNT": "새 계정을 요청하는 동안 오류가 발생했습니다",
        "E_UNIQUE": "",
        "E_UNIQUE_USER": "",
        "E_USER_IS_EXISTED": "다른 계정과 연결된 이메일 주소입니다.",
        "FILE_NOT_FOUND": "공유 링크가 유효하지 않습니다.",
        "FILE_UNAUTHORIZED": "",
        "inputValidCountry": "",
        "inputValidEmail": "유효한 이메일을 입력하세요.",
        "inputValidPassword": "",
        "NO_APP_URL": "APP_URL 변수를 찾을 수 없습니다.",
        "NO_ORGANIZATION": "귀하의 계정이 조직에 속하지 않습니다.",
        "notAuthQrCode": "",
        "notAuthSurvey": "",
        "ORG_DEFAULT_CREATE": "",
        "ORG_DEFAULT_UPDATE": "",
        "pictureTooLarge": "",
        "privacyUpdateError": "",
        "submitAnswerFailed": "",
        "UNAUTHORIZED": "권한 없음",
        "update": "",
        "updatePaypallFailed": "문제가 발생했습니다. 다시 시도하십시오.",
        "uploadPictureFailed": "업로드 실패, 사진을 선택하고 다시 시도하십시오.",
        "uploadProductPictureFailed": "업로드 실패, 사진을 선택하고 다시 시도하십시오."
    },
    "forgotPassword": "비밀번호 분실",
    "happyTasting": "행복한 시식 되세요!",
    "languages": {
        "chinese": "",
        "deutsch": "",
        "english": "",
        "french": "",
        "italian": "",
        "japanese": "",
        "korean": "",
        "polish": "",
        "portuguese": "",
        "russian": "",
        "spanish": "",
        "turkish": ""
    },
    "page": {
        "surveyList": {
            "completed": "",
            "finsihed": "",
            "rejected": ""
        }
    },
    "pdfLayoutEditor": {
        "addPage": {
            "tooltip": ""
        },
        "discard": {
            "description": "",
            "ok": "",
            "title": ""
        },
        "loadingData": "",
        "messages": {
            "downloadError": "",
            "saveError": "",
            "saveSuccess": ""
        },
        "pageText": "",
        "paperSize": "",
        "removePage": {
            "disabledTooltip": "",
            "tooltip": ""
        },
        "rendering": "",
        "saveAsTemplate": "",
        "showLayoutBorder": "",
        "title": {
            "operator": "",
            "taster": ""
        },
        "zoom": ""
    },
    "placeholders": {
        "addDescriptor": "설명을 직접 입력하세요.",
        "addOpinion": "여기에 의견을 추가하세요...",
        "addOption": "옵션 직접 추가",
        "analyticsValue": "",
        "availableInCountry": "",
        "bankAccountName": "",
        "bankAccountNumber": "",
        "bankBIC": "",
        "bankDescription": "",
        "bankIBAN": "",
        "bankName": "",
        "category": "카테고리 선택",
        "chartsSettings": {
            "absolutePercentageValues": "",
            "barsSortOrder": "",
            "howManyDecimals": "",
            "howManyDecimals_axis": "",
            "isDataTableShown_format": "",
            "outlineWidth": ""
        },
        "companyName": "회사명",
        "confirmPassword": "새 비밀번호 확인",
        "country": "국가",
        "currentPassword": "현재 비밀번호 입력",
        "email": "이메일을 입력해주세요",
        "emailAddress": "이메일 주소",
        "emailToReach": "",
        "firstName": "",
        "fullName": "",
        "gender": "",
        "inputOption": "옵션을 직접 입력하세요.",
        "jumpTo": "",
        "language": "",
        "lastName": "",
        "MarkLabel": "",
        "markPosition": "",
        "maximumScaleValue": "",
        "mininumScaleValue": "",
        "nationality": "",
        "newPassword": "새 비밀번호 입력",
        "password": "비밀번호",
        "paypalEmail": "",
        "phoneNumber": "",
        "questionAnalytics": "",
        "questionChartType": "",
        "questionJumpTo": "",
        "questionLabel": "",
        "questionMaximumScale": "",
        "questionMinimumScale": "",
        "questionRangeMax": "",
        "questionRangeMin": "",
        "questionSectionSelect": "",
        "questionType": "",
        "search": "",
        "selectAnswers": "답변 선택",
        "selectBrand": "브랜드 선택",
        "selectConditionType": "조건 유형 선택",
        "selectOne": "하나의 옵션 선택",
        "selectOrganization": "",
        "selectType": "",
        "startingFrom": "",
        "typeHere": "여기에 입력하세요...",
        "upTo": "",
        "user": "",
        "username": "사용자 이름",
        "writeAnswer": "여기에 답을 적으세요"
    },
    "profileLink": "",
    "requestAccount": "",
    "requestAccountOr": "",
    "requestOneButton": "한 가지 요청",
    "requestOperatorAccount": "",
    "requestTasterAccount": "",
    "settings": {
        "charts": {
            "alertModalDescription": "",
            "alertModalTitle": "",
            "cancel": "",
            "error": "",
            "filterByQuestionType": "",
            "globalSettingsTitle": "",
            "optionLabels": {
                "absolutePercentageValues": "",
                "barsSortOrder": "",
                "colorPicker": "",
                "dataformat": {
                    "abs": "",
                    "perc": "",
                    "perc_abs": "",
                    "perc_abs_prod": "",
                    "perc_abs_teh": "",
                    "valueType": ""
                },
                "generalColorPicker": "",
                "groupLabels": "",
                "hasOutline": "",
                "howManyDecimals": "",
                "isCountProGroupShown": "",
                "isCountProLabelShown": "",
                "isDataTableShown": "",
                "isDataTableShown_format": "",
                "isMeanProLabelsShown": "",
                "isProductLabelsSwapped": "",
                "isStackedLabelsReversed": "",
                "isStackedValuesShown": "",
                "isStatisticsTableShown": "",
                "isTotalRespondentsShown": "",
                "mapColorPicker": "",
                "outlineColor": "",
                "outlineWidth": "",
                "percentageGrouping": {
                    "inner": "",
                    "outer": ""
                },
                "percentageGroupingLabel": "",
                "sortOrder": {
                    "nameAsc": "",
                    "nameDesc": "",
                    "valueAsc": "",
                    "valueDesc": ""
                },
                "timestampColorPicker": ""
            },
            "resetDefaults": "",
            "set": "",
            "setGlobal": "",
            "setSimilar": "",
            "settingsPopupTitle": "",
            "success": ""
        }
    },
    "signIn": "로그인",
    "signOut": "로그아웃",
    "survey": {
        "already_taken": "관심에 감사드립니다. 본 설문에 이미 답변하셨습니다.",
        "surveysListing": "설문 조사 목록",
        "termsOfUse": "이용 약관"
    },
    "surveyAnalysis": {
        "exitReport": {
            "desc": "",
            "ok": "",
            "title": ""
        },
        "filter": {
            "back": "",
            "next": ""
        },
        "settings": {
            "analysisTypes": "",
            "next": "",
            "question": "",
            "referenceQuestion": ""
        },
        "tabs": {
            "filter": "",
            "report": "",
            "settings": ""
        }
    },
    "surveyCreation": {
        "mandatoryQuestion": "필수 질문"
    },
    "surveyEmailSettings": {
        "enabledEmailTypes": {
            "survey-completed": "",
            "survey-rejected": "",
            "survey-waiting": ""
        },
        "enabledEmailTypesCaption": ""
    },
    "surveyPayments": {
        "active": "",
        "paymentTypes": {
            "giftCard": "",
            "paypal": ""
        }
    },
    "surveySettings": {
        "autoAdvanceSettings": {
            "active": "",
            "autoAdvance": "",
            "caption": "",
            "debounce": "",
            "hideNextButton": "",
            "nextButton": ""
        },
        "pdfFooterData": {
            "label": ""
        },
        "pdfFooterSettings": {
            "note": ""
        },
        "screenerOnly": {
            "active": "",
            "title": ""
        },
        "sharingButtons": {
            "label": "",
            "yes": ""
        },
        "showGeneratePdf": {
            "active": "네",
            "title": "맛 감별사 의견 보고 활성화(PDF)"
        },
        "tastingNotes": {
            "country": "",
            "customer": "",
            "dateOfTasting": "",
            "otherInfo": "",
            "tastingId": "",
            "tastingLeader": ""
        },
        "valdatedChartData": {
            "label": "",
            "yes": ""
        },
        "validations": {
            "debounce": {
                "max": "",
                "min": "",
                "required": "",
                "step": ""
            }
        }
    },
    "theFlavorWikiTeam": "FlavorWiki 팀",
    "tooltips": {
        "cloneSurveyButton": "",
        "copyQr": "",
        "copySurveyUrlButton": "",
        "debounceTooltip": "",
        "deletePicture": "",
        "deleteQr": "",
        "deleteSurveyButton": "",
        "downloadQr": "",
        "duplicateQuestion": "",
        "editDraftButton": "",
        "editQr": "",
        "editSurveyAlertFullOption": "",
        "editSurveyAlertStrictOption": "",
        "editSurveyButton": "",
        "exportGiftCardIncentivesButton": "",
        "exportGiftCardSharesButton": "",
        "exportProductIncentivesButton": "",
        "exportSharingButton": "",
        "exportSurveyButton": "",
        "exportSurveyPhotosButton": "",
        "forms": {
            "uniqueNameTooltip": {
                "add": "",
                "edit": ""
            }
        },
        "funnelActions": "",
        "hideNextButtonTooltip": "",
        "imageDisplayOptionsHelper": "",
        "importGiftCardIncentives": "",
        "importGiftCardShares": "",
        "importProductIncentives": "",
        "importSurveyShares": "",
        "invalidSurveyPhotos": "",
        "likingQuestionRestricted": "",
        "moreActions": "",
        "newProduct": "",
        "newQuestion": "",
        "notProcessedSurveyPhotos": "",
        "operatorSurveyDetailBar": {
            "after": "",
            "basics": "",
            "before": "",
            "linkedSurveys": "",
            "payments": "",
            "products": "",
            "screening": "",
            "settings": "",
            "tasting": "",
            "tastingNotes": ""
        },
        "pauseSurvey": "",
        "previewDraft": "",
        "product": {
            "brand": "",
            "canNotDelete": "",
            "isAvailable": "",
            "name": "",
            "picture": "",
            "reward": ""
        },
        "productDisplayDragAndDrop": "",
        "productDisplayOptions": "",
        "publishSurvey": "",
        "questionCreation": {
            "maxProductsToTaste": "",
            "minProductsToTaste": "",
            "prompt": "",
            "secondaryPrompt": ""
        },
        "questionHeader": {
            "choose-payment": "",
            "choose-product": "",
            "paypal-email": ""
        },
        "questionType": {
            "choose-date": "",
            "choose-multiple": "",
            "choose-one": "",
            "dropdown": "",
            "email": "",
            "info": "",
            "location": "",
            "numeric": "",
            "open-answer": "",
            "paired-questions": "",
            "select-and-justify": "",
            "slider": "",
            "time-stamp": "",
            "upload-picture": "",
            "vertical-rating": ""
        },
        "removeQuestion": "",
        "resumeSurvey": "",
        "saveDraft": "",
        "saveDraftSurvey": "",
        "screenerOnly": "",
        "ShareSurveyStats": "",
        "showGeneratePdf": "맛 감별사가 PDF 형식의 차트를 다운로드할 수 있게 활성화합니다.",
        "stats": {
            "addColor": "",
            "reset": "",
            "setGlobal": ""
        },
        "strictOptions": "",
        "surveyBasicInfoForm": {
            "authorizationType": "",
            "continueButton": "",
            "country": "",
            "customizeSharing": "",
            "instruction": "",
            "instructionSteps": "",
            "loginText": "",
            "name": "",
            "nextButton": "",
            "pauseText": "",
            "referralAmount": "",
            "rejection": "",
            "screening": "",
            "securitySettings": "",
            "selectLanguage": "",
            "skipButton": "",
            "startSurveyButton": "",
            "staticUniqueName": "",
            "thankYou": "",
            "uniqueName": ""
        },
        "surveyCharts": "",
        "updateSurvey": "",
        "updateSurveyDraft": "",
        "validSurveyPhotos": ""
    },
    "tooltips.likingQuestionRestricted": "",
    "validation": {
        "analyticsValue": "",
        "analyticsValueIsPositive": "",
        "analyticsValueWithoutSpaces": "",
        "basics": {
            "allowedDaysToFillTheTasting": {
                "integer": "",
                "max": "",
                "min": "",
                "required": ""
            },
            "customButtons": {
                "continueEmptySpaces": "",
                "continueRequired": "",
                "nextEmptySpaces": "",
                "nextRequired": "",
                "skipEmptySpaces": "",
                "skipRequired": "",
                "startEmptySpaces": "",
                "startRequired": ""
            },
            "excluseiveTasters": {
                "email": "",
                "required": "",
                "withoutSpaces": ""
            },
            "instruction": "지침은 공백으로 놔둘 수 없습니다.",
            "instructionRequired": "설명은 필수입니다.",
            "instructionWithoutSpaces": "지침은 공백으로 시작할 수 없습니다.",
            "maxProductStatCount": {
                "isMax": "",
                "max": "",
                "min": "",
                "required": ""
            },
            "name": {
                "required": "",
                "withoutSpaces": ""
            },
            "referralAmount": {
                "isNumber": "",
                "max": "",
                "min": "",
                "required": ""
            },
            "uniquName": {
                "required": "",
                "restrict": "",
                "withoutSpaces": ""
            }
        },
        "birthday": {
            "required": ""
        },
        "chartTitle": {
            "required": "",
            "whitespace": ""
        },
        "chartTopic": {
            "required": "",
            "whitespace": ""
        },
        "chartType": {
            "minProductsForCorrelation": "",
            "required": "",
            "wrongChartType": ""
        },
        "chooseProduct": {
            "equalOrLess": "",
            "greaterThan": "",
            "maxProducts": {
                "integer": "",
                "required": ""
            },
            "minProducts": {
                "integer": "",
                "required": ""
            }
        },
        "confirmPassword": {
            "required": "새 비밀번호를 입력해 주세요!"
        },
        "currentPassword": {
            "required": "현재 비밀번호를 입력해 주세요!"
        },
        "dropdown": {
            "minim": "",
            "options": {
                "analytics": {
                    "required": ""
                },
                "label": {
                    "required": ""
                }
            },
            "prompt": "",
            "uniqueOptions": ""
        },
        "email": {
            "email": "",
            "required": ""
        },
        "emailTemplate": {
            "html": {
                "required": ""
            },
            "subject": {
                "required": ""
            },
            "text": {
                "required": ""
            }
        },
        "firstname": {
            "required": ""
        },
        "info": {
            "prompt": "",
            "secondaryPrompt": ""
        },
        "integer": "",
        "label": "",
        "labelWithoutSpaces": "",
        "lastname": {
            "required": ""
        },
        "location": {
            "region": ""
        },
        "multiple": {
            "maxAnswerValues": {
                "lessThanTotal": "",
                "min": "",
                "moreThanMin": "",
                "typeError": ""
            },
            "minAnswerValues": {
                "lessThanMax": "",
                "lessThanTotal": "",
                "min": "",
                "typeError": ""
            },
            "minim": "",
            "options": {
                "analytics": {
                    "required": ""
                },
                "label": {
                    "required": ""
                }
            },
            "uniqueOptions": ""
        },
        "newPassword": {
            "required": "비밀번호를 확인해 주세요!"
        },
        "numeric": {
            "greaterOrEqual": "값은 {{min}} 이상이어야합니다.",
            "integer": "값은 정수 여야합니다",
            "lessOrEqual": "값은 {{max}} 이하 여야합니다.",
            "maxNumber": "",
            "minNumber": "",
            "moreThan": "",
            "questionRequired": ""
        },
        "one": {
            "minim": "",
            "options": {
                "analytics": {
                    "required": ""
                },
                "label": {
                    "required": ""
                }
            },
            "uniqueOptions": ""
        },
        "organizationForm": {
            "name": {
                "maxLength": "",
                "required": "",
                "withoutSpaces": ""
            },
            "uniqueName": {
                "matches": "",
                "required": ""
            }
        },
        "paired": {
            "likingQuestion": "",
            "options": {
                "integer": "",
                "max": "",
                "min": "",
                "required": ""
            },
            "pairs": {
                "min": "",
                "unique": ""
            },
            "profileTitle": {
                "required": "",
                "string": ""
            }
        },
        "product": {
            "reward": ""
        },
        "products": {
            "brand": "",
            "brandWithoutSpaces": "",
            "isAvailable": "",
            "name": "",
            "nameWithoutSpaces": "",
            "rewardMin": "",
            "rewardNumber": "",
            "rewardWithoutSpaces": ""
        },
        "profileTitle": {
            "required": "",
            "string": "",
            "withoutSpaces": ""
        },
        "prompt": "",
        "promptWithoutSpaces": "",
        "questionCreation": {
            "questionType": {
                "required": ""
            }
        },
        "required": "",
        "requiredField": "",
        "secondaryPrompt": "",
        "secondaryPromptWithoutSpaces": "",
        "selectAndJustify": {
            "minim": "",
            "options": {
                "analytics": {
                    "required": ""
                },
                "label": {
                    "required": ""
                }
            },
            "prompt": "",
            "secondaryPrompt": "",
            "uniqueOptions": ""
        },
        "slider": {
            "promptString": "",
            "range": {
                "marks": {
                    "label": {
                        "required": "",
                        "string": ""
                    },
                    "unique": "",
                    "value": {
                        "lessThan": "",
                        "moreThan": "",
                        "number": "",
                        "required": ""
                    },
                    "withoutSpaces": ""
                },
                "max": {
                    "digits": "",
                    "greaterThan": "",
                    "number": "",
                    "required": ""
                },
                "min": {
                    "digits": "",
                    "greaterThan": "",
                    "lessThan": "",
                    "number": "",
                    "required": ""
                },
                "sliders": {
                    "atLeast": "",
                    "required": "",
                    "unique": "",
                    "withoutSpaces": ""
                },
                "step": {
                    "digits": "",
                    "greaterThan": "",
                    "lessThan": "",
                    "number": "",
                    "required": "",
                    "submultiple": ""
                }
            },
            "secondaryPrompt": ""
        },
        "surveyAnalysis": {
            "analysisTypes": {
                "minRequired": ""
            },
            "filterProducts": {
                "minRequired": ""
            },
            "filterQuestions": {
                "error": "",
                "minRequired": ""
            },
            "question": {
                "required": ""
            },
            "referenceQuestion": {
                "required": ""
            }
        },
        "surveyBasicInfoForm": {
            "name": {
                "required": ""
            }
        },
        "tasterName": {
            "digitsOnly": "",
            "lettersDigitsOnly": "",
            "maxLength": "",
            "minLength": "",
            "noSpaces": "",
            "settings": {
                "maxLength": {
                    "min": "",
                    "moreThanMin": "",
                    "typeError": ""
                },
                "minLength": {
                    "lessThanMax": "",
                    "min": "",
                    "typeError": ""
                }
            }
        },
        "userForm": {
            "email": {
                "maxLength": "",
                "required": "이메일은 필수입니다"
            },
            "fullName": {
                "maxLength": "",
                "nameWithoutSpaces": "",
                "required": "이름은 필수입니다"
            },
            "organization": {
                "typeError": ""
            }
        },
        "vertical": {
            "range": {
                "labels": {
                    "canBeUsed": "",
                    "required": ""
                },
                "max": {
                    "greaterThanMin": "",
                    "integer": "",
                    "moreThan": ""
                },
                "min": {
                    "greaterThan0": "",
                    "integer": "",
                    "lessThan": "",
                    "moreThan": ""
                },
                "skipMax": {
                    "integer": "",
                    "lessThan": "",
                    "moreThan": "",
                    "number": ""
                },
                "skipMin": {
                    "integer": "",
                    "lessThan": "",
                    "moreThan": "",
                    "number": ""
                }
            }
        }
    }
}