// Jest Snapshot v1, https://goo.gl/fbAQLP

exports[`OnboardingForm should render OnboardingForm 1`] = `
<Styled(Form)
  formProps={Object {}}
>
  <styled.div>
    Onboard form
  </styled.div>
</Styled(Form)>
`;
