// Jest Snapshot v1, https://goo.gl/fbAQLP

exports[`SelectCategory should check SelectCategory 1`] = `
<Fragment>
  <styled.div>
    <Select
      fieldDecorator={[Function]}
      getOptionName={[Function]}
      getOptionValue={[Function]}
      isDisabledOption={[Function]}
      label="components.products.category"
      onChange={[Function]}
      options={
        Array [
          "cate-1",
          "cate-2",
        ]
      }
      placeholder="placeholders.category"
      size="default"
      t={[Function]}
      value="cate-2"
    />
  </styled.div>
  <Styled(Divider) />
</Fragment>
`;
