// Jest Snapshot v1, https://goo.gl/fbAQLP

exports[`LabeledProgressBar should render LabeledProgressBar 1`] = `
<Fragment>
  <styled.div>
    Answered
  </styled.div>
  <ProgressBar
    percentage={100}
    showPercentage={false}
    strokeWidth={5}
  />
</Fragment>
`;
