// Jest Snapshot v1, https://goo.gl/fbAQLP

exports[`AddProductToCreate should render AddProductToCreate 1`] = `
<ApolloProvider
  client={MockedClient {}}
>
  <Router
    history={
      Object {
        "listen": [Function],
        "location": Object {
          "pathname": "",
        },
        "push": [Function],
      }
    }
  >
    <AddProductToCreate
      history={
        Object {
          "listen": [Function],
          "location": Object {
            "pathname": "",
          },
          "push": [Function],
        }
      }
    >
      <CreationButtonContainer
        data-testid="new-product-button"
        onClick={[Function]}
        text="containers.addProductsToCreate.newProduct"
        tooltip="tooltips.newProduct"
      >
        <styled.div>
          <div
            className="sc-gzVnrw IWAnF"
          >
            <TooltipWrapper
              helperText="tooltips.newProduct"
              onVisibleChange={[Function]}
              visible={false}
            >
              <Styled(Tooltip)
                arrowPointAtCenter={true}
                isTab={false}
                onVisibleChange={[Function]}
                placement="top"
                title={
                  <styled.div
                    dangerouslySetInnerHTML={
                      Object {
                        "__html": "tooltips.newProduct",
                      }
                    }
                  />
                }
                visible={false}
              >
                <Tooltip
                  arrowPointAtCenter={true}
                  autoAdjustOverflow={true}
                  className="sc-htoDjs kMepyx"
                  isTab={false}
                  mouseEnterDelay={0.1}
                  mouseLeaveDelay={0.1}
                  onVisibleChange={[Function]}
                  placement="top"
                  title={
                    <styled.div
                      dangerouslySetInnerHTML={
                        Object {
                          "__html": "tooltips.newProduct",
                        }
                      }
                    />
                  }
                  transitionName="zoom-big-fast"
                  visible={false}
                >
                  <Tooltip
                    align={Object {}}
                    arrowContent={null}
                    arrowPointAtCenter={true}
                    autoAdjustOverflow={true}
                    builtinPlacements={
                      Object {
                        "bottom": Object {
                          "ignoreShake": true,
                          "offset": Array [
                            0,
                            4,
                          ],
                          "overflow": Object {
                            "adjustX": 1,
                            "adjustY": 1,
                          },
                          "points": Array [
                            "tc",
                            "bc",
                          ],
                          "targetOffset": Array [
                            0,
                            0,
                          ],
                        },
                        "bottomLeft": Object {
                          "ignoreShake": true,
                          "offset": Array [
                            -21,
                            4,
                          ],
                          "overflow": Object {
                            "adjustX": 1,
                            "adjustY": 1,
                          },
                          "points": Array [
                            "tl",
                            "bc",
                          ],
                          "targetOffset": Array [
                            0,
                            0,
                          ],
                        },
                        "bottomRight": Object {
                          "ignoreShake": true,
                          "offset": Array [
                            21,
                            4,
                          ],
                          "overflow": Object {
                            "adjustX": 1,
                            "adjustY": 1,
                          },
                          "points": Array [
                            "tr",
                            "bc",
                          ],
                          "targetOffset": Array [
                            0,
                            0,
                          ],
                        },
                        "left": Object {
                          "ignoreShake": true,
                          "offset": Array [
                            -4,
                            0,
                          ],
                          "overflow": Object {
                            "adjustX": 1,
                            "adjustY": 1,
                          },
                          "points": Array [
                            "cr",
                            "cl",
                          ],
                          "targetOffset": Array [
                            0,
                            0,
                          ],
                        },
                        "leftBottom": Object {
                          "ignoreShake": true,
                          "offset": Array [
                            -4,
                            13,
                          ],
                          "overflow": Object {
                            "adjustX": 1,
                            "adjustY": 1,
                          },
                          "points": Array [
                            "br",
                            "cl",
                          ],
                          "targetOffset": Array [
                            0,
                            0,
                          ],
                        },
                        "leftTop": Object {
                          "ignoreShake": true,
                          "offset": Array [
                            -4,
                            -13,
                          ],
                          "overflow": Object {
                            "adjustX": 1,
                            "adjustY": 1,
                          },
                          "points": Array [
                            "tr",
                            "cl",
                          ],
                          "targetOffset": Array [
                            0,
                            0,
                          ],
                        },
                        "right": Object {
                          "ignoreShake": true,
                          "offset": Array [
                            4,
                            0,
                          ],
                          "overflow": Object {
                            "adjustX": 1,
                            "adjustY": 1,
                          },
                          "points": Array [
                            "cl",
                            "cr",
                          ],
                          "targetOffset": Array [
                            0,
                            0,
                          ],
                        },
                        "rightBottom": Object {
                          "ignoreShake": true,
                          "offset": Array [
                            4,
                            13,
                          ],
                          "overflow": Object {
                            "adjustX": 1,
                            "adjustY": 1,
                          },
                          "points": Array [
                            "bl",
                            "cr",
                          ],
                          "targetOffset": Array [
                            0,
                            0,
                          ],
                        },
                        "rightTop": Object {
                          "ignoreShake": true,
                          "offset": Array [
                            4,
                            -13,
                          ],
                          "overflow": Object {
                            "adjustX": 1,
                            "adjustY": 1,
                          },
                          "points": Array [
                            "tl",
                            "cr",
                          ],
                          "targetOffset": Array [
                            0,
                            0,
                          ],
                        },
                        "top": Object {
                          "ignoreShake": true,
                          "offset": Array [
                            0,
                            -4,
                          ],
                          "overflow": Object {
                            "adjustX": 1,
                            "adjustY": 1,
                          },
                          "points": Array [
                            "bc",
                            "tc",
                          ],
                          "targetOffset": Array [
                            0,
                            0,
                          ],
                        },
                        "topLeft": Object {
                          "ignoreShake": true,
                          "offset": Array [
                            -21,
                            -4,
                          ],
                          "overflow": Object {
                            "adjustX": 1,
                            "adjustY": 1,
                          },
                          "points": Array [
                            "bl",
                            "tc",
                          ],
                          "targetOffset": Array [
                            0,
                            0,
                          ],
                        },
                        "topRight": Object {
                          "ignoreShake": true,
                          "offset": Array [
                            21,
                            -4,
                          ],
                          "overflow": Object {
                            "adjustX": 1,
                            "adjustY": 1,
                          },
                          "points": Array [
                            "br",
                            "tc",
                          ],
                          "targetOffset": Array [
                            0,
                            0,
                          ],
                        },
                      }
                    }
                    className="sc-htoDjs kMepyx"
                    destroyTooltipOnHide={false}
                    isTab={false}
                    mouseEnterDelay={0.1}
                    mouseLeaveDelay={0.1}
                    onPopupAlign={[Function]}
                    onVisibleChange={[Function]}
                    overlay={
                      <styled.div
                        dangerouslySetInnerHTML={
                          Object {
                            "__html": "tooltips.newProduct",
                          }
                        }
                      />
                    }
                    placement="top"
                    prefixCls="ant-tooltip"
                    title={
                      <styled.div
                        dangerouslySetInnerHTML={
                          Object {
                            "__html": "tooltips.newProduct",
                          }
                        }
                      />
                    }
                    transitionName="zoom-big-fast"
                    trigger={
                      Array [
                        "hover",
                      ]
                    }
                    visible={false}
                  >
                    <Trigger
                      action={
                        Array [
                          "hover",
                        ]
                      }
                      afterPopupVisibleChange={[Function]}
                      arrowContent={null}
                      arrowPointAtCenter={true}
                      autoAdjustOverflow={true}
                      blurDelay={0.15}
                      builtinPlacements={
                        Object {
                          "bottom": Object {
                            "ignoreShake": true,
                            "offset": Array [
                              0,
                              4,
                            ],
                            "overflow": Object {
                              "adjustX": 1,
                              "adjustY": 1,
                            },
                            "points": Array [
                              "tc",
                              "bc",
                            ],
                            "targetOffset": Array [
                              0,
                              0,
                            ],
                          },
                          "bottomLeft": Object {
                            "ignoreShake": true,
                            "offset": Array [
                              -21,
                              4,
                            ],
                            "overflow": Object {
                              "adjustX": 1,
                              "adjustY": 1,
                            },
                            "points": Array [
                              "tl",
                              "bc",
                            ],
                            "targetOffset": Array [
                              0,
                              0,
                            ],
                          },
                          "bottomRight": Object {
                            "ignoreShake": true,
                            "offset": Array [
                              21,
                              4,
                            ],
                            "overflow": Object {
                              "adjustX": 1,
                              "adjustY": 1,
                            },
                            "points": Array [
                              "tr",
                              "bc",
                            ],
                            "targetOffset": Array [
                              0,
                              0,
                            ],
                          },
                          "left": Object {
                            "ignoreShake": true,
                            "offset": Array [
                              -4,
                              0,
                            ],
                            "overflow": Object {
                              "adjustX": 1,
                              "adjustY": 1,
                            },
                            "points": Array [
                              "cr",
                              "cl",
                            ],
                            "targetOffset": Array [
                              0,
                              0,
                            ],
                          },
                          "leftBottom": Object {
                            "ignoreShake": true,
                            "offset": Array [
                              -4,
                              13,
                            ],
                            "overflow": Object {
                              "adjustX": 1,
                              "adjustY": 1,
                            },
                            "points": Array [
                              "br",
                              "cl",
                            ],
                            "targetOffset": Array [
                              0,
                              0,
                            ],
                          },
                          "leftTop": Object {
                            "ignoreShake": true,
                            "offset": Array [
                              -4,
                              -13,
                            ],
                            "overflow": Object {
                              "adjustX": 1,
                              "adjustY": 1,
                            },
                            "points": Array [
                              "tr",
                              "cl",
                            ],
                            "targetOffset": Array [
                              0,
                              0,
                            ],
                          },
                          "right": Object {
                            "ignoreShake": true,
                            "offset": Array [
                              4,
                              0,
                            ],
                            "overflow": Object {
                              "adjustX": 1,
                              "adjustY": 1,
                            },
                            "points": Array [
                              "cl",
                              "cr",
                            ],
                            "targetOffset": Array [
                              0,
                              0,
                            ],
                          },
                          "rightBottom": Object {
                            "ignoreShake": true,
                            "offset": Array [
                              4,
                              13,
                            ],
                            "overflow": Object {
                              "adjustX": 1,
                              "adjustY": 1,
                            },
                            "points": Array [
                              "bl",
                              "cr",
                            ],
                            "targetOffset": Array [
                              0,
                              0,
                            ],
                          },
                          "rightTop": Object {
                            "ignoreShake": true,
                            "offset": Array [
                              4,
                              -13,
                            ],
                            "overflow": Object {
                              "adjustX": 1,
                              "adjustY": 1,
                            },
                            "points": Array [
                              "tl",
                              "cr",
                            ],
                            "targetOffset": Array [
                              0,
                              0,
                            ],
                          },
                          "top": Object {
                            "ignoreShake": true,
                            "offset": Array [
                              0,
                              -4,
                            ],
                            "overflow": Object {
                              "adjustX": 1,
                              "adjustY": 1,
                            },
                            "points": Array [
                              "bc",
                              "tc",
                            ],
                            "targetOffset": Array [
                              0,
                              0,
                            ],
                          },
                          "topLeft": Object {
                            "ignoreShake": true,
                            "offset": Array [
                              -21,
                              -4,
                            ],
                            "overflow": Object {
                              "adjustX": 1,
                              "adjustY": 1,
                            },
                            "points": Array [
                              "bl",
                              "tc",
                            ],
                            "targetOffset": Array [
                              0,
                              0,
                            ],
                          },
                          "topRight": Object {
                            "ignoreShake": true,
                            "offset": Array [
                              21,
                              -4,
                            ],
                            "overflow": Object {
                              "adjustX": 1,
                              "adjustY": 1,
                            },
                            "points": Array [
                              "br",
                              "tc",
                            ],
                            "targetOffset": Array [
                              0,
                              0,
                            ],
                          },
                        }
                      }
                      className="sc-htoDjs kMepyx"
                      defaultPopupVisible={false}
                      destroyPopupOnHide={false}
                      focusDelay={0}
                      getDocument={[Function]}
                      getPopupClassNameFromAlign={[Function]}
                      hideAction={Array []}
                      isTab={false}
                      mask={false}
                      maskClosable={true}
                      mouseEnterDelay={0.1}
                      mouseLeaveDelay={0.1}
                      onPopupAlign={[Function]}
                      onPopupVisibleChange={[Function]}
                      overlay={
                        <styled.div
                          dangerouslySetInnerHTML={
                            Object {
                              "__html": "tooltips.newProduct",
                            }
                          }
                        />
                      }
                      popup={[Function]}
                      popupAlign={Object {}}
                      popupClassName=""
                      popupPlacement="top"
                      popupStyle={Object {}}
                      popupTransitionName="zoom-big-fast"
                      popupVisible={false}
                      prefixCls="ant-tooltip"
                      showAction={Array []}
                      title={
                        <styled.div
                          dangerouslySetInnerHTML={
                            Object {
                              "__html": "tooltips.newProduct",
                            }
                          }
                        />
                      }
                      visible={false}
                    >
                      <CustomButton
                        className="sc-htoDjs kMepyx"
                        data-testid="new-product-button"
                        onClick={[Function]}
                        onMouseEnter={[Function]}
                        onMouseLeave={[Function]}
                      >
                        <Styled(Styled(Button))
                          className="sc-htoDjs kMepyx"
                          data-testid="new-product-button"
                          onClick={[Function]}
                          onMouseEnter={[Function]}
                          onMouseLeave={[Function]}
                          size="large"
                        >
                          <Styled(Button)
                            className="sc-htoDjs kMepyx sc-bZQynM gLZPvi"
                            data-testid="new-product-button"
                            onClick={[Function]}
                            onMouseEnter={[Function]}
                            onMouseLeave={[Function]}
                            size="large"
                          >
                            <Button
                              block={false}
                              className="sc-htoDjs kMepyx sc-bZQynM gLZPvi sc-bdVaJa joAlxw"
                              data-testid="new-product-button"
                              ghost={false}
                              htmlType="button"
                              loading={false}
                              onClick={[Function]}
                              onMouseEnter={[Function]}
                              onMouseLeave={[Function]}
                              size="large"
                            >
                              <Wave>
                                <button
                                  className="ant-btn sc-htoDjs kMepyx sc-bZQynM gLZPvi sc-bdVaJa joAlxw ant-btn-lg"
                                  data-testid="new-product-button"
                                  onClick={[Function]}
                                  onMouseEnter={[Function]}
                                  onMouseLeave={[Function]}
                                  type="button"
                                >
                                  <span>
                                    containers.addProductsToCreate.newProduct
                                  </span>
                                </button>
                              </Wave>
                            </Button>
                          </Styled(Button)>
                        </Styled(Styled(Button))>
                      </CustomButton>
                    </Trigger>
                  </Tooltip>
                </Tooltip>
              </Styled(Tooltip)>
            </TooltipWrapper>
          </div>
        </styled.div>
      </CreationButtonContainer>
    </AddProductToCreate>
  </Router>
</ApolloProvider>
`;
