// Jest Snapshot v1, https://goo.gl/fbAQLP

exports[`HamburguerMenu should render HamburguerMenu 1`] = `
<Fragment>
  <styled.div
    visible={false}
  >
    <HamburgerMenu
      animationDuration={0.5}
      color="#000000"
      height={15}
      isOpen={false}
      menuClicked={[Function]}
      strokeWidth={2}
      width={20}
    />
  </styled.div>
  <Menu
    entriesData={
      Array [
        Object {
          "route": "/",
          "title": "Home",
        },
        Object {
          "action": [Function],
          "title": "Sign Out",
        },
      ]
    }
    getEntryName={[Function]}
    onClickEntry={[Function]}
    title="Test Display"
    visible={false}
  />
</Fragment>
`;
