// Jest Snapshot v1, https://goo.gl/fbAQLP

exports[`SurveyScreeningCompleted should render SurveyScreeningCompleted 1`] = `
<ApolloProvider
  client={MockedClient {}}
>
  <Router
    history={
      Object {
        "action": "POP",
        "block": [Function],
        "createHref": [Function],
        "go": [Function],
        "goBack": [Function],
        "goForward": [Function],
        "length": 1,
        "listen": [Function],
        "location": Object {
          "hash": "",
          "pathname": "/",
          "search": "",
          "state": undefined,
        },
        "push": [Function],
        "replace": [Function],
      }
    }
  >
    <withI18nextTranslation(SurveyScreeningCompleted)
      surveyId="survey-1"
    >
      <SurveyScreeningCompleted
        i18n={I18n {}}
        surveyId="survey-1"
        t={[Function]}
        tReady={true}
      >
        <withI18nextTranslation(SurveyScreeningInfoText)
          description="<p><strong><span style=\\"font-size: 20pt;\\">Congratulations</span></strong></p>
        <p>You have qualified for the tasting. Please click the button below to continue.<br/>
        You will also receive an email shortly with this link as a reminder.</p>
        <p>If you have any questions, please use the support box below or email:</p>
        <p><a href=\\"mailto:support@flavorwiki.com\\">support@flavorwiki.com</a></p>
        <p>Happy Tasting!</p>
        <p>The FlavorWiki Team</p>"
          onClick={[Function]}
        >
          <SurveyScreeningInfoText
            description="<p><strong><span style=\\"font-size: 20pt;\\">Congratulations</span></strong></p>
          <p>You have qualified for the tasting. Please click the button below to continue.<br/>
          You will also receive an email shortly with this link as a reminder.</p>
          <p>If you have any questions, please use the support box below or email:</p>
          <p><a href=\\"mailto:support@flavorwiki.com\\">support@flavorwiki.com</a></p>
          <p>Happy Tasting!</p>
          <p>The FlavorWiki Team</p>"
            i18n={I18n {}}
            onClick={[Function]}
            t={[Function]}
            tReady={true}
          >
            <Component>
              <MediaQuery
                query="(min-width: 992px)"
                values={null}
              >
                <styled.div
                  desktop={false}
                >
                  <div
                    className="sc-htoDjs fMhxiM"
                  >
                    <Styled(Styled(Text))
                      dangerouslySetInnerHTML={
                        Object {
                          "__html": "<p><strong><span style=\\"font-size: 20pt;\\">Congratulations</span></strong></p>
                        <p>You have qualified for the tasting. Please click the button below to continue.<br/>
                        You will also receive an email shortly with this link as a reminder.</p>
                        <p>If you have any questions, please use the support box below or email:</p>
                        <p><a href=\\"mailto:support@flavorwiki.com\\">support@flavorwiki.com</a></p>
                        <p>Happy Tasting!</p>
                        <p>The FlavorWiki Team</p>",
                        }
                      }
                    >
                      <Styled(Text)
                        className="sc-iwsKbI iVdgSL"
                        dangerouslySetInnerHTML={
                          Object {
                            "__html": "<p><strong><span style=\\"font-size: 20pt;\\">Congratulations</span></strong></p>
                          <p>You have qualified for the tasting. Please click the button below to continue.<br/>
                          You will also receive an email shortly with this link as a reminder.</p>
                          <p>If you have any questions, please use the support box below or email:</p>
                          <p><a href=\\"mailto:support@flavorwiki.com\\">support@flavorwiki.com</a></p>
                          <p>Happy Tasting!</p>
                          <p>The FlavorWiki Team</p>",
                          }
                        }
                      >
                        <Text
                          className="sc-iwsKbI iVdgSL sc-dnqmqq hQxVSM"
                          dangerouslySetInnerHTML={
                            Object {
                              "__html": "<p><strong><span style=\\"font-size: 20pt;\\">Congratulations</span></strong></p>
                            <p>You have qualified for the tasting. Please click the button below to continue.<br/>
                            You will also receive an email shortly with this link as a reminder.</p>
                            <p>If you have any questions, please use the support box below or email:</p>
                            <p><a href=\\"mailto:support@flavorwiki.com\\">support@flavorwiki.com</a></p>
                            <p>Happy Tasting!</p>
                            <p>The FlavorWiki Team</p>",
                            }
                          }
                        >
                          <styled.span
                            className="sc-iwsKbI iVdgSL sc-dnqmqq hQxVSM"
                            dangerouslySetInnerHTML={
                              Object {
                                "__html": "<p><strong><span style=\\"font-size: 20pt;\\">Congratulations</span></strong></p>
                              <p>You have qualified for the tasting. Please click the button below to continue.<br/>
                              You will also receive an email shortly with this link as a reminder.</p>
                              <p>If you have any questions, please use the support box below or email:</p>
                              <p><a href=\\"mailto:support@flavorwiki.com\\">support@flavorwiki.com</a></p>
                              <p>Happy Tasting!</p>
                              <p>The FlavorWiki Team</p>",
                              }
                            }
                          >
                            <span
                              className="sc-iwsKbI iVdgSL sc-dnqmqq hQxVSM sc-bdVaJa lbzbgo"
                              dangerouslySetInnerHTML={
                                Object {
                                  "__html": "<p><strong><span style=\\"font-size: 20pt;\\">Congratulations</span></strong></p>
                                <p>You have qualified for the tasting. Please click the button below to continue.<br/>
                                You will also receive an email shortly with this link as a reminder.</p>
                                <p>If you have any questions, please use the support box below or email:</p>
                                <p><a href=\\"mailto:support@flavorwiki.com\\">support@flavorwiki.com</a></p>
                                <p>Happy Tasting!</p>
                                <p>The FlavorWiki Team</p>",
                                }
                              }
                            />
                          </styled.span>
                        </Text>
                      </Styled(Text)>
                    </Styled(Styled(Text))>
                    <Styled(CustomButton)
                      desktop={false}
                      onClick={[Function]}
                    >
                      <CustomButton
                        className="sc-gZMcBi ejoAIR"
                        desktop={false}
                        onClick={[Function]}
                      >
                        <Styled(Styled(Button))
                          className="sc-gZMcBi ejoAIR"
                          onClick={[Function]}
                          size="large"
                        >
                          <Styled(Button)
                            className="sc-gZMcBi ejoAIR sc-gzVnrw iEYaBf"
                            onClick={[Function]}
                            size="large"
                          >
                            <Button
                              block={false}
                              className="sc-gZMcBi ejoAIR sc-gzVnrw iEYaBf sc-bwzfXH jQbnNE"
                              ghost={false}
                              htmlType="button"
                              loading={false}
                              onClick={[Function]}
                              size="large"
                            >
                              <Wave>
                                <button
                                  className="ant-btn sc-gZMcBi ejoAIR sc-gzVnrw iEYaBf sc-bwzfXH jQbnNE ant-btn-lg"
                                  onClick={[Function]}
                                  type="button"
                                />
                              </Wave>
                            </Button>
                          </Styled(Button)>
                        </Styled(Styled(Button))>
                      </CustomButton>
                    </Styled(CustomButton)>
                    <TermsAndPrivacyFooter>
                      <withI18nextTranslation(TermsAndPrivacyFooterComponent)>
                        <TermsAndPrivacyFooterComponent
                          i18n={I18n {}}
                          t={[Function]}
                          tReady={true}
                        >
                          <styled.div
                            isSurvey={false}
                          >
                            <div
                              className="sc-gqjmRU chmUGg"
                            >
                              <Link
                                replace={false}
                                target="_blank"
                                to="/terms-of-use"
                              >
                                <a
                                  href="/terms-of-use"
                                  onClick={[Function]}
                                  target="_blank"
                                >
                                  Terms of Use
                                </a>
                              </Link>
                            </div>
                          </styled.div>
                        </TermsAndPrivacyFooterComponent>
                      </withI18nextTranslation(TermsAndPrivacyFooterComponent)>
                    </TermsAndPrivacyFooter>
                  </div>
                </styled.div>
              </MediaQuery>
            </Component>
          </SurveyScreeningInfoText>
        </withI18nextTranslation(SurveyScreeningInfoText)>
      </SurveyScreeningCompleted>
    </withI18nextTranslation(SurveyScreeningCompleted)>
  </Router>
</ApolloProvider>
`;
