// Jest Snapshot v1, https://goo.gl/fbAQLP

exports[`Onboarding should render Onboarding 1`] = `
<BrowserRouter>
  <Router
    history={
      Object {
        "action": "POP",
        "block": [Function],
        "createHref": [Function],
        "go": [Function],
        "goBack": [Function],
        "goForward": [Function],
        "length": 1,
        "listen": [Function],
        "location": Object {
          "hash": "",
          "pathname": "/",
          "search": "",
          "state": undefined,
        },
        "push": [Function],
        "replace": [Function],
      }
    }
  >
    <Onboarding>
      <Component>
        <MediaQuery
          query="(min-width: 992px)"
          values={null}
        >
          <styled.div>
            <div
              className="sc-kjoXOD lakENg"
            >
              <styled.div>
                <div
                  className="sc-cHGsZl gVmSai"
                >
                  <Switch />
                </div>
              </styled.div>
            </div>
          </styled.div>
        </MediaQuery>
      </Component>
    </Onboarding>
  </Router>
</BrowserRouter>
`;
