// Jest Snapshot v1, https://goo.gl/fbAQLP

exports[`Input should render Input 1`] = `
<FieldLabel
  label="Enter input label here"
  required={true}
>
  <styled.div>
    <Component />
  </styled.div>
</FieldLabel>
`;
