<?xml version="1.0" encoding="UTF-8"?>
<svg width="24px" height="28px" viewBox="0 0 24 28" version="1.1" xmlns="http://www.w3.org/2000/svg" xmlns:xlink="http://www.w3.org/1999/xlink">
    <!-- Generator: Sketch 52.2 (67145) - http://www.bohemiancoding.com/sketch -->
    <title>Shape</title>
    <desc>Created with Sketch.</desc>
    <g id="Symbols" stroke="none" stroke-width="1" fill="none" fill-rule="evenodd">
        <g id="Survey_Card/Waiting" transform="translate(-25.000000, -60.000000)" fill="#4E4E56" fill-rule="nonzero">
            <path d="M48.9260931,67.0432708 C48.9126714,66.9882075 48.9099183,66.9283261 48.8830749,66.8791133 C48.8238818,66.7762137 48.7378453,66.6888006 48.6304718,66.6271985 L37.2440628,60.0522924 C37.0289716,59.928744 36.7681091,60.046786 36.5530179,60.1720551 L25.3844532,66.7813758 C25.3817,66.7813758 25.3817,66.7813758 25.3817,66.7813758 C25.2739824,66.7813758 25.1879459,66.8137256 25.129097,66.9173134 C25.1022536,66.9644614 25.1022536,66.9637731 25.0860788,67.0167716 C25.0671507,67.0780296 25.0351452,67.1048729 25.0351452,67.1699165 L25.0000423,80.2405753 C24.9972891,80.4873278 25.129097,80.7075812 25.3441881,80.8314737 L36.7305972,87.4032825 C36.8383148,87.4652287 36.9563569,87.494137 37.074743,87.494137 C37.1931292,87.494137 37.3139244,87.4624756 37.4188889,87.4012176 C37.4188889,87.4005293 37.4188889,87.399841 37.421642,87.3991527 L48.595369,80.9040884 C48.8077069,80.7819167 48.9367616,80.5558128 48.9395148,80.3111252 L48.9746177,67.2256681 C48.9746177,67.2256681 48.9746177,67.2249798 48.9746177,67.2242915 C48.9746177,67.2242915 48.9746177,67.2236032 48.9746177,67.2229149 C48.9746177,67.1582155 48.9450211,67.1031522 48.9260931,67.0432708 Z M36.8999169,61.443674 L41.0189984,63.8217217 L30.995751,69.3920661 L27.8096489,67.5522625 L27.097267,67.1403199 L36.8999169,61.443674 Z M36.3971199,83.1671914 L36.3919577,85.6130359 L26.3766256,79.8313859 L26.4089753,68.3327853 L30.9069614,70.9293656 L30.9420643,70.9957857 L30.9823293,70.9737604 L36.4215542,74.1147794 L36.3971199,83.1671914 Z M37.1122549,72.9223141 L32.385756,70.1939259 L42.4090035,64.6242698 L46.915249,67.2256681 L37.1122549,72.9223141 Z M47.5629315,79.9126043 L37.768541,85.6058088 L37.7712942,84.2722437 L37.7981376,74.1144353 L47.5956253,68.4212307 L47.5629315,79.9126043 Z" id="Shape"></path>
        </g>
    </g>
</svg>