{
    "buttons": {
        "cancel": "Annulla",
        "submit": "Invia"
    },
    "changePassword": "",
    "chartRegions": {
        "br": "",
        "ca": "",
        "de": "",
        "fr": "",
        "fr-dep": "",
        "uk": "",
        "us": ""
    },
    "charts": {
        "axis": {
            "stackedAnswerName": ""
        },
        "lineChart": {
            "answers": "",
            "percentage": ""
        },
        "noResults": "",
        "table": {
            "answer": "",
            "attribute": "",
            "mean": "",
            "score": "",
            "stdev": "",
            "value": ""
        },
        "tooltip": {
            "percentageOfProductGroup": "",
            "percentageOfTehGroup": "",
            "percentageOfTotal": "",
            "responses": "",
            "total": ""
        },
        "totalRespondents": ""
    },
    "chartTypes": {
        "bar": "",
        "column": "",
        "columns-mean": "",
        "horizontal-bars-mean": "",
        "line": "",
        "map": "",
        "no-chart": "",
        "pearson-table": "",
        "pie": "",
        "spearmann-table": "",
        "spider": "",
        "stacked-bar": "",
        "stacked-column": "",
        "stacked-column-horizontal-bars": "",
        "table": "",
        "tags-list": ""
    },
    "components": {
        "additionalInfo": {
            "childrenAgeLabel": "",
            "childrenAgePlaceholder": "",
            "childrenAtHome": "",
            "childrenAtHomeMsg": "",
            "childrenAtHomePlaceholder": "",
            "dietaryPlaceholder": "",
            "dietaryTitle": "",
            "ethnicity": "",
            "ethnicityPlaceholder": "",
            "income": "",
            "incomePlaceholder": "",
            "incomeRangePlaceholder": "",
            "productTypePlaceholder": "Seleziona uno o più",
            "productTypeTitle": "5 - Tipi di prodotti",
            "smokerPlaceholder": "",
            "smokerTitle": "4 - Fumatore o no",
            "updateButton": "Aggiorna informazioni"
        },
        "alertModal": {
            "cancel": "Annulla",
            "delete": "Elimina"
        },
        "backNavigation": {
            "back": "Indietro"
        },
        "bottomNavBar": {
            "steps": ""
        },
        "changePassword": {
            "confirmPassword": "",
            "currentPassword": "",
            "forgotPasswordButton": "",
            "newPassword": "",
            "passwordPrompt": "",
            "savePasswordButton": ""
        },
        "chooseMultipleSkipOptions": {
            "answersToBeSelected": "",
            "maxCondintionalOptions": "",
            "showQuestions": ""
        },
        "coverProduct": {
            "empty": "",
            "prompt": "",
            "remove": ""
        },
        "createQrCode": {
            "save": ""
        },
        "createTasterAccount": {
            "forms": {
                "first": {
                    "confirm": {
                        "label": "",
                        "placeholder": ""
                    },
                    "email": {
                        "label": "",
                        "placeholder": ""
                    },
                    "password": {
                        "label": "",
                        "placeholder": ""
                    }
                },
                "second": {
                    "country": {
                        "label": "",
                        "placeholder": ""
                    },
                    "dateofbirth": {
                        "label": "",
                        "placeholder": ""
                    },
                    "firstName": {
                        "label": "",
                        "placeholder": ""
                    },
                    "gender": {
                        "label": "",
                        "placeholder": ""
                    },
                    "langugage": {
                        "label": "",
                        "placeholder": ""
                    },
                    "lastName": {
                        "label": "",
                        "placeholder": ""
                    },
                    "state": {
                        "label": "",
                        "placeholder": ""
                    }
                },
                "third": {
                    "childrenAges": {
                        "label": "",
                        "placeholder": ""
                    },
                    "ethnicity": {
                        "label": "",
                        "placeholder": ""
                    },
                    "foodAllergies": {
                        "label": "",
                        "placeholder": ""
                    },
                    "incomeRange": {
                        "label": "",
                        "placeholder": ""
                    },
                    "marketResearchParticipation": {
                        "label": "",
                        "placeholder": ""
                    },
                    "numberOfChildren": {
                        "label": "",
                        "placeholder": ""
                    },
                    "paypalEmailAddress": {
                        "label": "",
                        "placeholder": ""
                    },
                    "smokerKind": {
                        "label": "",
                        "placeholder": ""
                    }
                }
            },
            "main": {
                "cancelText": "",
                "extraActionText": "",
                "nextStepDefault": "",
                "stepsText": ""
            },
            "steps": {
                "first": {
                    "description": "",
                    "okText": "",
                    "title": ""
                },
                "second": {
                    "description": "",
                    "okText": "",
                    "title": ""
                },
                "third": {
                    "description": "",
                    "okText": "",
                    "title": ""
                }
            },
            "validations": {
                "first": {
                    "confirm": {
                        "oneOf": "",
                        "required": ""
                    },
                    "email": {
                        "required": "",
                        "valid": ""
                    },
                    "password": {
                        "min": "",
                        "required": ""
                    }
                },
                "second": {
                    "firstName": {
                        "required": ""
                    },
                    "lastName": {
                        "required": ""
                    }
                },
                "third": {
                    "childrenAges": {
                        "required": ""
                    },
                    "paypal": {
                        "required": "",
                        "valid": ""
                    }
                }
            }
        },
        "dasboard": {
            "survey": {
                "actions": {
                    "analyzeSurvey": "",
                    "photoValidation": "",
                    "shareStats": {
                        "modal": {
                            "title": ""
                        },
                        "success": {
                            "message": ""
                        }
                    }
                }
            }
        },
        "download": {
            "cancel": "",
            "checking": "",
            "download": "",
            "goToDashboard": "",
            "subTitle": "",
            "title": ""
        },
        "downloadMenu": {
            "downloadJpeg": "",
            "downloadPdf": "",
            "downloadPng": ""
        },
        "editQrCode": {
            "save": "Aggiorna"
        },
        "footer": {
            "aboutText": "",
            "privacyPolicy": "",
            "termsAndConditions": ""
        },
        "forgotPasswordForm": {
            "sendButton": ""
        },
        "impersonate": {
            "impersonate": "",
            "impersonatedAs": "",
            "impersonateUser": "",
            "toGoToAdmin": ""
        },
        "inputArea": {
            "addImage": "",
            "linkTitle": ""
        },
        "inputList": {
            "addStep": ""
        },
        "maxProductStatCount": {
            "label": ""
        },
        "ongoingSurveysGrid": {
            "notFound": ""
        },
        "operatorQrCode": {
            "createQr": ""
        },
        "operatorQrCodeDownload": {
            "prompt": "",
            "title": ""
        },
        "operatorQrCodeForm": {
            "alert": {
                "description": "",
                "okText": "",
                "title": ""
            },
            "cancel": "",
            "copy": "",
            "download": "",
            "draft": "",
            "generateQrCodeNotice": "",
            "linkToSurvey": "",
            "linkToUrl": "",
            "name": "",
            "notFound": "",
            "suspended": "",
            "uniqueName": "",
            "uniqueNameHelper": "",
            "validate": {
                "name": {
                    "required": ""
                },
                "redirectLink": "",
                "survey": {
                    "required": ""
                },
                "targetLink": {
                    "required": "",
                    "urlValid": ""
                },
                "uniqueName": {
                    "matches": "",
                    "max": "",
                    "required": ""
                }
            }
        },
        "operatorSurveyDetailBar": {
            "after": "",
            "basics": "",
            "before": "",
            "emailSettings": "",
            "linkedSurveys": "",
            "payments": "",
            "products": "",
            "screening": "",
            "settings": "",
            "tasting": "",
            "tastingNotes": ""
        },
        "operatorSurveyDetailBarChrHansen": {
            "after": ""
        },
        "operatorSurveys": {
            "actions": "",
            "activeSurveys": "",
            "createNew": "",
            "multipleProducts": "",
            "multipleTastings": "",
            "screenerOnly": "",
            "singleProduct": "",
            "title": ""
        },
        "organizationForm": {
            "addedSuccessfully": "",
            "addTitle": "",
            "deletedSuccessfully": "",
            "editTitle": "",
            "organizationName": "",
            "uniqueName": "",
            "uniqueNameTooltip": {
                "add": "",
                "edit": ""
            },
            "updateSuccessfully": ""
        },
        "organizationsList": {
            "actionsColumnTitle": "",
            "add": "",
            "createdColumnTitle": "",
            "delete": "",
            "edit": "",
            "modifiedColumnTitle": "",
            "nameColumnTitle": "",
            "search": "",
            "usersColumnTitle": ""
        },
        "paymentDetailsForm": {
            "bankAccount": "",
            "bankAccountName": "",
            "bankAccountNumber": "",
            "bankBIC": "",
            "bankDescription": "",
            "bankIBAN": "",
            "bankName": "",
            "payPalCard": "Con PayPal",
            "paypalEmail": "Indirizzo email PayPal",
            "submitButton": "Aggiorna informazioni"
        },
        "paypalEmailModal": {
            "prompt": "Per ricevere il tuo premio, abbiamo bisogno dell'email del tuo account PayPal",
            "title": "Inserisci la tua email di PayPal"
        },
        "personalDetailsForm": {
            "birthday": "",
            "email": "",
            "firstName": "",
            "gender": "",
            "language": "",
            "lastName": "",
            "submitButton": ""
        },
        "privacyForm": {
            "marketingEmails": {
                "description": "",
                "title": ""
            },
            "marketingNotifications": "",
            "marketingPushes": {
                "description": "",
                "title": ""
            },
            "pushNotifications": {
                "description": "",
                "title": ""
            }
        },
        "product": {
            "brand": "",
            "isAvailable": "",
            "name": "",
            "reward": ""
        },
        "productDisplayOptions": {
            "dragAndDropSort": "",
            "forced": "",
            "none": "",
            "note": "",
            "permutation": "",
            "productDisable": "",
            "productDisplayType": "",
            "randomise": "",
            "reverse": ""
        },
        "products": {
            "addProducts": "",
            "apply": "",
            "category": "",
            "columns": {
                "action": "",
                "add": "",
                "name": "",
                "photo": ""
            },
            "search": ""
        },
        "productsTable": {
            "actionEdit": "",
            "actionRemove": "",
            "alertModaldescription": "",
            "alertModalTitle": "",
            "columnAction": "",
            "columnCategory": "",
            "columnClient": "",
            "columnDate": "",
            "columnProductName": ""
        },
        "profile": {
            "title": ""
        },
        "qrCode": {
            "actionsTitle": "",
            "missed": "",
            "nameTitle": ""
        },
        "question": {
            "chooseProduct": {
                "noImage": "",
                "reward": "Premio:"
            }
        },
        "questionCreation": {
            "addOtherConditions": "",
            "analyticalValueOfAnswer": "",
            "chartSection": {
                "chartSettings": "",
                "chartTitle": "",
                "chartTopic": "",
                "chartType": ""
            },
            "chooseMultiple": {
                "maxAnswerValues": "",
                "minAnswerValues": ""
            },
            "chooseOne": {
                "optionsSection": ""
            },
            "chooseProduct": {
                "maxProductsToTaste": "",
                "minProductsToTaste": "",
                "notSelected": ""
            },
            "displayAll": "",
            "displaySurveyName": "",
            "dropdown": {
                "optionsSection": "",
                "prompt": "",
                "secondaryPrompt": ""
            },
            "duplicateButton": "",
            "existingAnswer": "",
            "hideConditionButton": "",
            "hideSkip": "",
            "hideSkipOptions": "",
            "imageAndLabelSettings": {
                "imageAndLabel": "",
                "imageDisplayOptions": "",
                "imageOnly": "",
                "labelOnly": "",
                "questionSettings": "",
                "removeImage": ""
            },
            "infoForm": {
                "prompt": "",
                "secondaryPrompt": ""
            },
            "jumpTo": "",
            "jumpToQuestions": "",
            "location": {
                "region": "",
                "regionRestricted": ""
            },
            "mandatory": "",
            "markAll": "",
            "newQuestion": "",
            "numeric": {
                "labels": {
                    "additionalInformationText": "",
                    "maximum": "",
                    "minimum": "",
                    "numberFormat": "",
                    "questionText": "",
                    "sampleOfNumber": ""
                }
            },
            "openAnswer": "",
            "optionsSection": {
                "addAnswer": "",
                "notSelected": ""
            },
            "paired": {
                "bothPresent": "",
                "customDescriptor": "",
                "descriptors": "",
                "hasFollowUpProfile": "",
                "likingQuestion": "",
                "maximumPairs": "",
                "maxPairs": "",
                "minimumPairs": "",
                "minPairs": "",
                "missingBoth": "",
                "missingOne": "",
                "noverticalRating": "",
                "options": "",
                "pairsOptions": {
                    "bothFlavorsPresentEnabled": "",
                    "customFlavorEnabled": "",
                    "neitherFlavorPresentEnabled": "",
                    "oneFlavorNotPresentEnabled": ""
                },
                "profilePrompt": ""
            },
            "pictureOnAll": "",
            "prompt": "",
            "questionDuplicateError": "",
            "questionDuplicateSuccess": "",
            "questionSectionSelect": "",
            "questionSectionSelectOption": {
                "begin": "",
                "middle": "",
                "screening": ""
            },
            "questionType": "",
            "removeButton": "",
            "removeButtonHelper": "",
            "secondaryPrompt": "",
            "selectAndJustify": {
                "options": "",
                "prompt": "",
                "secondaryPrompt": ""
            },
            "showConditionButton": "",
            "showSkip": "",
            "showSkipOptions": "",
            "slider": {
                "addMarks": "",
                "addSlider": "",
                "addSliders": "",
                "alert": {
                    "deleteMark": "",
                    "deleteSlider": "",
                    "description": "",
                    "okText": ""
                },
                "isInOneRow": "",
                "marks": {
                    "add": "",
                    "isMajor": ""
                },
                "max": "",
                "min": "",
                "profileStepTitle": "",
                "prompt": "",
                "secondaryPrompt": "",
                "showProfile": "",
                "step": ""
            },
            "tagInput": {
                "add": ""
            },
            "tasterName": {
                "allowSpaces": "",
                "answerFormat": "",
                "answerFormats": {
                    "any": "",
                    "digits": "",
                    "letters-and-digits": ""
                },
                "maxLength": "",
                "minLength": ""
            },
            "timestamp": {
                "info": ""
            },
            "verticalRating": {
                "additionalText": "",
                "addSkipingRule": "",
                "maximum": "",
                "minimum": "",
                "noSkipingRule": "",
                "questionText": "",
                "scaleLabels": "",
                "startingFrom": "",
                "upTo": ""
            }
        },
        "register": {
            "back": "",
            "creatingError": "",
            "creatingErrorCheckAgain": "",
            "doLater": "",
            "nextStep": ""
        },
        "requestAccountForm": {
            "submit": "Invia"
        },
        "retakes": {
            "header": "Questo sondaggio può essere completato solo una volta.",
            "subHeader": "Hai già completato questo sondaggio."
        },
        "shareStatsForm": {
            "organizations": {
                "label": "",
                "tabs": {
                    "all": "",
                    "selected": ""
                }
            },
            "users": {
                "label": "",
                "tabs": {
                    "all": "",
                    "selected": ""
                }
            }
        },
        "socialMedia": {
            "shareFB": "Condividi su Facebook",
            "shareLI": "Condividi su LinkedIn",
            "shareTW": "Condividi su Twitter"
        },
        "storesTable": {
            "actionEdit": "",
            "actionRemove": "",
            "alertModaldescription": "",
            "alertModalTitle": "",
            "columnAction": "",
            "columnCompanyName": "",
            "columnCountry": "",
            "columnDate": "",
            "columnState": ""
        },
        "survey": {
            "notAuthorized": {
                "content": "",
                "title": ""
            }
        },
        "surveyBasicInfoForm": {
            "alert": {
                "description": "",
                "okText": "",
                "title": ""
            },
            "allowedDaysToFillTheTasting": "",
            "allowedUsers": "",
            "authorizationType": "",
            "continueButton": "",
            "copy": "",
            "copySuccessfull": "",
            "country": "",
            "customizeSharing": {
                "description": "",
                "title": ""
            },
            "forceAccount": {
                " end": "",
                "end": "",
                "start": ""
            },
            "forceTasterAccount": "",
            "instruction": "",
            "instructionSteps": "Istruzioni Passo a Passo",
            "loginText": "",
            "minimumNumber": "",
            "name": "",
            "nextButton": "",
            "pauseText": "",
            "rejection": "",
            "requireRecaptcha": "",
            "screening": "",
            "securitySettings": "",
            "selectLanguage": "",
            "skipButton": "",
            "startSurveyButton": "",
            "surveyUrl": "",
            "takeSurveyMultipleTimes": "",
            "tastingSettings": "",
            "thankYou": "",
            "uniqueName": "",
            "uniqueNameExists": ""
        },
        "surveyComplete": {
            "backToDashboard": "Torna alla dashboard",
            "text": "Ho appena finito un sondaggio, dai un'occhiata"
        },
        "surveyFunnel": {
            "columns": {
                "product": "",
                "question": "",
                "responses": ""
            },
            "mainHeader": ""
        },
        "surveyInfoTest": {
            "addYourOwn": "Aggiungi il tuo",
            "answered": "Risposto",
            "atLeast": "Rispondi almeno",
            "bothOptionsPresent": "Entrambi i descrittori sono presenti",
            "cantDecide": "Non Riesco a Decidere",
            "close": "chiudi",
            "completed": "Sondaggio Completato",
            "congratulations": "Congratulazioni",
            "customOption": "Descrittore Personalizzato",
            "information": "Informazioni",
            "isNotPresent": "non è presente",
            "isPresent": "è presente",
            "noDescriptorPresent": "Nessuno dei descrittori è presente",
            "noMorePairs": "Nessun altra coppia, clicca su 'Prossimo' per procedere",
            "optionsModalTitle": "Descrittori Sbagliati?",
            "otherOptions": "Altre Opzioni",
            "pair": "coppia",
            "pairedQuestionInfo": "Nelle domande seguenti, ci saranno più coppie di termini descrittivi. Seleziona il termine che secondo te descrive meglio il prodotto. Rispondi al meglio che puoi. Non c'è una risposta giusta o sbagliata.",
            "pairs": "coppie",
            "pickOption": "Scegli l'opzione che meglio descrive la tua situazione.",
            "rejected": "Sei stato rifiutato",
            "rejectedReasonFirst": "Ci dispiace ma stiamo cercando un profilo differente dal tuo per questo assaggio.",
            "rejectedReasonSecond": "Ma non scoraggiarti, prenderemo in considerazione la tua partecipazione nei nostri assaggi futuri.",
            "screeningOk": "Ti sei qualificato per l'assaggio. Fai clic sul pulsante qua sotto per continuare. A breve riceverai anche un'email con questo link come promemoria.",
            "uploadPicture": "Carica una foto del prodotto aperto per verificare di aver completato tutto correttamente. Per poter beneficiare delle ricompense è necessaria una foto che mostri chiaramente il prodotto durante l'assaggio.",
            "writeOption": "Scrivi la tua opzione qua sotto"
        },
        "surveyInstructions": {
            "title": "Istruzioni Assaggio"
        },
        "surveyList": {
            "completed": "",
            "finished": "",
            "ready": "",
            "rejected": "",
            "retake": ""
        },
        "surveyLogIn": {
            "access": "Clicca qui per accedere alla pagina di login.",
            "accessLogin": "Se hai accesso a questo sondaggio, effettua prima il login.",
            "askForAccount": "",
            "askForEmail": "Inserisci la tua email per procedere.",
            "loginText": "<p>Benvenuto all'assaggio!<\/p>\n<p>Inserisci la tua email per procedere.<\/p>\n<p>Se lasci l'assaggio prima di completarlo, puoi continuare da dove l'avevi interrotto inserendo la tua email nella pagina iniziale.<\/p>",
            "loginTo": "Accedi",
            "nextTimeDetails": "Se lasci l'assaggio prima di completarlo, puoi continuare da dove l'avevi interrotto inserendo la tua email nella pagina iniziale.",
            "notARobot": "Conferma di non essere un robot per poter iniziare.",
            "notSelectedToParticipate": "Non sei tra gli utenti selezionati per partecipare a questo sondaggio.",
            "pauseText": "<p style='text-align: left;'><strong>Grazie per il tuo interesse.<\/strong><\/p><p style='text-align: left;'><strong>Questo studio è già finito.<\/strong><\/p><p style='text-align: left;'><strong>Puoi anche contattare support@flavorwiki.com per altre domande.<\/strong><\/p><br><p style='text-align: left;'><strong>Grazie,<\/strong><\/p><p style='text-align: left;'><strong>Il Team FlavorWiki.<\/strong><\/p>",
            "pressToStart": "Premi il pulsante qua sotto per cominciare.",
            "signupFor": "",
            "surveyAvailable": "Questo sondaggio è disponibile solo per utenti specifici.",
            "surveyExpired": "Grazie per l'interesse in questo studio di mercato. Il tempo per completare l'assaggio è scaduto.",
            "welcome": "Benvenuto all'assaggio!"
        },
        "surveyNavigation": {
            "skipProgressText": "Hai risposto a $t(countProduct, { 'count': {{products}} }). Puoi saltare dopo aver risposto ad almeno $t(countProduct, { 'count': {{minimumProducts}} })."
        },
        "surveyPhotos": {
            "mainHeader": "",
            "noneAvailable": "",
            "successPopup": ""
        },
        "surveyQuestion": {
            "maxAnswerValues": "Devi selezionare un massimo di $t(countAnswer, { \"count\": {{maxAnswerValues}} }).",
            "minAnswerValues": "Devi selezionare un minimo di $t(countAnswer, { \"count\": {{minAnswerValues}} }) ed un massimo di $t(countAnswer, { \"count\": {{maxAnswerValues}} }).",
            "minMaxDiffAnswerValues": "Devi selezionare tra $t(countAnswer, { \"count\": {{minAnswerValues}} }) e $t(countAnswer, { \"count\": {{maxAnswerValues}} }).",
            "minMaxSameAnswerValues": "Devi selezionare $t(countAnswer, { \"count\": {{maxAnswerValues}} }).",
            "onlyMaxAnswerValues": "Devi selezionare al massimo $t(countAnswer, { \"count\": {{maxAnswerValues}} }).",
            "onlyMinAnswerValues": "Devi selezionare almeno $t(countAnswer, { \"count\": {{minAnswerValues}} })."
        },
        "surveysList": {
            "answeredSurveys": ""
        },
        "surveyValidate": {
            "filters": {
                "email": "",
                "total": ""
            }
        },
        "table": {
            "actionRemove": "",
            "alertModalDescription": "",
            "alertModalTitle": "",
            "dateColumnActionTitle": "",
            "dateColumnTitle": "",
            "nameColumnTitle": "",
            "productsColumnTitle": ""
        },
        "tagInput": {
            "add": ""
        },
        "tasterProfile": {
            "birthYear": "",
            "fullName": "",
            "gender": "",
            "nationality": "",
            "submitButton": ""
        },
        "userList": {
            "addFormTitle": "",
            "editFormTitle": ""
        },
        "usersList": {
            "add": "",
            "emailAddress": "",
            "fullName": "",
            "selectOrganization": "",
            "selectType": "",
            "table": {
                "actions": "",
                "delete": "",
                "edit": "",
                "email": "",
                "name": "",
                "organization": "",
                "type": ""
            }
        },
        "userSurvey": {
            "inProgress": "Sondaggio in corso",
            "productsPurchase": "Prodotti da acquistare ed assaggiare",
            "timeLeftInProgressDays": "per completare questo sondaggio",
            "timeLeftInProgressHours": "",
            "timeLeftSurveyOngoingDays": "prodotti rimasti da acquistare ed assaggiare",
            "timeLeftSurveyOngoingHours": ""
        },
        "userSurveyCard": {
            "products": "",
            "seeShops": ""
        },
        "verticalRating": {
            "additionalText": "",
            "maximum": "",
            "minimum": "",
            "questionText": "",
            "scaleLabels": "",
            "startingFrom": "",
            "upTo": ""
        }
    },
    "containers": {
        "additionalInfo": {
            "error": "",
            "success": ""
        },
        "addProductsToCreate": {
            "newProduct": ""
        },
        "addQuestionsToCreate": {
            "newStep": ""
        },
        "addQuestionToCreate": {
            "error": "",
            "success": ""
        },
        "authenticatedLayut": {
            "home": "",
            "signOut": ""
        },
        "changePassword": {
            "error": "",
            "success": "",
            "userPasswordError": ""
        },
        "cloneSurveyButton": {
            "alertModalDescriptionNo": "",
            "alertModalDescriptionYes": "",
            "alertModalOkText": "",
            "alertModalTitleNo": "",
            "alertModalTitleYes": "",
            "error": "",
            "success": ""
        },
        "completeTasterProfile": {
            "home": "",
            "signOut": "",
            "subtitle": "",
            "title": ""
        },
        "CompleteTasterProfileForm": {
            "error": "",
            "submissionError": "",
            "validation": {
                "birthYearMax": "",
                "birthYearMin": "",
                "birthYearRequire": "",
                "fullnameRequire": "",
                "genderRequire": "",
                "nationalityRequire": ""
            }
        },
        "createAccount": {
            "additionalInfo": {
                "childrenAgesMin": "",
                "childrenAgesRequire": "",
                "incomeRangeRequire": "",
                "numberOfChildError": "",
                "numberOfChildLessthan": "",
                "numberOfChildMorethan": "",
                "numberOfChildRequire": ""
            },
            "personalInfo": {
                "birthdayRequire": "",
                "firstnameRequire": "",
                "lastnameRequire": "",
                "recaptchaError": "",
                "recaptchaRequire": ""
            },
            "welcomeForm": {
                "confirmMatch": "",
                "confirmRequire": "",
                "emailRequire": "",
                "emailValid": "",
                "passwordMin": "",
                "passwordRequire": ""
            }
        },
        "customButtons": {
            "continue": "",
            "next": "",
            "skip": "",
            "start": ""
        },
        "deleteSurveyButton": {
            "alertModalDescriptionNo": "",
            "alertModalDescriptionYes": "",
            "alertModalOkText": "",
            "alertModalTitleNo": "",
            "alertModalTitleYes": "",
            "error": "",
            "success": ""
        },
        "editQrCode": {
            "save": ""
        },
        "editSurveyButton": {
            "alertModalDefaultOption": {
                "AfterHelpText": "",
                "BeforeHelpText": "",
                "HelpText": ""
            },
            "alertModalOkText": "",
            "alertModalStrictedOption": {
                "BeforeHelpText": "",
                "HelpText": ""
            },
            "alertModalTitle": ""
        },
        "exportSharingContainer": {
            "popups": {
                "downloaded": "",
                "downloading": "",
                "error": ""
            }
        },
        "exportSurveyButton": {
            "alertModalDescription": "",
            "alertModalOkText": "",
            "alertModalTitle": "",
            "emailSend": "",
            "notFound": "",
            "selectUser": ""
        },
        "exportSurveyPhotosButton": {
            "alertModalDescription": "",
            "alertModalOkText": "",
            "alertModalTitle": "",
            "emailSend": "",
            "notFound": "",
            "selectUser": ""
        },
        "forgotPassword": {
            "emailRequire": "",
            "emailValid": "",
            "error": "",
            "infoMessage": ""
        },
        "hooks": {
            "useLoginToSurvey": {
                "errorOnRequest": ""
            }
        },
        "impersonate": {
            "impersonate": "",
            "impersonatedAs": "",
            "toGoToAdmin": ""
        },
        "importGiftCardIncentives": {
            "prompt": "",
            "title": ""
        },
        "importGiftCardShares": {
            "prompt": "",
            "title": ""
        },
        "importProductIncentives": {
            "prompt": "",
            "title": ""
        },
        "importSurveyShares": {
            "prompt": "",
            "title": ""
        },
        "loginForm": {
            "incomingLoginError": "",
            "incomingValidError": "",
            "preventMobileOperatorLogin": "",
            "validation": {
                "emailRequire": "",
                "emailValid": "",
                "passwordMin": "",
                "passwordRequire": ""
            }
        },
        "mandatoryQuestions": {
            "title": ""
        },
        "newPasswordF": {
            "error": "",
            "success": "",
            "validation": {
                "confirmMatch": "",
                "confirmRequire": "",
                "passwordMin": "",
                "passwordRequire": ""
            }
        },
        "operatorCreateQrCode": {
            "successMessage": "",
            "title": ""
        },
        "operatorEditQrCode": {
            "successMessage": "",
            "title": ""
        },
        "operatorQrCode": {
            "description": "",
            "okText": "",
            "title": ""
        },
        "operatorSurveyInfo": {
            "alertModalkLanDescription": "",
            "alertModalLanOkText": "",
            "alertModalLanTitle": "",
            "alertModalOkText": "",
            "alertModalTitle": ""
        },
        "organizationForm": {
            "addedSuccessfully": "",
            "addTitle": "",
            "deletedSuccessfully": "",
            "editTitle": "",
            "organizationName": "",
            "uniqueName": "",
            "updateSuccessfully": ""
        },
        "organizationsList": {
            "alertModalDescription": "",
            "alertModalOkText": "",
            "alertModalTitle": ""
        },
        "page": {
            "additionalInfo": {
                "childAgeLabel": "",
                "childAgePlaceholder": "",
                "childAtHome": "",
                "childAtHomePlaceholder": "",
                "dietary": "",
                "dietaryPlaceholder": "",
                "ethnicity": "",
                "ethnicityPlaceholder": "",
                "income": "",
                "incomePlaceholder": "",
                "incomeRangePlaceholder": "",
                "numberChildPlaceholder": "",
                "product": "",
                "productPlaceholder": "",
                "smoke": "",
                "smokePlaceholder": ""
            },
            "categoriesGridSection": {
                "title": ""
            },
            "createAccount": {
                "additionalInformartionStep": {
                    "description": "",
                    "title": ""
                },
                "personalInformationStep": {
                    "description": "",
                    "title": ""
                },
                "welcomeStep": {
                    "description": "",
                    "title": ""
                }
            },
            "main": {
                "cancelText": "",
                "extraActionText": "",
                "nextStepDefault": ""
            },
            "notFound": {
                "styledText": ""
            },
            "onboarding": {
                "createAccount": {
                    "buttonText": "Crea il mio account",
                    "msgText": "Crea il tuo account per iniziare ad assaggiare e guadagnare premi",
                    "signupBtnText": "Accedi",
                    "signupText": "Hai già un account?",
                    "title": "Nuovo account"
                },
                "forgotPassword": {
                    "subTitle": "Scrivi il tuo indirizzo email in modo che possiamo inviarti un link per reimpostare la tua password.",
                    "title": "Recupera password"
                },
                "login": {
                    "title": "Login"
                },
                "loginCarousel": {
                    "text": {
                        "buyProductText": "Acquista i prodotti selezionati nel tuo negozio di fiducia. Non ti preoccupare, paghiamo noi!",
                        "cashInText": "Assaggiali e dicci cosa ne pensi. Guadagna denaro e vinci esclusivi premi di assaggio",
                        "discoverProductText": "Iscriviti per assaggiare i prodotti nelle tue categorie preferite. Parlaci di te e troveremo le migliori selezioni per te.",
                        "welcomeText": "Influenza i prodotti alimentari di domani mentre assaggi i migliori prodotti di oggi. Ricevi contanti e guadagna fantastici premi!"
                    },
                    "titles": {
                        "buyProduct": "",
                        "cashIn": "",
                        "discoverProduct": "",
                        "welcome": ""
                    }
                },
                "loginToRole": {
                    "backBtn": "",
                    "styledButton": "",
                    "styledButtonOperator": "",
                    "styledButtonTaster": "",
                    "text": ""
                },
                "newPassword": {
                    "subTitle": "",
                    "title": ""
                },
                "requestAccount": {
                    "subTitle": "",
                    "title": ""
                },
                "requestSubmitted": {
                    "subTitle": "",
                    "title": ""
                }
            },
            "ongoingSurveysSection": {
                "title": ""
            },
            "operator": {
                "menu": {
                    "dashboard": "",
                    "organizations": "",
                    "privacyPolicy": "",
                    "qr-codes": "",
                    "surveys": "",
                    "termsOfUse": "",
                    "users": ""
                }
            },
            "operatorCreateBasics": {
                "title": ""
            },
            "operatorCreateEmailSettings": {
                "title": ""
            },
            "operatorCreatePayments": {
                "title": ""
            },
            "operatorCreateSettings": {
                "title": ""
            },
            "operatorCreateSurveyLinkedSurveys": {
                "label": "",
                "tabs": {
                    "all": "",
                    "selected": ""
                },
                "title": ""
            },
            "OperatorCreateSurveyProducts": {
                "title": ""
            },
            "OperatorCreateSurveyQuestions": {
                "title": ""
            },
            "operatorCreateTastingNotes": {
                "title": ""
            },
            "paidSurveysSection": {
                "title": ""
            },
            "personalInfo": {
                "dobLabel": "",
                "firstnameLabel": "",
                "firstnamePlaceholder": "",
                "genderLabel": "",
                "genderPlaceholder": "",
                "languagesLabel": "",
                "languagesPlaceholder": "",
                "lastnameLabel": "",
                "lastnamePlaceholder": ""
            },
            "pointsSurveySection": {
                "title": ""
            },
            "taster": {
                "promt": "",
                "title": ""
            },
            "welcomeForm": {
                "confirmLabel": "",
                "confirmPlaceholder": "",
                "emailLabel": "",
                "emailPlaceholder": "",
                "passwordLabel": "",
                "passwordPlceholder": ""
            }
        },
        "paymentDetails": {
            "error": "",
            "success": ""
        },
        "personalDetails": {
            "error": "",
            "success": ""
        },
        "previewSurveyDraft": {
            "buttonText": ""
        },
        "privacy": {
            "error": ""
        },
        "productsCreateList": {
            "alertModalDescription": "",
            "alertModalOkText": "",
            "alertModalTitle": ""
        },
        "profileLayout": {
            "additionalInfo": "",
            "changePassword": "",
            "paymentDetails": "",
            "personalDetails": "",
            "privacy": ""
        },
        "publishEditedSurvey": {
            "errorMessage": "",
            "loadingText": "",
            "publishButton": "",
            "successMessage": ""
        },
        "publishSurvey": {
            "errorMessage": "",
            "loadingText": "",
            "publishButton": "",
            "successMessage": ""
        },
        "publishSurveyDraft": {
            "errorMessage": "",
            "loadingText": "",
            "publishButton": "",
            "successMessage": ""
        },
        "questionCreationCardBody": {
            "choose-one": {
                "other": ""
            },
            "OptionsSection": {
                "includeOthers": ""
            }
        },
        "questionCreationCardHeader": {
            "description": "",
            "okText": "",
            "title": ""
        },
        "questionsList": {
            "skipToOptions": {
                "finish": "",
                "reject": "",
                "removeSkip": ""
            }
        },
        "requestAccountForm": {
            "code": "",
            "companyName": "",
            "emailRequired": "",
            "emailValid": "",
            "firstName": "",
            "lastName": "",
            "number": ""
        },
        "saveDraftSurvey": {
            "errorMessage": "",
            "loadingText": "",
            "publishButton": "",
            "successMessage": "",
            "surveyInitialState": ""
        },
        "surveyBasicInfoForm": {
            "alert": {
                "description": "",
                "okText": "",
                "title": ""
            },
            "allowedUsers": "",
            "authorizationType": "",
            "continueButton": "",
            "forceTasterAccount": "",
            "instruction": "",
            "instructionSteps": "Istruzioni Passo a Passo",
            "minimumNumber": "",
            "name": "",
            "nextButton": "",
            "referralAmount": "",
            "rejection": "",
            "requireRecaptcha": "",
            "screening": "",
            "securitySettings": "",
            "selectLanguage": "",
            "skipButton": "",
            "startSurveyButton": "",
            "takeSurveyMultipleTimes": "",
            "tastingSettings": "",
            "thankYou": "",
            "uniqueName": "",
            "uniqueNameExists": ""
        },
        "surveyList": {
            "completed": ""
        },
        "surveyLogIn": {
            "access": "",
            "accessLogin": "Se hai accesso a questo sondaggio, effettua prima il login.",
            "askForAccount": "Per procedere a questo assaggio è necessario creare un account. Inserisci la password desiderata e seleziona il tuo paese.",
            "askForEmail": "Inserisci la tua email per procedere.",
            "loginText": "<p>Benvenuto all'assaggio!<\/p>\n<p>Inserisci la tua email per procedere.<\/p>\n<p>Se lasci l'assaggio prima di completarlo, puoi continuare da dove l'avevi interrotto inserendo la tua email nella pagina iniziale.<\/p>",
            "loginTo": "Accedi",
            "nextTimeDetails": "Se lasci l'assaggio prima di completarlo, puoi continuare da dove l'avevi interrotto inserendo la tua email nella pagina iniziale.",
            "notARobot": "Conferma di non essere un robot per poter iniziare.",
            "notSelectedToParticipate": "Non sei tra gli utenti selezionati per partecipare a questo sondaggio.",
            "pauseText": "<p style='text-align: left;'><strong>Grazie per il tuo interesse.<\/strong><\/p><p style='text-align: left;'><strong>Questo studio è già finito.<\/strong><\/p><p style='text-align: left;'><strong>Puoi anche contattare support@flavorwiki.com per altre domande.<\/strong><\/p><br><p style='text-align: left;'><strong>Grazie,<\/strong><\/p><p style='text-align: left;'><strong>Il Team FlavorWiki.<\/strong><\/p>",
            "pressToStart": "Premi il pulsante qua sotto per cominciare.",
            "surveyAvailable": "Questo sondaggio è disponibile solo per utenti specifici.",
            "surveyExpired": "Grazie per l'interesse in questo studio di mercato. Il tempo per completare l'assaggio è scaduto.",
            "surveySuspended.line1": "Grazie per l'interesse in questo studio di mercato.",
            "surveySuspended.line2": "Lo studio è già finito",
            "surveySuspended.line3": "Puoi anche contattare support@flavorwiki.com per altre domande.",
            "surveySuspended.line4": "Grazie,",
            "surveySuspended.line5": "Il Team FlavorWiki",
            "welcome": "Benvenuto all'assaggio!"
        },
        "surveySharing": {
            "copiedMessage": "Link copiato negli appunti.",
            "shareTextFirst": "Condividi questo assaggio e guadagna {{amount}} per ogni amico che inviti che lo completa!",
            "shareTextLast": "per copiare il tuo link di condivisione.",
            "shareTextMiddle": "Clicca qui per copiare il tuo link di condivisione."
        },
        "surveyStats": {
            "editOperatorLayout": "",
            "editTasterLayout": "",
            "fetchError": {
                "description": "",
                "message": ""
            },
            "generateReport": {
                "text": ""
            },
            "invalidError": {
                "description": "",
                "message": ""
            },
            "otherFilters": {
                "buttonText": "",
                "filterText": "",
                "noFilter": "",
                "resetText": "",
                "selectProductsFirst": "",
                "title": ""
            },
            "productsTab": {
                "backToProductSelection": "",
                "buttonText": "",
                "maxNumberError": "Devi selezionare un minimo di {{minNumber}} prodotto(i) ed un massimo di {{maxNumber}}. Al momento hai {{currentNumber}} prodotto(i) selezionati.",
                "title": ""
            },
            "validation": {
                "required": "",
                "typeError": ""
            }
        },
        "updateSurvey": {
            "buttonText": "",
            "errorMessage": "",
            "successMessage": "",
            "updatingText": ""
        },
        "updateSurveyDraft": {
            "buttonText": "",
            "errorMessage": "",
            "successMessage": "",
            "updatingText": ""
        },
        "uploadProductPicture": {
            "label": "",
            "limit": ""
        },
        "userProfile": {
            "mainTitle": "",
            "messages": {
                "password": {
                    "error": "",
                    "success": ""
                }
            },
            "tabs": {
                "additional": "",
                "password": "",
                "payment": "",
                "personal": "",
                "privacy": ""
            },
            "validations": {
                "password": {
                    "confirmNewPassword": {
                        "required": "",
                        "shouldMatch": ""
                    },
                    "currentPassword": {
                        "minChars": "",
                        "required": "",
                        "sameAsBefore": ""
                    },
                    "newPassword": {
                        "minChars": "",
                        "required": ""
                    }
                }
            }
        },
        "usersListContainer": {
            "added": "",
            "alertModalDescription": "",
            "alertModalokText": "",
            "alertModalTitle": "",
            "deleted": "",
            "updated": ""
        },
        "useSurveyValidate": {
            "showOnlyMandatoryQuestionErrors": "È richiesta almeno una domanda.",
            "showProductsErrors": "",
            "showQuestionsErrors": ""
        }
    },
    "countAnswer": "{{count}} risposta",
    "countAnswer_plural": "{{count}} risposte",
    "countProduct": "{{count}} prodotto",
    "countProduct_plural": "{{count}} prodotti",
    "defaultValues": {
        "customButtons": {
            "continue": "Continua",
            "next": "Prossimo",
            "skip": "Salta",
            "start": "Inizia"
        },
        "customizeSharingMessage": "Condividi questo assaggio e guadagna {{amount}} per ogni amico che inviti che lo completa!",
        "instructionSteps": [
            "Assicurati di avere tutti i prodotti selezionati prima di iniziare l'assaggio.",
            "Trova un posto tranquillo.",
            "Ti verranno fornite istruzioni aggiuntive durante l'assaggio.",
            "Quando sei pronto, clicca su 'Inizia Assaggio' qua sotto."
        ],
        "instructionsText": "<p><strong><span style=\"font-size: 20pt;\">Benvenuto all'Assaggio!<\/span><\/strong>\n<br \/>Grazie per aver accettato di partecipare a questo assaggio. Questo questionario ti farà delle domande sui prodotti che consumi al momento e ci aiuterà ad abbinarti meglio ai prodotti da acquistare e assaggiare. Ci vorranno circa 2-3 minuti.\n<br \/>Non ci sono risposte giuste o sbagliate quindi rispondi in modo onesto.\n<br \/>Se hai delle domande utilizza la casella di supporto qua sotto o invia un'email a:support@flavorwiki.com\n<br \/><strong>Buon Assaggio! Il Team FlavorWiki<\/strong><\/p>",
        "loginText": "<p style='text-align: center;'><strong>Benvenuto all'assaggio!<\/strong><\/p><p style='text-align: center;'><strong>Inserisci la tua email per procedere.<\/strong><\/p><p style='text-align: center;'><strong>Se lasci l'assaggio prima di completarlo, puoi continuare da dove l'avevi interrotto inserendo la tua email nella pagina iniziale.<\/strong><\/p>",
        "pauseText": "[<p style='text-align: left;'>][<strong>]Grazie per l'interesse.[<\/strong>[<\/p>[<p style='text-align: left;'>][<strong>Questo studio è già terminato. <\/strong>[<\/p>[<p style='text-align: left;'>][<strong>]Può anche contattare support@flavorwiki. com per ulteriori domande. [<\/strong>[<\/p>[<br>[<p style='text-align: left;'>][<strong>]Grazie,[<\/strong>[<p style='text-align: left;'>][<strong>il team FlavorWiki. <\/strong><\/p><\/p>",
        "rejectionText": "<p><strong><span style=\"font-size: 20pt;\" data-mce-style=\"font-size: 20pt;\">Ci spiace veramente… Non questa volta!<\/span><\/strong><\/p>\n<p>Ci dispiace ma stiamo cercando un profilo differente dal tuo per questo assaggio.<br\/>Ma non scoraggiarti, prenderemo in considerazione la tua partecipazione nei nostri assaggi futuri.<\/p>\n<p>Se hai delle domande utilizza la casella di supporto qua sotto o invia un'email a:<\/p>\n<p><a href=\"mailto:support@flavorwiki.com\">support@flavorwiki.com<\/a><\/p>\n<p>Buon Assaggio!<\/p>\n<p>Il Team FlavorWiki<\/p>",
        "screeningText": "<p><strong><span style=\"font-size: 20pt;\">Congratulazioni<\/span><\/strong><\/p>\n<p>Ti sei qualificato per l'assaggio. Fai clic sul pulsante qua sotto per continuare. <br\/>\nA breve riceverai anche un'email con questo link come promemoria.<\/p>\n<p>Se hai delle domande utilizza la casella di supporto qua sotto o invia un'email a:<\/p>\n<p><a href=\"mailto:support@flavorwiki.com\">support@flavorwiki.com<\/a><\/p>\n<p>Buon Assaggio!<\/p>\n<p>Il Team FlavorWiki<\/p>",
        "thankYouText": "<p><strong><span style=\"font-size: 20pt;\">Grazie per la partecipazione!<\/span><\/strong>\n<br \/>Se ti è piaciuta l'assaggio, raccomandaci o scrivi una recensione sulla nostra Pagina Facebook.\n<br \/>Se hai delle domande utilizza la casella di supporto qua sotto o invia un'email a:support@flavorwiki.com\n<br \/><strong>Buon Assaggio! Il Team FlavorWiki<\/strong><\/p>"
    },
    "dontHaveAccount": "",
    "dropDownOptions": {
        "choose-date": "",
        "choose-multiple": "",
        "choose-one": "",
        "choose-payment": "",
        "choose-product": "",
        "dropdown": "",
        "email": "",
        "info": "",
        "location": "",
        "numeric": "",
        "open-answer": "",
        "paired-questions": "",
        "paypal-email": "",
        "select-and-justify": "",
        "slider": "",
        "time-stamp": "",
        "upload-picture": "",
        "vertical-rating": ""
    },
    "email": {
        "rejected": "Grazie per aver partecipato a questo sondaggio.<br><br>\nSe condividi il link qua sotto con i tuoi amici, puoi guadagnare <strong>{{SSHARING_REWARD}}<\/strong> in contanti EXTRA come premio per ogni amico che hai invitato che completa l'assaggio.<br><br>\n{{SHARING_LINK}}<br><br>\n Se hai delle domande invia un'email a <a href=\"mailto:support@flavorwiki.com\">support@flavorwiki.com<\/a>.<br><br>\n              Buon Assaggio!<br>\n              Il Team FlavorWiki",
        "surveyCompleted": {
            "html": "",
            "subject": "",
            "text": ""
        },
        "surveyRejected": {
            "html": "",
            "subject": "",
            "text": ""
        },
        "surveyWaiting": {
            "html": "",
            "subject": "",
            "text": ""
        }
    },
    "emailUs": "Se hai delle domande utilizza la casella di supporto qua sotto o invia un'email",
    "errors": {
        "ANALYSIS_ERROR": "",
        "E_EXPORT_DEFAULT": "",
        "E_ORG_UNIQUE": "",
        "E_QR_CODE_CREATE": "",
        "E_QR_CODE_SEARCH": "",
        "E_QR_CODE_UNIQUE": "",
        "E_QR_CODE_UPDATE": "",
        "E_REQUEST_ACCOUNT": "",
        "E_UNIQUE": "",
        "E_UNIQUE_USER": "",
        "E_USER_IS_EXISTED": "",
        "FILE_NOT_FOUND": "Il link condiviso non è valido.",
        "FILE_UNAUTHORIZED": "",
        "inputValidCountry": "",
        "inputValidEmail": "",
        "inputValidPassword": "",
        "NO_APP_URL": "",
        "NO_ORGANIZATION": "",
        "notAuthQrCode": "",
        "notAuthSurvey": "",
        "ORG_DEFAULT_CREATE": "",
        "ORG_DEFAULT_UPDATE": "",
        "pictureTooLarge": "",
        "privacyUpdateError": "",
        "submitAnswerFailed": "",
        "UNAUTHORIZED": "",
        "update": "",
        "updatePaypallFailed": "",
        "uploadPictureFailed": "Caricamento fallito, seleziona un'immagine e riprova.",
        "uploadProductPictureFailed": ""
    },
    "forgotPassword": "",
    "happyTasting": "Buon Assaggio!",
    "languages": {
        "chinese": "",
        "deutsch": "",
        "english": "",
        "french": "",
        "italian": "",
        "japanese": "",
        "korean": "",
        "polish": "",
        "portuguese": "",
        "russian": "",
        "spanish": "",
        "turkish": ""
    },
    "page": {
        "surveyList": {
            "completed": "",
            "finsihed": "",
            "rejected": ""
        }
    },
    "pdfLayoutEditor": {
        "addPage": {
            "tooltip": ""
        },
        "discard": {
            "description": "",
            "ok": "",
            "title": ""
        },
        "loadingData": "",
        "messages": {
            "downloadError": "",
            "saveError": "",
            "saveSuccess": ""
        },
        "pageText": "",
        "paperSize": "",
        "removePage": {
            "disabledTooltip": "",
            "tooltip": ""
        },
        "rendering": "",
        "saveAsTemplate": "",
        "showLayoutBorder": "",
        "title": {
            "operator": "",
            "taster": ""
        },
        "zoom": ""
    },
    "placeholders": {
        "addDescriptor": "Inserisci il tuo descrittore",
        "addOpinion": "Aggiungi la tua opinione qui...",
        "addOption": "Aggiungi la tua opzione",
        "analyticsValue": "",
        "availableInCountry": "",
        "bankAccountName": "",
        "bankAccountNumber": "",
        "bankBIC": "",
        "bankDescription": "",
        "bankIBAN": "",
        "bankName": "",
        "category": "",
        "chartsSettings": {
            "absolutePercentageValues": "",
            "barsSortOrder": "",
            "howManyDecimals": "",
            "howManyDecimals_axis": "",
            "isDataTableShown_format": "",
            "outlineWidth": ""
        },
        "companyName": "",
        "confirmPassword": "",
        "country": "",
        "currentPassword": "",
        "email": "",
        "emailAddress": "",
        "emailToReach": "",
        "firstName": "",
        "fullName": "",
        "gender": "",
        "inputOption": "Inserisci la tua opzione",
        "jumpTo": "",
        "language": "",
        "lastName": "",
        "MarkLabel": "",
        "markPosition": "",
        "maximumScaleValue": "",
        "mininumScaleValue": "",
        "nationality": "",
        "newPassword": "",
        "password": "",
        "paypalEmail": "",
        "phoneNumber": "",
        "questionAnalytics": "",
        "questionChartType": "",
        "questionJumpTo": "",
        "questionLabel": "",
        "questionMaximumScale": "",
        "questionMinimumScale": "",
        "questionRangeMax": "",
        "questionRangeMin": "",
        "questionSectionSelect": "",
        "questionType": "",
        "search": "",
        "selectAnswers": "",
        "selectBrand": "",
        "selectConditionType": "",
        "selectOne": "Seleziona un'opzione",
        "selectOrganization": "",
        "selectType": "",
        "startingFrom": "",
        "typeHere": "Scrivi qui...",
        "upTo": "",
        "user": "",
        "username": "",
        "writeAnswer": "Scrivi la tua risposta qui"
    },
    "profileLink": "",
    "requestAccount": "",
    "requestAccountOr": "",
    "requestOneButton": "",
    "requestOperatorAccount": "",
    "requestTasterAccount": "",
    "settings": {
        "charts": {
            "alertModalDescription": "",
            "alertModalTitle": "",
            "cancel": "",
            "error": "",
            "filterByQuestionType": "",
            "globalSettingsTitle": "",
            "optionLabels": {
                "absolutePercentageValues": "",
                "barsSortOrder": "",
                "colorPicker": "",
                "dataformat": {
                    "abs": "",
                    "perc": "",
                    "perc_abs": "",
                    "perc_abs_prod": "",
                    "perc_abs_teh": "",
                    "valueType": ""
                },
                "generalColorPicker": "",
                "groupLabels": "",
                "hasOutline": "",
                "howManyDecimals": "",
                "isCountProGroupShown": "",
                "isCountProLabelShown": "",
                "isDataTableShown": "",
                "isDataTableShown_format": "",
                "isMeanProLabelsShown": "",
                "isProductLabelsSwapped": "",
                "isStackedLabelsReversed": "",
                "isStackedValuesShown": "",
                "isStatisticsTableShown": "",
                "isTotalRespondentsShown": "",
                "mapColorPicker": "",
                "outlineColor": "",
                "outlineWidth": "",
                "percentageGrouping": {
                    "inner": "",
                    "outer": ""
                },
                "percentageGroupingLabel": "",
                "sortOrder": {
                    "nameAsc": "",
                    "nameDesc": "",
                    "valueAsc": "",
                    "valueDesc": ""
                },
                "timestampColorPicker": ""
            },
            "resetDefaults": "",
            "set": "",
            "setGlobal": "",
            "setSimilar": "",
            "settingsPopupTitle": "",
            "success": ""
        }
    },
    "signIn": "",
    "signOut": "",
    "survey": {
        "already_taken": "Grazie per il tuo interesse. Hai già risposto a questo sondaggio.",
        "surveysListing": "Elenco dei sondaggi",
        "termsOfUse": "Termini d'Uso"
    },
    "surveyAnalysis": {
        "exitReport": {
            "desc": "",
            "ok": "",
            "title": ""
        },
        "filter": {
            "back": "",
            "next": ""
        },
        "settings": {
            "analysisTypes": "",
            "next": "",
            "question": "",
            "referenceQuestion": ""
        },
        "tabs": {
            "filter": "",
            "report": "",
            "settings": ""
        }
    },
    "surveyCreation": {
        "mandatoryQuestion": ""
    },
    "surveyEmailSettings": {
        "enabledEmailTypes": {
            "survey-completed": "",
            "survey-rejected": "",
            "survey-waiting": ""
        },
        "enabledEmailTypesCaption": ""
    },
    "surveyPayments": {
        "active": "",
        "paymentTypes": {
            "giftCard": "",
            "paypal": ""
        }
    },
    "surveySettings": {
        "autoAdvanceSettings": {
            "active": "",
            "autoAdvance": "",
            "caption": "",
            "debounce": "",
            "hideNextButton": "",
            "nextButton": ""
        },
        "pdfFooterData": {
            "label": ""
        },
        "pdfFooterSettings": {
            "note": ""
        },
        "screenerOnly": {
            "active": "",
            "title": ""
        },
        "sharingButtons": {
            "label": "",
            "yes": ""
        },
        "showGeneratePdf": {
            "active": "Sì",
            "title": "Attiva i report (PDF) per il degustatore"
        },
        "tastingNotes": {
            "country": "",
            "customer": "",
            "dateOfTasting": "",
            "otherInfo": "",
            "tastingId": "",
            "tastingLeader": ""
        },
        "valdatedChartData": {
            "label": "",
            "yes": ""
        },
        "validations": {
            "debounce": {
                "max": "",
                "min": "",
                "required": "",
                "step": ""
            }
        }
    },
    "theFlavorWikiTeam": "Il Team FlavorWiki",
    "tooltips": {
        "cloneSurveyButton": "",
        "copyQr": "",
        "copySurveyUrlButton": "",
        "debounceTooltip": "",
        "deletePicture": "",
        "deleteQr": "",
        "deleteSurveyButton": "",
        "downloadQr": "",
        "duplicateQuestion": "",
        "editDraftButton": "",
        "editQr": "",
        "editSurveyAlertFullOption": "",
        "editSurveyAlertStrictOption": "",
        "editSurveyButton": "",
        "exportGiftCardIncentivesButton": "",
        "exportGiftCardSharesButton": "",
        "exportProductIncentivesButton": "",
        "exportSharingButton": "",
        "exportSurveyButton": "",
        "exportSurveyPhotosButton": "",
        "forms": {
            "uniqueNameTooltip": {
                "add": "",
                "edit": ""
            }
        },
        "funnelActions": "",
        "hideNextButtonTooltip": "",
        "imageDisplayOptionsHelper": "",
        "importGiftCardIncentives": "",
        "importGiftCardShares": "",
        "importProductIncentives": "",
        "importSurveyShares": "",
        "invalidSurveyPhotos": "",
        "likingQuestionRestricted": "",
        "moreActions": "",
        "newProduct": "",
        "newQuestion": "",
        "notProcessedSurveyPhotos": "",
        "operatorSurveyDetailBar": {
            "after": "",
            "basics": "",
            "before": "",
            "linkedSurveys": "",
            "payments": "",
            "products": "",
            "screening": "",
            "settings": "",
            "tasting": "",
            "tastingNotes": ""
        },
        "pauseSurvey": "",
        "previewDraft": "",
        "product": {
            "brand": "",
            "canNotDelete": "",
            "isAvailable": "",
            "name": "",
            "picture": "",
            "reward": ""
        },
        "productDisplayDragAndDrop": "",
        "productDisplayOptions": "",
        "publishSurvey": "",
        "questionCreation": {
            "maxProductsToTaste": "",
            "minProductsToTaste": "",
            "prompt": "",
            "secondaryPrompt": ""
        },
        "questionHeader": {
            "choose-payment": "",
            "choose-product": "",
            "paypal-email": ""
        },
        "questionType": {
            "choose-date": "",
            "choose-multiple": "",
            "choose-one": "",
            "dropdown": "",
            "email": "",
            "info": "",
            "location": "",
            "numeric": "",
            "open-answer": "",
            "paired-questions": "",
            "select-and-justify": "",
            "slider": "",
            "time-stamp": "",
            "upload-picture": "",
            "vertical-rating": ""
        },
        "removeQuestion": "",
        "resumeSurvey": "",
        "saveDraft": "",
        "saveDraftSurvey": "",
        "screenerOnly": "",
        "ShareSurveyStats": "",
        "showGeneratePdf": "Permette al suo degustatore di scaricare i grafici in formato PDF.",
        "stats": {
            "addColor": "",
            "reset": "",
            "setGlobal": ""
        },
        "strictOptions": "",
        "surveyBasicInfoForm": {
            "authorizationType": "",
            "continueButton": "",
            "country": "",
            "customizeSharing": "",
            "instruction": "",
            "instructionSteps": "",
            "loginText": "",
            "name": "",
            "nextButton": "",
            "pauseText": "",
            "referralAmount": "",
            "rejection": "",
            "screening": "",
            "securitySettings": "",
            "selectLanguage": "",
            "skipButton": "",
            "startSurveyButton": "",
            "staticUniqueName": "",
            "thankYou": "",
            "uniqueName": ""
        },
        "surveyCharts": "",
        "updateSurvey": "",
        "updateSurveyDraft": "",
        "validSurveyPhotos": ""
    },
    "tooltips.likingQuestionRestricted": "",
    "validation": {
        "analyticsValue": "",
        "analyticsValueIsPositive": "",
        "analyticsValueWithoutSpaces": "",
        "basics": {
            "allowedDaysToFillTheTasting": {
                "integer": "",
                "max": "",
                "min": "",
                "required": ""
            },
            "customButtons": {
                "continueEmptySpaces": "",
                "continueRequired": "",
                "nextEmptySpaces": "",
                "nextRequired": "",
                "skipEmptySpaces": "",
                "skipRequired": "",
                "startEmptySpaces": "",
                "startRequired": ""
            },
            "excluseiveTasters": {
                "email": "",
                "required": "",
                "withoutSpaces": ""
            },
            "instruction": "",
            "instructionRequired": "Sono richieste istruzioni",
            "instructionWithoutSpaces": "",
            "maxProductStatCount": {
                "isMax": "",
                "max": "",
                "min": "",
                "required": ""
            },
            "name": {
                "required": "",
                "withoutSpaces": ""
            },
            "referralAmount": {
                "isNumber": "",
                "max": "",
                "min": "",
                "required": ""
            },
            "uniquName": {
                "required": "",
                "restrict": "",
                "withoutSpaces": ""
            }
        },
        "birthday": {
            "required": ""
        },
        "chartTitle": {
            "required": "",
            "whitespace": ""
        },
        "chartTopic": {
            "required": "",
            "whitespace": ""
        },
        "chartType": {
            "minProductsForCorrelation": "",
            "required": "",
            "wrongChartType": ""
        },
        "chooseProduct": {
            "equalOrLess": "",
            "greaterThan": "",
            "maxProducts": {
                "integer": "",
                "required": ""
            },
            "minProducts": {
                "integer": "",
                "required": ""
            }
        },
        "confirmPassword": {
            "required": ""
        },
        "currentPassword": {
            "required": ""
        },
        "dropdown": {
            "minim": "",
            "options": {
                "analytics": {
                    "required": ""
                },
                "label": {
                    "required": ""
                }
            },
            "prompt": "",
            "uniqueOptions": ""
        },
        "email": {
            "email": "",
            "required": ""
        },
        "emailTemplate": {
            "html": {
                "required": ""
            },
            "subject": {
                "required": ""
            },
            "text": {
                "required": ""
            }
        },
        "firstname": {
            "required": ""
        },
        "info": {
            "prompt": "",
            "secondaryPrompt": ""
        },
        "integer": "",
        "label": "",
        "labelWithoutSpaces": "",
        "lastname": {
            "required": ""
        },
        "location": {
            "region": ""
        },
        "multiple": {
            "maxAnswerValues": {
                "lessThanTotal": "",
                "min": "",
                "moreThanMin": "",
                "typeError": ""
            },
            "minAnswerValues": {
                "lessThanMax": "",
                "lessThanTotal": "",
                "min": "",
                "typeError": ""
            },
            "minim": "",
            "options": {
                "analytics": {
                    "required": ""
                },
                "label": {
                    "required": ""
                }
            },
            "uniqueOptions": ""
        },
        "newPassword": {
            "required": ""
        },
        "numeric": {
            "greaterOrEqual": "",
            "integer": "",
            "lessOrEqual": "",
            "maxNumber": "",
            "minNumber": "",
            "moreThan": "",
            "questionRequired": ""
        },
        "one": {
            "minim": "",
            "options": {
                "analytics": {
                    "required": ""
                },
                "label": {
                    "required": ""
                }
            },
            "uniqueOptions": ""
        },
        "organizationForm": {
            "name": {
                "maxLength": "",
                "required": "",
                "withoutSpaces": ""
            },
            "uniqueName": {
                "matches": "",
                "required": ""
            }
        },
        "paired": {
            "likingQuestion": "",
            "options": {
                "integer": "",
                "max": "",
                "min": "",
                "required": ""
            },
            "pairs": {
                "min": "",
                "unique": ""
            },
            "profileTitle": {
                "required": "",
                "string": ""
            }
        },
        "product": {
            "reward": ""
        },
        "products": {
            "brand": "",
            "brandWithoutSpaces": "",
            "isAvailable": "",
            "name": "",
            "nameWithoutSpaces": "",
            "rewardMin": "",
            "rewardNumber": "",
            "rewardWithoutSpaces": ""
        },
        "profileTitle": {
            "required": "",
            "string": "",
            "withoutSpaces": ""
        },
        "prompt": "",
        "promptWithoutSpaces": "",
        "questionCreation": {
            "questionType": {
                "required": ""
            }
        },
        "required": "",
        "requiredField": "",
        "secondaryPrompt": "",
        "secondaryPromptWithoutSpaces": "",
        "selectAndJustify": {
            "minim": "",
            "options": {
                "analytics": {
                    "required": ""
                },
                "label": {
                    "required": ""
                }
            },
            "prompt": "",
            "secondaryPrompt": "",
            "uniqueOptions": ""
        },
        "slider": {
            "promptString": "",
            "range": {
                "marks": {
                    "label": {
                        "required": "",
                        "string": ""
                    },
                    "unique": "",
                    "value": {
                        "lessThan": "",
                        "moreThan": "",
                        "number": "",
                        "required": ""
                    },
                    "withoutSpaces": ""
                },
                "max": {
                    "digits": "",
                    "greaterThan": "",
                    "number": "",
                    "required": ""
                },
                "min": {
                    "digits": "",
                    "greaterThan": "",
                    "lessThan": "",
                    "number": "",
                    "required": ""
                },
                "sliders": {
                    "atLeast": "",
                    "required": "",
                    "unique": "",
                    "withoutSpaces": ""
                },
                "step": {
                    "digits": "",
                    "greaterThan": "",
                    "lessThan": "",
                    "number": "",
                    "required": "",
                    "submultiple": ""
                }
            },
            "secondaryPrompt": ""
        },
        "surveyAnalysis": {
            "analysisTypes": {
                "minRequired": ""
            },
            "filterProducts": {
                "minRequired": ""
            },
            "filterQuestions": {
                "error": "",
                "minRequired": ""
            },
            "question": {
                "required": ""
            },
            "referenceQuestion": {
                "required": ""
            }
        },
        "surveyBasicInfoForm": {
            "name": {
                "required": ""
            }
        },
        "tasterName": {
            "digitsOnly": "",
            "lettersDigitsOnly": "",
            "maxLength": "",
            "minLength": "",
            "noSpaces": "",
            "settings": {
                "maxLength": {
                    "min": "",
                    "moreThanMin": "",
                    "typeError": ""
                },
                "minLength": {
                    "lessThanMax": "",
                    "min": "",
                    "typeError": ""
                }
            }
        },
        "userForm": {
            "email": {
                "maxLength": "",
                "required": ""
            },
            "fullName": {
                "maxLength": "",
                "nameWithoutSpaces": "",
                "required": ""
            },
            "organization": {
                "typeError": ""
            }
        },
        "vertical": {
            "range": {
                "labels": {
                    "canBeUsed": "",
                    "required": ""
                },
                "max": {
                    "greaterThanMin": "",
                    "integer": "",
                    "moreThan": ""
                },
                "min": {
                    "greaterThan0": "",
                    "integer": "",
                    "lessThan": "",
                    "moreThan": ""
                },
                "skipMax": {
                    "integer": "",
                    "lessThan": "",
                    "moreThan": "",
                    "number": ""
                },
                "skipMin": {
                    "integer": "",
                    "lessThan": "",
                    "moreThan": "",
                    "number": ""
                }
            }
        }
    }
}