{
    "buttons": {
        "cancel": "Cancelar",
        "submit": "Enviar"
    },
    "changePassword": "Cambiar la contraseña",
    "chartRegions": {
        "br": "",
        "ca": "",
        "de": "",
        "fr": "",
        "fr-dep": "",
        "uk": "",
        "us": ""
    },
    "charts": {
        "axis": {
            "stackedAnswerName": ""
        },
        "lineChart": {
            "answers": "",
            "percentage": ""
        },
        "noResults": "",
        "table": {
            "answer": "",
            "attribute": "",
            "mean": "",
            "score": "",
            "stdev": "",
            "value": ""
        },
        "tooltip": {
            "percentageOfProductGroup": "",
            "percentageOfTehGroup": "",
            "percentageOfTotal": "",
            "responses": "",
            "total": ""
        },
        "totalRespondents": ""
    },
    "chartTypes": {
        "bar": "",
        "column": "",
        "columns-mean": "",
        "horizontal-bars-mean": "",
        "line": "",
        "map": "",
        "no-chart": "",
        "pearson-table": "",
        "pie": "",
        "spearmann-table": "",
        "spider": "",
        "stacked-bar": "",
        "stacked-column": "",
        "stacked-column-horizontal-bars": "",
        "table": "",
        "tags-list": ""
    },
    "components": {
        "additionalInfo": {
            "childrenAgeLabel": "Edad de los niños",
            "childrenAgePlaceholder": "Seleccione una opción",
            "childrenAtHome": "3. Niños en casa",
            "childrenAtHomeMsg": "Ingrese el número de niños",
            "childrenAtHomePlaceholder": "Seleccione una opción",
            "dietaryPlaceholder": "Seleccione una opción",
            "dietaryTitle": "6. Restricciones dietéticas",
            "ethnicity": "1. Origen étnico",
            "ethnicityPlaceholder": "Seleccione una opción",
            "income": "2. Ingresos",
            "incomePlaceholder": "Moneda",
            "incomeRangePlaceholder": "Rango de ingresos",
            "productTypePlaceholder": "Seleccione una opción o más",
            "productTypeTitle": "5. Tipos de productos",
            "smokerPlaceholder": "",
            "smokerTitle": "4. Fumador o no",
            "updateButton": "Actualizar información"
        },
        "alertModal": {
            "cancel": "Cancelar",
            "delete": "Eliminar"
        },
        "backNavigation": {
            "back": "Volver"
        },
        "bottomNavBar": {
            "steps": "{{currentStep}} de {{totalSteps}}"
        },
        "changePassword": {
            "confirmPassword": "Confirmación de contraseña",
            "currentPassword": "Contraseña actual",
            "forgotPasswordButton": "Olvidé la contraseña",
            "newPassword": "Nueva contraseña",
            "passwordPrompt": "Debe proporcionar su contraseña actual para poder cambiarla.",
            "savePasswordButton": "Guardar contraseña"
        },
        "chooseMultipleSkipOptions": {
            "answersToBeSelected": "",
            "maxCondintionalOptions": "",
            "showQuestions": ""
        },
        "coverProduct": {
            "empty": "",
            "prompt": "",
            "remove": ""
        },
        "createQrCode": {
            "save": ""
        },
        "createTasterAccount": {
            "forms": {
                "first": {
                    "confirm": {
                        "label": "",
                        "placeholder": ""
                    },
                    "email": {
                        "label": "",
                        "placeholder": ""
                    },
                    "password": {
                        "label": "",
                        "placeholder": ""
                    }
                },
                "second": {
                    "country": {
                        "label": "",
                        "placeholder": ""
                    },
                    "dateofbirth": {
                        "label": "",
                        "placeholder": ""
                    },
                    "firstName": {
                        "label": "",
                        "placeholder": ""
                    },
                    "gender": {
                        "label": "",
                        "placeholder": ""
                    },
                    "langugage": {
                        "label": "",
                        "placeholder": ""
                    },
                    "lastName": {
                        "label": "",
                        "placeholder": ""
                    },
                    "state": {
                        "label": "",
                        "placeholder": ""
                    }
                },
                "third": {
                    "childrenAges": {
                        "label": "",
                        "placeholder": ""
                    },
                    "ethnicity": {
                        "label": "",
                        "placeholder": ""
                    },
                    "foodAllergies": {
                        "label": "",
                        "placeholder": ""
                    },
                    "incomeRange": {
                        "label": "",
                        "placeholder": ""
                    },
                    "marketResearchParticipation": {
                        "label": "",
                        "placeholder": ""
                    },
                    "numberOfChildren": {
                        "label": "",
                        "placeholder": ""
                    },
                    "paypalEmailAddress": {
                        "label": "",
                        "placeholder": ""
                    },
                    "smokerKind": {
                        "label": "",
                        "placeholder": ""
                    }
                }
            },
            "main": {
                "cancelText": "",
                "extraActionText": "",
                "nextStepDefault": "",
                "stepsText": ""
            },
            "steps": {
                "first": {
                    "description": "",
                    "okText": "",
                    "title": ""
                },
                "second": {
                    "description": "Necesitamos saber un poco más sobre usted.",
                    "okText": "Siguiente paso",
                    "title": "Información personal"
                },
                "third": {
                    "description": "Esta información adicional nos ayudará a seleccionar las mejores encuestas de productos para usted.",
                    "okText": "Guardar",
                    "title": "Información adicional"
                }
            },
            "validations": {
                "first": {
                    "confirm": {
                        "oneOf": "",
                        "required": ""
                    },
                    "email": {
                        "required": "",
                        "valid": ""
                    },
                    "password": {
                        "min": "",
                        "required": ""
                    }
                },
                "second": {
                    "firstName": {
                        "required": ""
                    },
                    "lastName": {
                        "required": ""
                    }
                },
                "third": {
                    "childrenAges": {
                        "required": ""
                    },
                    "paypal": {
                        "required": "",
                        "valid": ""
                    }
                }
            }
        },
        "dasboard": {
            "survey": {
                "actions": {
                    "analyzeSurvey": "",
                    "photoValidation": "",
                    "shareStats": {
                        "modal": {
                            "title": ""
                        },
                        "success": {
                            "message": ""
                        }
                    }
                }
            }
        },
        "download": {
            "cancel": "",
            "checking": "",
            "download": "",
            "goToDashboard": "",
            "subTitle": "",
            "title": ""
        },
        "downloadMenu": {
            "downloadJpeg": "",
            "downloadPdf": "",
            "downloadPng": ""
        },
        "editQrCode": {
            "save": "Actualizar"
        },
        "footer": {
            "aboutText": "FlavorWiki ayuda a la industria de alimentos y bebidas a evaluar la percepción y preferencia de los consumidores en un tiempo récord, desde cualquier parte del mundo.",
            "privacyPolicy": "Política de privacidad",
            "termsAndConditions": "Términos y condiciones"
        },
        "forgotPasswordForm": {
            "sendButton": "Enviar correo electrónico"
        },
        "impersonate": {
            "impersonate": "",
            "impersonatedAs": "",
            "impersonateUser": "",
            "toGoToAdmin": ""
        },
        "inputArea": {
            "addImage": "",
            "linkTitle": ""
        },
        "inputList": {
            "addStep": ""
        },
        "maxProductStatCount": {
            "label": ""
        },
        "ongoingSurveysGrid": {
            "notFound": ""
        },
        "operatorQrCode": {
            "createQr": ""
        },
        "operatorQrCodeDownload": {
            "prompt": "",
            "title": ""
        },
        "operatorQrCodeForm": {
            "alert": {
                "description": "",
                "okText": "",
                "title": ""
            },
            "cancel": "",
            "copy": "",
            "download": "",
            "draft": "",
            "generateQrCodeNotice": "",
            "linkToSurvey": "",
            "linkToUrl": "",
            "name": "",
            "notFound": "",
            "suspended": "",
            "uniqueName": "",
            "uniqueNameHelper": "",
            "validate": {
                "name": {
                    "required": ""
                },
                "redirectLink": "",
                "survey": {
                    "required": ""
                },
                "targetLink": {
                    "required": "",
                    "urlValid": ""
                },
                "uniqueName": {
                    "matches": "",
                    "max": "",
                    "required": ""
                }
            }
        },
        "operatorSurveyDetailBar": {
            "after": "",
            "basics": "",
            "before": "",
            "emailSettings": "",
            "linkedSurveys": "",
            "payments": "",
            "products": "",
            "screening": "",
            "settings": "",
            "tasting": "",
            "tastingNotes": ""
        },
        "operatorSurveyDetailBarChrHansen": {
            "after": ""
        },
        "operatorSurveys": {
            "actions": "",
            "activeSurveys": "",
            "createNew": "",
            "multipleProducts": "",
            "multipleTastings": "",
            "screenerOnly": "",
            "singleProduct": "",
            "title": ""
        },
        "organizationForm": {
            "addedSuccessfully": "",
            "addTitle": "",
            "deletedSuccessfully": "",
            "editTitle": "",
            "organizationName": "",
            "uniqueName": "",
            "uniqueNameTooltip": {
                "add": "",
                "edit": ""
            },
            "updateSuccessfully": ""
        },
        "organizationsList": {
            "actionsColumnTitle": "",
            "add": "",
            "createdColumnTitle": "",
            "delete": "",
            "edit": "",
            "modifiedColumnTitle": "",
            "nameColumnTitle": "",
            "search": "",
            "usersColumnTitle": ""
        },
        "paymentDetailsForm": {
            "bankAccount": "",
            "bankAccountName": "",
            "bankAccountNumber": "",
            "bankBIC": "",
            "bankDescription": "",
            "bankIBAN": "",
            "bankName": "",
            "payPalCard": "Con PayPal",
            "paypalEmail": "Dirección de correo electrónico de PayPal",
            "submitButton": "Actualizar información"
        },
        "paypalEmailModal": {
            "prompt": "Para recibir su recompensa, necesitaremos el correo electrónico de su cuenta PayPal",
            "title": "Ingrese su correo electrónico de PayPal"
        },
        "personalDetailsForm": {
            "birthday": "",
            "email": "",
            "firstName": "Nombre",
            "gender": "Género",
            "language": "Idioma",
            "lastName": "Apellido",
            "submitButton": "Actualizar información"
        },
        "privacyForm": {
            "marketingEmails": {
                "description": "Hoy en día, las empresas a menudo se conocen a través de un marketing eficaz.",
                "title": "Correos electrónicos de marketing"
            },
            "marketingNotifications": "Notificaciones de marketing",
            "marketingPushes": {
                "description": "Quiero que FlavorWiki me envíe notificaciones emergentes de marketing que puedan interesarme.",
                "title": "Emergentes de marketing"
            },
            "pushNotifications": {
                "description": "Quiero recibir notificaciones para ver nuevas encuestas.",
                "title": "Notificaciones emergentes"
            }
        },
        "product": {
            "brand": "",
            "isAvailable": "",
            "name": "",
            "reward": ""
        },
        "productDisplayOptions": {
            "dragAndDropSort": "",
            "forced": "",
            "none": "",
            "note": "",
            "permutation": "",
            "productDisable": "",
            "productDisplayType": "",
            "randomise": "",
            "reverse": ""
        },
        "products": {
            "addProducts": "",
            "apply": "",
            "category": "",
            "columns": {
                "action": "",
                "add": "",
                "name": "",
                "photo": ""
            },
            "search": ""
        },
        "productsTable": {
            "actionEdit": "",
            "actionRemove": "",
            "alertModaldescription": "",
            "alertModalTitle": "",
            "columnAction": "",
            "columnCategory": "",
            "columnClient": "",
            "columnDate": "",
            "columnProductName": ""
        },
        "profile": {
            "title": "Mi perfil"
        },
        "qrCode": {
            "actionsTitle": "",
            "missed": "",
            "nameTitle": ""
        },
        "question": {
            "chooseProduct": {
                "noImage": "Sin imagen",
                "reward": "Recompensa:"
            }
        },
        "questionCreation": {
            "addOtherConditions": "",
            "analyticalValueOfAnswer": "",
            "chartSection": {
                "chartSettings": "",
                "chartTitle": "",
                "chartTopic": "",
                "chartType": ""
            },
            "chooseMultiple": {
                "maxAnswerValues": "",
                "minAnswerValues": ""
            },
            "chooseOne": {
                "optionsSection": ""
            },
            "chooseProduct": {
                "maxProductsToTaste": "",
                "minProductsToTaste": "",
                "notSelected": ""
            },
            "displayAll": "",
            "displaySurveyName": "",
            "dropdown": {
                "optionsSection": "",
                "prompt": "",
                "secondaryPrompt": ""
            },
            "duplicateButton": "",
            "existingAnswer": "",
            "hideConditionButton": "",
            "hideSkip": "",
            "hideSkipOptions": "",
            "imageAndLabelSettings": {
                "imageAndLabel": "",
                "imageDisplayOptions": "",
                "imageOnly": "",
                "labelOnly": "",
                "questionSettings": "",
                "removeImage": ""
            },
            "infoForm": {
                "prompt": "",
                "secondaryPrompt": ""
            },
            "jumpTo": "",
            "jumpToQuestions": "",
            "location": {
                "region": "",
                "regionRestricted": "No se puede cambiar de país."
            },
            "mandatory": "",
            "markAll": "",
            "newQuestion": "",
            "numeric": {
                "labels": {
                    "additionalInformationText": "",
                    "maximum": "",
                    "minimum": "",
                    "numberFormat": "",
                    "questionText": "",
                    "sampleOfNumber": ""
                }
            },
            "openAnswer": "",
            "optionsSection": {
                "addAnswer": "",
                "notSelected": ""
            },
            "paired": {
                "bothPresent": "",
                "customDescriptor": "",
                "descriptors": "",
                "hasFollowUpProfile": "",
                "likingQuestion": "",
                "maximumPairs": "",
                "maxPairs": "",
                "minimumPairs": "",
                "minPairs": "",
                "missingBoth": "",
                "missingOne": "",
                "noverticalRating": "",
                "options": "",
                "pairsOptions": {
                    "bothFlavorsPresentEnabled": "",
                    "customFlavorEnabled": "",
                    "neitherFlavorPresentEnabled": "",
                    "oneFlavorNotPresentEnabled": ""
                },
                "profilePrompt": ""
            },
            "pictureOnAll": "",
            "prompt": "",
            "questionDuplicateError": "Hubo un error al duplicar tu pregunta",
            "questionDuplicateSuccess": "Pregunta duplicada",
            "questionSectionSelect": "",
            "questionSectionSelectOption": {
                "begin": "",
                "middle": "",
                "screening": ""
            },
            "questionType": "",
            "removeButton": "",
            "removeButtonHelper": "",
            "secondaryPrompt": "",
            "selectAndJustify": {
                "options": "",
                "prompt": "",
                "secondaryPrompt": ""
            },
            "showConditionButton": "",
            "showSkip": "",
            "showSkipOptions": "",
            "slider": {
                "addMarks": "",
                "addSlider": "",
                "addSliders": "",
                "alert": {
                    "deleteMark": "",
                    "deleteSlider": "",
                    "description": "",
                    "okText": ""
                },
                "isInOneRow": "",
                "marks": {
                    "add": "",
                    "isMajor": ""
                },
                "max": "",
                "min": "",
                "profileStepTitle": "",
                "prompt": "",
                "secondaryPrompt": "",
                "showProfile": "",
                "step": ""
            },
            "tagInput": {
                "add": ""
            },
            "tasterName": {
                "allowSpaces": "",
                "answerFormat": "",
                "answerFormats": {
                    "any": "",
                    "digits": "",
                    "letters-and-digits": ""
                },
                "maxLength": "",
                "minLength": ""
            },
            "timestamp": {
                "info": ""
            },
            "verticalRating": {
                "additionalText": "",
                "addSkipingRule": "",
                "maximum": "",
                "minimum": "",
                "noSkipingRule": "",
                "questionText": "",
                "scaleLabels": "",
                "startingFrom": "",
                "upTo": ""
            }
        },
        "register": {
            "back": "",
            "creatingError": "",
            "creatingErrorCheckAgain": "",
            "doLater": "Hacerlo más tarde",
            "nextStep": "Siguiente paso"
        },
        "requestAccountForm": {
            "submit": "Enviar"
        },
        "retakes": {
            "header": "Esta encuesta solo se puede realizar una vez.",
            "subHeader": "Ya ha completado la encuesta."
        },
        "shareStatsForm": {
            "organizations": {
                "label": "",
                "tabs": {
                    "all": "",
                    "selected": ""
                }
            },
            "users": {
                "label": "",
                "tabs": {
                    "all": "",
                    "selected": ""
                }
            }
        },
        "socialMedia": {
            "shareFB": "Compartir en Facebook",
            "shareLI": "Compartir en LinkedIn",
            "shareTW": "Compartir en Twitter"
        },
        "storesTable": {
            "actionEdit": "",
            "actionRemove": "",
            "alertModaldescription": "",
            "alertModalTitle": "",
            "columnAction": "",
            "columnCompanyName": "",
            "columnCountry": "",
            "columnDate": "",
            "columnState": ""
        },
        "survey": {
            "notAuthorized": {
                "content": "",
                "title": ""
            }
        },
        "surveyBasicInfoForm": {
            "alert": {
                "description": "",
                "okText": "",
                "title": ""
            },
            "allowedDaysToFillTheTasting": "",
            "allowedUsers": "",
            "authorizationType": "",
            "continueButton": "",
            "copy": "",
            "copySuccessfull": "",
            "country": "",
            "customizeSharing": {
                "description": "",
                "title": ""
            },
            "forceAccount": {
                " end": "",
                "end": "",
                "start": ""
            },
            "forceTasterAccount": "",
            "instruction": "",
            "instructionSteps": "Pasos de instrucción",
            "loginText": "",
            "minimumNumber": "",
            "name": "",
            "nextButton": "",
            "pauseText": "",
            "rejection": "",
            "requireRecaptcha": "",
            "screening": "",
            "securitySettings": "",
            "selectLanguage": "",
            "skipButton": "",
            "startSurveyButton": "",
            "surveyUrl": "",
            "takeSurveyMultipleTimes": "",
            "tastingSettings": "",
            "thankYou": "",
            "uniqueName": "",
            "uniqueNameExists": ""
        },
        "surveyComplete": {
            "backToDashboard": "Volver al tablero",
            "text": "Acabo de terminar una encuesta, mírenla"
        },
        "surveyFunnel": {
            "columns": {
                "product": "",
                "question": "",
                "responses": ""
            },
            "mainHeader": ""
        },
        "surveyInfoTest": {
            "addYourOwn": "Agregue su propio",
            "answered": "Respondido",
            "atLeast": "Responder al menos",
            "bothOptionsPresent": "Ambos descriptores están presentes",
            "cantDecide": "No puedo decidir",
            "close": "cerrar",
            "completed": "Encuesta completada",
            "congratulations": "Felicitaciones",
            "customOption": "Descriptor personalizado",
            "information": "Información",
            "isNotPresent": "no está presente",
            "isPresent": "está presente",
            "noDescriptorPresent": "Ninguno de los descriptores está presente",
            "noMorePairs": "No más pares, haga clic en 'Siguiente' para continuar",
            "optionsModalTitle": "¿Descriptores incorrectos?",
            "otherOptions": "Otras Opciones",
            "pair": "par",
            "pairedQuestionInfo": "En las siguientes preguntas, habrá múltiples pares de términos descriptivos. Seleccione el término que, en su opinión, describe mejor el producto. Responda lo mejor que pueda. No hay respuesta correcta o incorrecta.",
            "pairs": "pares",
            "pickOption": "Elija la opción que mejor describa su situación.",
            "rejected": "Has sido rechazado",
            "rejectedReasonFirst": "Lo sentimos, pero estamos buscando un perfil diferente al suyo para esta degustación.",
            "rejectedReasonSecond": "Pero no se desanime, consideraremos su participación en nuestras futuras degustaciones.",
            "screeningOk": "Usted ha calificado para la degustación. Por favor, haga clic en el botón de abajo para continuar. También recibirá un correo electrónico en breve con este enlace como recordatorio.",
            "uploadPicture": "Cargue una foto de su producto abierto para verificar que ha completado todo correctamente. Se requiere una foto que muestre claramente el producto durante la degustación para poder optar a sus recompensas.",
            "writeOption": "Escriba su propia opción a continuación"
        },
        "surveyInstructions": {
            "title": "Instrucciones de degustación"
        },
        "surveyList": {
            "completed": "",
            "finished": "",
            "ready": "",
            "rejected": "",
            "retake": ""
        },
        "surveyLogIn": {
            "access": "Haga clic aquí para acceder a la página de inicio de sesión.",
            "accessLogin": "Si tiene acceso a esta encuesta, inicie sesión primero.",
            "askForAccount": "",
            "askForEmail": "Ingrese su correo electrónico para continuar.",
            "loginText": "<p>¡Bienvenido a la degustación!<\/p> \n<p>Ingrese su correo electrónico para continuar.<\/p>\n<p>Si abandona la degustación antes de completarla, puede continuar donde la dejó ingresando su correo electrónico en la página de inicio.<\/p>",
            "loginTo": "Iniciar sesión en",
            "nextTimeDetails": "Si deja la degustación antes de completarla, puede continuar donde la dejó ingresando su correo electrónico en la página de inicio.",
            "notARobot": "Confirme que no es un robot para poder comenzar.",
            "notSelectedToParticipate": "No se encuentra entre los usuarios seleccionados para participar en esta encuesta.",
            "pauseText": "<p style='text-align: left;'><strong>Gracias por su interés.<\/strong><\/p><p style='text-align: left;'><strong>Este estudio ya ha finalizado.<\/strong><\/p><p style='text-align: left;'><strong>También puede escribir a support@flavorwiki.com por cualquier otra consulta.<\/strong><\/p><br><p style='text-align: left;'><strong>Gracias,<\/strong><\/p><p style='text-align: left;'><strong>The FlavorWiki Team.<\/strong><\/p>",
            "pressToStart": "Presione el botón de abajo para comenzar.",
            "signupFor": "",
            "surveyAvailable": "Esta encuesta solo está disponible para usuarios específicos.",
            "surveyExpired": "Gracias por su interés en este estudio de mercado. Su tiempo para completar la degustación ha expirado.",
            "welcome": "¡Bienvenido a la degustación!"
        },
        "surveyNavigation": {
            "skipProgressText": "Ha contestado por $t(countProduct, { 'count': {{products}} }). Puede saltar a la siguiente después de contestar al menos $t(countProduct, { 'count': {{minimumProducts}} })."
        },
        "surveyPhotos": {
            "mainHeader": "",
            "noneAvailable": "",
            "successPopup": ""
        },
        "surveyQuestion": {
            "maxAnswerValues": "Debe seleccionar un máximo de $t(countAnswer, { \"count\": {{maxAnswerValues}} })",
            "minAnswerValues": "Debe seleccionar un mínimo de $t(countAnswer, {\"count\": {{minAnswerValues}} }) y un máximo de $t(countAnswer, {\"count\": {{maxAnswerValues}} })",
            "minMaxDiffAnswerValues": "Debe seleccionar entre $t(countAnswer, { \"count\": {{minAnswerValues}} }) y $t(countAnswer, { \"count\": {{maxAnswerValues}} }).",
            "minMaxSameAnswerValues": "Debe seleccionar $t(countAnswer, { \"count\": {{maxAnswerValues}} }).",
            "onlyMaxAnswerValues": "Debe seleccionar como máximo $t(countAnswer, {\"count\": {{maxAnswerValues}} }).",
            "onlyMinAnswerValues": "Debe seleccionar al menos $t(countAnswer, { \"count\": {{minAnswerValues}} })."
        },
        "surveysList": {
            "answeredSurveys": ""
        },
        "surveyValidate": {
            "filters": {
                "email": "",
                "total": ""
            }
        },
        "table": {
            "actionRemove": "",
            "alertModalDescription": "",
            "alertModalTitle": "",
            "dateColumnActionTitle": "",
            "dateColumnTitle": "",
            "nameColumnTitle": "",
            "productsColumnTitle": ""
        },
        "tagInput": {
            "add": ""
        },
        "tasterProfile": {
            "birthYear": "Su año de nacimiento",
            "fullName": "Su nombre completo",
            "gender": "Su género",
            "nationality": "El país donde vive actualmente",
            "submitButton": "Enviar"
        },
        "userList": {
            "addFormTitle": "",
            "editFormTitle": ""
        },
        "usersList": {
            "add": "",
            "emailAddress": "",
            "fullName": "",
            "selectOrganization": "",
            "selectType": "",
            "table": {
                "actions": "",
                "delete": "",
                "edit": "",
                "email": "",
                "name": "",
                "organization": "",
                "type": ""
            }
        },
        "userSurvey": {
            "inProgress": "Encuesta en curso",
            "productsPurchase": "Productos para comprar y degustar",
            "timeLeftInProgressDays": "para completar la encuesta",
            "timeLeftInProgressHours": "",
            "timeLeftSurveyOngoingDays": "dejado para comprar y degustar productos",
            "timeLeftSurveyOngoingHours": ""
        },
        "userSurveyCard": {
            "products": "{{number}} Producto {{plural}}",
            "seeShops": "(Ver tiendas)"
        },
        "verticalRating": {
            "additionalText": "",
            "maximum": "",
            "minimum": "",
            "questionText": "",
            "scaleLabels": "",
            "startingFrom": "",
            "upTo": ""
        }
    },
    "containers": {
        "additionalInfo": {
            "error": "",
            "success": ""
        },
        "addProductsToCreate": {
            "newProduct": ""
        },
        "addQuestionsToCreate": {
            "newStep": ""
        },
        "addQuestionToCreate": {
            "error": "",
            "success": ""
        },
        "authenticatedLayut": {
            "home": "Inicio",
            "signOut": "Cerrar sesión"
        },
        "changePassword": {
            "error": "Error al actualizar su perfil, revise el formulario e intente nuevamente.",
            "success": "Actualizó con éxito su contraseña.",
            "userPasswordError": "Su contraseña actual es incorrecta."
        },
        "cloneSurveyButton": {
            "alertModalDescriptionNo": "",
            "alertModalDescriptionYes": "",
            "alertModalOkText": "",
            "alertModalTitleNo": "",
            "alertModalTitleYes": "",
            "error": "",
            "success": ""
        },
        "completeTasterProfile": {
            "home": "",
            "signOut": "",
            "subtitle": "",
            "title": "Complete su perfil"
        },
        "CompleteTasterProfileForm": {
            "error": "",
            "submissionError": "",
            "validation": {
                "birthYearMax": "Es demasiado joven",
                "birthYearMin": "Este año no es válido",
                "birthYearRequire": "Se requiere su año de nacimiento",
                "fullnameRequire": "Se requiere su nombre completo",
                "genderRequire": "Se requiere su género",
                "nationalityRequire": "Se requiere su país de residencia"
            }
        },
        "createAccount": {
            "additionalInfo": {
                "childrenAgesMin": "Ingrese la edad de los niños",
                "childrenAgesRequire": "Se requiere la edad de los niños",
                "incomeRangeRequire": "Debe seleccionar un rango de ingresos",
                "numberOfChildError": "El número de niños debe ser un número",
                "numberOfChildLessthan": "",
                "numberOfChildMorethan": "",
                "numberOfChildRequire": ""
            },
            "personalInfo": {
                "birthdayRequire": "",
                "firstnameRequire": "",
                "lastnameRequire": "",
                "recaptchaError": "Compruebe de nuevo",
                "recaptchaRequire": ""
            },
            "welcomeForm": {
                "confirmMatch": "",
                "confirmRequire": "",
                "emailRequire": "",
                "emailValid": "",
                "passwordMin": "",
                "passwordRequire": ""
            }
        },
        "customButtons": {
            "continue": "",
            "next": "",
            "skip": "",
            "start": ""
        },
        "deleteSurveyButton": {
            "alertModalDescriptionNo": "",
            "alertModalDescriptionYes": "",
            "alertModalOkText": "",
            "alertModalTitleNo": "",
            "alertModalTitleYes": "",
            "error": "",
            "success": ""
        },
        "editQrCode": {
            "save": ""
        },
        "editSurveyButton": {
            "alertModalDefaultOption": {
                "AfterHelpText": "",
                "BeforeHelpText": "",
                "HelpText": ""
            },
            "alertModalOkText": "",
            "alertModalStrictedOption": {
                "BeforeHelpText": "",
                "HelpText": ""
            },
            "alertModalTitle": ""
        },
        "exportSharingContainer": {
            "popups": {
                "downloaded": "",
                "downloading": "",
                "error": ""
            }
        },
        "exportSurveyButton": {
            "alertModalDescription": "",
            "alertModalOkText": "",
            "alertModalTitle": "",
            "emailSend": "",
            "notFound": "",
            "selectUser": ""
        },
        "exportSurveyPhotosButton": {
            "alertModalDescription": "",
            "alertModalOkText": "",
            "alertModalTitle": "",
            "emailSend": "",
            "notFound": "",
            "selectUser": ""
        },
        "forgotPassword": {
            "emailRequire": "Se requiere dirección de correo electrónico",
            "emailValid": "Esta no es una dirección de correo electrónico válida",
            "error": "Hubo un error al enviar el correo electrónico. Verifique la dirección provista e intente nuevamente.",
            "infoMessage": "Recibirá instrucciones en la dirección proporcionada."
        },
        "hooks": {
            "useLoginToSurvey": {
                "errorOnRequest": ""
            }
        },
        "impersonate": {
            "impersonate": "",
            "impersonatedAs": "",
            "toGoToAdmin": ""
        },
        "importGiftCardIncentives": {
            "prompt": "",
            "title": ""
        },
        "importGiftCardShares": {
            "prompt": "",
            "title": ""
        },
        "importProductIncentives": {
            "prompt": "",
            "title": ""
        },
        "importSurveyShares": {
            "prompt": "",
            "title": ""
        },
        "loginForm": {
            "incomingLoginError": "No se pudo iniciar sesión",
            "incomingValidError": "Su correo electrónico o contraseña no es válido",
            "preventMobileOperatorLogin": "",
            "validation": {
                "emailRequire": "Se requiere correo electrónico",
                "emailValid": "El correo electrónico no es válido",
                "passwordMin": "La contraseña debe tener al menos 8 caracteres.",
                "passwordRequire": "Se requiere la contraseña"
            }
        },
        "mandatoryQuestions": {
            "title": ""
        },
        "newPasswordF": {
            "error": "Se produjo un error al cambiar la contraseña",
            "success": "Su contraseña se ha cambiado correctamente",
            "validation": {
                "confirmMatch": "Las contraseñas no coinciden",
                "confirmRequire": "Se requiere confirmación de la contraseña",
                "passwordMin": "La contraseña debe tener al menos 8 caracteres.",
                "passwordRequire": "Se requiere la contraseña"
            }
        },
        "operatorCreateQrCode": {
            "successMessage": "",
            "title": ""
        },
        "operatorEditQrCode": {
            "successMessage": "",
            "title": ""
        },
        "operatorQrCode": {
            "description": "",
            "okText": "",
            "title": ""
        },
        "operatorSurveyInfo": {
            "alertModalkLanDescription": "",
            "alertModalLanOkText": "",
            "alertModalLanTitle": "",
            "alertModalOkText": "",
            "alertModalTitle": ""
        },
        "organizationForm": {
            "addedSuccessfully": "",
            "addTitle": "",
            "deletedSuccessfully": "",
            "editTitle": "",
            "organizationName": "",
            "uniqueName": "",
            "updateSuccessfully": ""
        },
        "organizationsList": {
            "alertModalDescription": "",
            "alertModalOkText": "",
            "alertModalTitle": ""
        },
        "page": {
            "additionalInfo": {
                "childAgeLabel": "",
                "childAgePlaceholder": "",
                "childAtHome": "",
                "childAtHomePlaceholder": "",
                "dietary": "",
                "dietaryPlaceholder": "",
                "ethnicity": "",
                "ethnicityPlaceholder": "",
                "income": "",
                "incomePlaceholder": "",
                "incomeRangePlaceholder": "",
                "numberChildPlaceholder": "",
                "product": "",
                "productPlaceholder": "",
                "smoke": "",
                "smokePlaceholder": ""
            },
            "categoriesGridSection": {
                "title": ""
            },
            "createAccount": {
                "additionalInformartionStep": {
                    "description": "",
                    "title": ""
                },
                "personalInformationStep": {
                    "description": "",
                    "title": ""
                },
                "welcomeStep": {
                    "description": "",
                    "title": ""
                }
            },
            "main": {
                "cancelText": "",
                "extraActionText": "",
                "nextStepDefault": ""
            },
            "notFound": {
                "styledText": "Lo sentimos, la página que visitó no existe"
            },
            "onboarding": {
                "createAccount": {
                    "buttonText": "Crear mi cuenta",
                    "msgText": "Cree su propia cuenta y comience a degustar y ganar premios.",
                    "signupBtnText": "Registrarse",
                    "signupText": "¿Ya tiene una cuenta?",
                    "title": "Cuenta nueva"
                },
                "forgotPassword": {
                    "subTitle": "Escriba su dirección de correo electrónico para que podamos enviarle un enlace para resetear su contraseña.",
                    "title": "Recuperar contraseña"
                },
                "login": {
                    "title": "Iniciar sesión"
                },
                "loginCarousel": {
                    "text": {
                        "buyProductText": "Compre productos seleccionados en su tienda local. ¡No se preocupe, nosotros pagamos!",
                        "cashInText": "Pruébelos y cuéntenos qué piensa. Gane dinero y premios exclusivos de grandes degustaciones. ",
                        "discoverProductText": "Regístrese para probar productos en sus categorías preferidas. Cuéntenos acerca de usted y encontraremos las mejores selecciones para usted.",
                        "welcomeText": "Tenga una influencia en los productos alimenticios del mañana degustando los  mejores productos hoy. ¡Gane dinero y premios geniales!"
                    },
                    "titles": {
                        "buyProduct": "",
                        "cashIn": "",
                        "discoverProduct": "",
                        "welcome": ""
                    }
                },
                "loginToRole": {
                    "backBtn": "",
                    "styledButton": "",
                    "styledButtonOperator": "",
                    "styledButtonTaster": "",
                    "text": ""
                },
                "newPassword": {
                    "subTitle": "",
                    "title": ""
                },
                "requestAccount": {
                    "subTitle": "",
                    "title": ""
                },
                "requestSubmitted": {
                    "subTitle": "",
                    "title": ""
                }
            },
            "ongoingSurveysSection": {
                "title": ""
            },
            "operator": {
                "menu": {
                    "dashboard": "Tablero",
                    "organizations": "",
                    "privacyPolicy": "",
                    "qr-codes": "",
                    "surveys": "",
                    "termsOfUse": "Términos de Uso",
                    "users": ""
                }
            },
            "operatorCreateBasics": {
                "title": ""
            },
            "operatorCreateEmailSettings": {
                "title": ""
            },
            "operatorCreatePayments": {
                "title": ""
            },
            "operatorCreateSettings": {
                "title": ""
            },
            "operatorCreateSurveyLinkedSurveys": {
                "label": "",
                "tabs": {
                    "all": "",
                    "selected": ""
                },
                "title": ""
            },
            "OperatorCreateSurveyProducts": {
                "title": ""
            },
            "OperatorCreateSurveyQuestions": {
                "title": ""
            },
            "operatorCreateTastingNotes": {
                "title": ""
            },
            "paidSurveysSection": {
                "title": ""
            },
            "personalInfo": {
                "dobLabel": "",
                "firstnameLabel": "",
                "firstnamePlaceholder": "",
                "genderLabel": "",
                "genderPlaceholder": "",
                "languagesLabel": "",
                "languagesPlaceholder": "",
                "lastnameLabel": "",
                "lastnamePlaceholder": ""
            },
            "pointsSurveySection": {
                "title": ""
            },
            "taster": {
                "promt": "",
                "title": ""
            },
            "welcomeForm": {
                "confirmLabel": "",
                "confirmPlaceholder": "",
                "emailLabel": "",
                "emailPlaceholder": "",
                "passwordLabel": "",
                "passwordPlceholder": ""
            }
        },
        "paymentDetails": {
            "error": "",
            "success": ""
        },
        "personalDetails": {
            "error": "",
            "success": ""
        },
        "previewSurveyDraft": {
            "buttonText": ""
        },
        "privacy": {
            "error": ""
        },
        "productsCreateList": {
            "alertModalDescription": "",
            "alertModalOkText": "",
            "alertModalTitle": ""
        },
        "profileLayout": {
            "additionalInfo": "",
            "changePassword": "Cambiar contraseña",
            "paymentDetails": "",
            "personalDetails": "",
            "privacy": "Privacidad"
        },
        "publishEditedSurvey": {
            "errorMessage": "",
            "loadingText": "",
            "publishButton": "",
            "successMessage": ""
        },
        "publishSurvey": {
            "errorMessage": "",
            "loadingText": "",
            "publishButton": "",
            "successMessage": ""
        },
        "publishSurveyDraft": {
            "errorMessage": "",
            "loadingText": "",
            "publishButton": "",
            "successMessage": ""
        },
        "questionCreationCardBody": {
            "choose-one": {
                "other": "Otros"
            },
            "OptionsSection": {
                "includeOthers": ""
            }
        },
        "questionCreationCardHeader": {
            "description": "",
            "okText": "",
            "title": ""
        },
        "questionsList": {
            "skipToOptions": {
                "finish": "",
                "reject": "",
                "removeSkip": ""
            }
        },
        "requestAccountForm": {
            "code": "Se requiere el código telefónico de su país",
            "companyName": "Este campo es obligatorio",
            "emailRequired": "Se requiere correo electrónico",
            "emailValid": "No es un correo electrónico válido",
            "firstName": "Se requiere su nombre",
            "lastName": "Se requiere su nombre",
            "number": "Se requiere su número de teléfono"
        },
        "saveDraftSurvey": {
            "errorMessage": "",
            "loadingText": "",
            "publishButton": "",
            "successMessage": "",
            "surveyInitialState": ""
        },
        "surveyBasicInfoForm": {
            "alert": {
                "description": "",
                "okText": "",
                "title": ""
            },
            "allowedUsers": "",
            "authorizationType": "",
            "continueButton": "",
            "forceTasterAccount": "",
            "instruction": "",
            "instructionSteps": "Pasos de instrucción",
            "minimumNumber": "",
            "name": "",
            "nextButton": "",
            "referralAmount": "",
            "rejection": "",
            "requireRecaptcha": "",
            "screening": "",
            "securitySettings": "",
            "selectLanguage": "",
            "skipButton": "",
            "startSurveyButton": "",
            "takeSurveyMultipleTimes": "",
            "tastingSettings": "",
            "thankYou": "",
            "uniqueName": "",
            "uniqueNameExists": ""
        },
        "surveyList": {
            "completed": ""
        },
        "surveyLogIn": {
            "access": "",
            "accessLogin": "Si tiene acceso a esta encuesta, inicie sesión primero.",
            "askForAccount": "Para continuar con esta degustación, debe crear una cuenta. Ingrese la contraseña deseada y seleccione su país.",
            "askForEmail": "Ingrese su correo electrónico para continuar.",
            "loginText": "<p>¡Bienvenido a la degustación!<\/p> \n<p>Ingrese su correo electrónico para continuar.<\/p> \n<p>Si abandona la degustación antes de completarla, puede continuar donde la dejó ingresando su correo electrónico en la página de inicio.<\/p>",
            "loginTo": "Iniciar sesión en",
            "nextTimeDetails": "Si deja la degustación antes de completarla, puede continuar donde la dejó ingresando su correo electrónico en la página de inicio.",
            "notARobot": "Confirme que no es un robot para poder comenzar.",
            "notSelectedToParticipate": "No se encuentra entre los usuarios seleccionados para participar en esta encuesta.",
            "pauseText": "<p style='text-align: left;'><strong>Gracias por su interés.<\/strong><\/p><p style='text-align: left;'><strong>Este estudio ya ha finalizado.<\/strong><\/p><p style='text-align: left;'><strong>También puede escribir a support@flavorwiki.com por cualquier otra consulta.<\/strong><\/p><br><p style='text-align: left;'><strong>Gracias,<\/strong><\/p><p style='text-align: left;'><strong>The FlavorWiki Team.<\/strong><\/p>",
            "pressToStart": "Presione el botón de abajo para comenzar.",
            "surveyAvailable": "Esta encuesta solo está disponible para usuarios específicos.",
            "surveyExpired": "Gracias por su interés en este estudio de mercado. Su tiempo para completar la degustación ha expirado.",
            "surveySuspended.line1": "Gracias por su interés en este estudio de mercado.",
            "surveySuspended.line2": "El estudio ya ha terminado.",
            "surveySuspended.line3": "También puede contactar a support@flavorwiki.com si tiene alguna otra pregunta.",
            "surveySuspended.line4": "Gracias,",
            "surveySuspended.line5": "El equipo de FlavorWiki",
            "welcome": "¡Bienvenido a la degustación!"
        },
        "surveySharing": {
            "copiedMessage": "Enlace copiado al portapapeles.",
            "shareTextFirst": "¡Comparta esta degustación y gane {{amount}} por cada amigo que recomiende y la complete!",
            "shareTextLast": "para copiar su enlace para compartir.",
            "shareTextMiddle": "Haga clic aquí para copiar su enlace para compartir."
        },
        "surveyStats": {
            "editOperatorLayout": "",
            "editTasterLayout": "",
            "fetchError": {
                "description": "",
                "message": ""
            },
            "generateReport": {
                "text": ""
            },
            "invalidError": {
                "description": "",
                "message": ""
            },
            "otherFilters": {
                "buttonText": "",
                "filterText": "",
                "noFilter": "",
                "resetText": "",
                "selectProductsFirst": "",
                "title": ""
            },
            "productsTab": {
                "backToProductSelection": "",
                "buttonText": "",
                "maxNumberError": "Debe seleccionar un mínimo de {{minNumber}} producto(s) y un máximo de {{maxNumber}}. Actualmente tiene {{currentNumber}} producto(s) seleccionado(s).",
                "title": ""
            },
            "validation": {
                "required": "",
                "typeError": ""
            }
        },
        "updateSurvey": {
            "buttonText": "",
            "errorMessage": "",
            "successMessage": "",
            "updatingText": ""
        },
        "updateSurveyDraft": {
            "buttonText": "",
            "errorMessage": "",
            "successMessage": "",
            "updatingText": ""
        },
        "uploadProductPicture": {
            "label": "",
            "limit": ""
        },
        "userProfile": {
            "mainTitle": "Mi perfil",
            "messages": {
                "password": {
                    "error": "La contraseña actual no es correcta",
                    "success": "La contraseña se actualizó correctamente"
                }
            },
            "tabs": {
                "additional": "",
                "password": "Cambiar contraseña",
                "payment": "",
                "personal": "Datos personales",
                "privacy": "Privacidad"
            },
            "validations": {
                "password": {
                    "confirmNewPassword": {
                        "required": "Se requiere confirmación de la contraseña",
                        "shouldMatch": "La nueva contraseña no coincide"
                    },
                    "currentPassword": {
                        "minChars": "La contraseña debe tener al menos 8 caracteres",
                        "required": "Se requiere la contraseña actual",
                        "sameAsBefore": "La nueva contraseña debe ser diferente de la actual"
                    },
                    "newPassword": {
                        "minChars": "La nueva contraseña debe tener al menos 8 caracteres",
                        "required": "Se requiere una nueva contraseña"
                    }
                }
            }
        },
        "usersListContainer": {
            "added": "",
            "alertModalDescription": "",
            "alertModalokText": "",
            "alertModalTitle": "",
            "deleted": "",
            "updated": ""
        },
        "useSurveyValidate": {
            "showOnlyMandatoryQuestionErrors": "Se requiere al menos una pregunta.",
            "showProductsErrors": "",
            "showQuestionsErrors": ""
        }
    },
    "countAnswer": "{{count}} respuesta",
    "countAnswer_plural": "{{count}} respuestas",
    "countProduct": "{{count}} producto",
    "countProduct_plural": "{{count}} productos",
    "defaultValues": {
        "customButtons": {
            "continue": "Continuar",
            "next": "Siguiente",
            "skip": "Saltar",
            "start": "Empezar"
        },
        "customizeSharingMessage": "¡Comparte esta degustación y gana {{amount}} por cada amigo que recomiendas que lo complete!",
        "instructionSteps": [
            "Asegúrese de tener todos los productos seleccionados antes de comenzar la degustación.",
            "Encuentra un lugar tranquilo.",
            "Se le darán instrucciones adicionales durante la degustación.",
            "Cuando esté listo, haga clic en 'Iniciar degustación' a continuación."
        ],
        "instructionsText": "<p> <strong> <span style=\"font-size: 20pt;\"> Bienvenido a la degustación! <\/span> <\/strong> \n <br \/> Gracias por aceptar participar en esta degustación. Este cuestionario le preguntará sobre los productos que consume actualmente y nos ayudará a relacionarlo mejor con los productos para comprar y probar. Tardará entre 2 y 3 minutos. \n <br \/> No hay respuestas correctas o incorrectas, así que responda honestamente. \n <br \/> Si tiene alguna pregunta, utilice el cuadro de soporte a continuación o envíe un correo electrónico a: support@flavorwiki.com \n <br \/> <strong> Feliz degustación! El equipo de FlavorWiki <\/strong> <\/p>",
        "loginText": "<p style='text-align: center;'> <strong> Bienvenido a la degustación! <\/strong> <\/p> <p style='text-align: center;'> <strong> Ingrese su correo electrónico para <\/strong> continuar. <\/p> <p style='text-align: center;'> <strong> Si deja la degustación antes de completarla, puede continuar donde la dejó ingresando su correo electrónico en la página de inicio. <\/strong> <\/p>",
        "pauseText": "<p style='text-align: left;'><strong>Gracias por su interés en este estudio de mercado.<\/strong><\/p><p style='text-align: left;'><strong>Este estudio ya ha finalizado.<\/strong><\/p><p style='text-align: left;'><strong>También puede contactar a support@flavorwiki.com con cualquier otra pregunta.<\/strong><\/p><br><p style='text-align: left;'><strong>Gracias,<\/strong><\/p><p style='text-align: left;'><strong>El equipo FlavorWiki.<\/strong><\/p>\n",
        "rejectionText": "<p><strong><span style=\"font-size: 20pt;\" data-mce-style=\"font-size: 20pt;\">Lo sentimos mucho... ¡No esta vez!<\/span><\/strong><\/p>\n<p>Lo sentimos, pero estamos buscando un perfil diferente al stuyo para esta degustación.<br\/>Pero no se desanime, consideraremos su participación en nuestras futuras degustaciones.<\/p>\n<p>Si tiene alguna pregunta, utilice el cuadro de ayuda a continuación o envíe un correo electrónico:<\/p>\n<p><a href=\"mailto:support@flavorwiki.com\">support@flavorwiki.com<\/a><\/p>\n<p>¡Feliz degustación!<\/p>\n<p>El equipo FlavorWiki<\/p>",
        "screeningText": "<p><strong><span style=\"font-size: 20pt;\">Felicitaciones<\/span><\/strong><\/p>\n<p>Ha calificado para la degustación. Haga clic en el botón de abajo para continuar.<br\/>\nEn breve también recibirá un correo electrónico con este enlace a modo de recordatorio.<\/p>\n<p>Si tiene alguna pregunta, utilice el cuadro de ayuda a continuación o envíe un correo electrónico:<\/p>\n<p><a href=\"mailto:support@flavorwiki.com\">support@flavorwiki.com<\/a><\/p>\n<p>¡Feliz degustación!<\/p>\n<p>El equipo FlavorWiki<\/p>",
        "thankYouText": "<p> <strong> <span style=\"font-size: 20pt;\"> Gracias por su participación! <\/span> <\/strong> \n <br \/> Si disfrutó la degustación, por favor recomiéndanos o escriba una reseña en nuestra página de Facebook. \n <br \/> Si tiene alguna pregunta, utilice el cuadro de soporte a continuación o envíe un correo electrónico a: support@flavorwiki.com \n <br \/> <strong> Feliz degustación! El equipo de FlavorWiki <\/strong> <\/p>"
    },
    "dontHaveAccount": "¿No tiene una cuenta?",
    "dropDownOptions": {
        "choose-date": "",
        "choose-multiple": "",
        "choose-one": "",
        "choose-payment": "",
        "choose-product": "",
        "dropdown": "",
        "email": "",
        "info": "",
        "location": "",
        "numeric": "",
        "open-answer": "",
        "paired-questions": "",
        "paypal-email": "",
        "select-and-justify": "",
        "slider": "",
        "time-stamp": "",
        "upload-picture": "",
        "vertical-rating": ""
    },
    "email": {
        "rejected": "Gracias por participar en esta encuesta.<br><br>\n Si comparte el enlace a continuación con sus amigos, puede ganar una <strong>{{SSHARING_REWARD}}<\/strong> EXTRA en efectivo por cada amigo que recomiende que complete la degustación.<br><br>\n {{SHARING_LINK}}<br><br>\n Si tiene alguna pregunta, envíe un correo electrónico a <a href=\"mailto:support@flavorwiki.com\">support@flavorwiki.com<\/a>.<br><br> \n ¡Feliz degustación! <br> \n El equipo de FlavorWiki",
        "surveyCompleted": {
            "html": "",
            "subject": "",
            "text": ""
        },
        "surveyRejected": {
            "html": "",
            "subject": "",
            "text": ""
        },
        "surveyWaiting": {
            "html": "",
            "subject": "",
            "text": ""
        }
    },
    "emailUs": "Si tiene alguna pregunta, utilice el cuadro de ayuda a continuación o envíe un correo electrónico",
    "errors": {
        "ANALYSIS_ERROR": "",
        "E_EXPORT_DEFAULT": "",
        "E_ORG_UNIQUE": "",
        "E_QR_CODE_CREATE": "",
        "E_QR_CODE_SEARCH": "",
        "E_QR_CODE_UNIQUE": "",
        "E_QR_CODE_UPDATE": "",
        "E_REQUEST_ACCOUNT": "Error al solicitar una nueva cuenta",
        "E_UNIQUE": "",
        "E_UNIQUE_USER": "",
        "E_USER_IS_EXISTED": "",
        "FILE_NOT_FOUND": "El enlace compartido no es válido.",
        "FILE_UNAUTHORIZED": "",
        "inputValidCountry": "",
        "inputValidEmail": "Introduzca un correo electrónico válido",
        "inputValidPassword": "",
        "NO_APP_URL": "",
        "NO_ORGANIZATION": "",
        "notAuthQrCode": "",
        "notAuthSurvey": "",
        "ORG_DEFAULT_CREATE": "",
        "ORG_DEFAULT_UPDATE": "",
        "pictureTooLarge": "",
        "privacyUpdateError": "",
        "submitAnswerFailed": "",
        "UNAUTHORIZED": "No autorizado",
        "update": "",
        "updatePaypallFailed": "Algo salió mal. Por favor, vuelva a intentarlo.",
        "uploadPictureFailed": "Error al cargar, seleccione una imagen e intente nuevamente.",
        "uploadProductPictureFailed": "Error al cargar, seleccione una imagen e intente nuevamente."
    },
    "forgotPassword": "Olvidé la contraseña",
    "happyTasting": "¡Feliz degustación!",
    "languages": {
        "chinese": "",
        "deutsch": "",
        "english": "",
        "french": "",
        "italian": "",
        "japanese": "",
        "korean": "",
        "polish": "",
        "portuguese": "",
        "russian": "",
        "spanish": "",
        "turkish": ""
    },
    "page": {
        "surveyList": {
            "completed": "",
            "finsihed": "",
            "rejected": ""
        }
    },
    "pdfLayoutEditor": {
        "addPage": {
            "tooltip": ""
        },
        "discard": {
            "description": "",
            "ok": "",
            "title": ""
        },
        "loadingData": "",
        "messages": {
            "downloadError": "",
            "saveError": "",
            "saveSuccess": ""
        },
        "pageText": "",
        "paperSize": "",
        "removePage": {
            "disabledTooltip": "",
            "tooltip": ""
        },
        "rendering": "",
        "saveAsTemplate": "",
        "showLayoutBorder": "",
        "title": {
            "operator": "",
            "taster": ""
        },
        "zoom": ""
    },
    "placeholders": {
        "addDescriptor": "Introduzca su propio descriptor",
        "addOpinion": "Agregue su opinión aquí...",
        "addOption": "Agregue su propia opción",
        "analyticsValue": "",
        "availableInCountry": "",
        "bankAccountName": "",
        "bankAccountNumber": "",
        "bankBIC": "",
        "bankDescription": "",
        "bankIBAN": "",
        "bankName": "",
        "category": "Seleccione una categoría",
        "chartsSettings": {
            "absolutePercentageValues": "",
            "barsSortOrder": "",
            "howManyDecimals": "",
            "howManyDecimals_axis": "",
            "isDataTableShown_format": "",
            "outlineWidth": ""
        },
        "companyName": "El nombre de su empresa",
        "confirmPassword": "Confirme la nueva contraseña",
        "country": "País",
        "currentPassword": "Ingrese la contraseña actual",
        "email": "Ingrese su correo electrónico",
        "emailAddress": "Dirección de correo electrónico",
        "emailToReach": "",
        "firstName": "",
        "fullName": "",
        "gender": "",
        "inputOption": "Seleccione su propia opción",
        "jumpTo": "",
        "language": "",
        "lastName": "",
        "MarkLabel": "",
        "markPosition": "",
        "maximumScaleValue": "",
        "mininumScaleValue": "",
        "nationality": "",
        "newPassword": "Ingrese una nueva contraseña",
        "password": "Contraseña",
        "paypalEmail": "",
        "phoneNumber": "",
        "questionAnalytics": "",
        "questionChartType": "",
        "questionJumpTo": "",
        "questionLabel": "",
        "questionMaximumScale": "",
        "questionMinimumScale": "",
        "questionRangeMax": "",
        "questionRangeMin": "",
        "questionSectionSelect": "",
        "questionType": "",
        "search": "",
        "selectAnswers": "Seleccionar respuestas",
        "selectBrand": "Seleccione una marca",
        "selectConditionType": "Seleccionar tipo de condición",
        "selectOne": "Seleccione una opción",
        "selectOrganization": "",
        "selectType": "",
        "startingFrom": "",
        "typeHere": "Escriba aquí...",
        "upTo": "",
        "user": "",
        "username": "Nombre de usuario",
        "writeAnswer": "Escriba su respuesta aquí"
    },
    "profileLink": "Perfil",
    "requestAccount": "Solicitar un",
    "requestAccountOr": "o regístrese para ser un",
    "requestOneButton": "Solicitar uno",
    "requestOperatorAccount": "Cuenta de usuario",
    "requestTasterAccount": "Degustador",
    "settings": {
        "charts": {
            "alertModalDescription": "",
            "alertModalTitle": "",
            "cancel": "",
            "error": "",
            "filterByQuestionType": "",
            "globalSettingsTitle": "",
            "optionLabels": {
                "absolutePercentageValues": "",
                "barsSortOrder": "",
                "colorPicker": "",
                "dataformat": {
                    "abs": "",
                    "perc": "",
                    "perc_abs": "",
                    "perc_abs_prod": "",
                    "perc_abs_teh": "",
                    "valueType": ""
                },
                "generalColorPicker": "",
                "groupLabels": "",
                "hasOutline": "",
                "howManyDecimals": "",
                "isCountProGroupShown": "",
                "isCountProLabelShown": "",
                "isDataTableShown": "",
                "isDataTableShown_format": "",
                "isMeanProLabelsShown": "",
                "isProductLabelsSwapped": "",
                "isStackedLabelsReversed": "",
                "isStackedValuesShown": "",
                "isStatisticsTableShown": "",
                "isTotalRespondentsShown": "",
                "mapColorPicker": "",
                "outlineColor": "",
                "outlineWidth": "",
                "percentageGrouping": {
                    "inner": "",
                    "outer": ""
                },
                "percentageGroupingLabel": "",
                "sortOrder": {
                    "nameAsc": "",
                    "nameDesc": "",
                    "valueAsc": "",
                    "valueDesc": ""
                },
                "timestampColorPicker": ""
            },
            "resetDefaults": "",
            "set": "",
            "setGlobal": "",
            "setSimilar": "",
            "settingsPopupTitle": "",
            "success": ""
        }
    },
    "signIn": "Iniciar sesión",
    "signOut": "Cerrar sesión",
    "survey": {
        "already_taken": "Gracias por su interés. Ya respondió a esta encuesta.",
        "surveysListing": "Listado de encuestas",
        "termsOfUse": "Términos de Uso"
    },
    "surveyAnalysis": {
        "exitReport": {
            "desc": "",
            "ok": "",
            "title": ""
        },
        "filter": {
            "back": "",
            "next": ""
        },
        "settings": {
            "analysisTypes": "",
            "next": "",
            "question": "",
            "referenceQuestion": ""
        },
        "tabs": {
            "filter": "",
            "report": "",
            "settings": ""
        }
    },
    "surveyCreation": {
        "mandatoryQuestion": ""
    },
    "surveyEmailSettings": {
        "enabledEmailTypes": {
            "survey-completed": "",
            "survey-rejected": "",
            "survey-waiting": ""
        },
        "enabledEmailTypesCaption": ""
    },
    "surveyPayments": {
        "active": "",
        "paymentTypes": {
            "giftCard": "",
            "paypal": ""
        }
    },
    "surveySettings": {
        "autoAdvanceSettings": {
            "active": "",
            "autoAdvance": "",
            "caption": "",
            "debounce": "",
            "hideNextButton": "",
            "nextButton": ""
        },
        "pdfFooterData": {
            "label": ""
        },
        "pdfFooterSettings": {
            "note": ""
        },
        "screenerOnly": {
            "active": "",
            "title": ""
        },
        "sharingButtons": {
            "label": "",
            "yes": ""
        },
        "showGeneratePdf": {
            "active": "Sí",
            "title": "Habilitar la presentación de informes por parte del catador (PDF)"
        },
        "tastingNotes": {
            "country": "",
            "customer": "",
            "dateOfTasting": "",
            "otherInfo": "",
            "tastingId": "",
            "tastingLeader": ""
        },
        "valdatedChartData": {
            "label": "",
            "yes": ""
        },
        "validations": {
            "debounce": {
                "max": "",
                "min": "",
                "required": "",
                "step": ""
            }
        }
    },
    "theFlavorWikiTeam": "El equipo de FlavorWiki",
    "tooltips": {
        "cloneSurveyButton": "",
        "copyQr": "",
        "copySurveyUrlButton": "",
        "debounceTooltip": "",
        "deletePicture": "",
        "deleteQr": "",
        "deleteSurveyButton": "",
        "downloadQr": "",
        "duplicateQuestion": "",
        "editDraftButton": "",
        "editQr": "",
        "editSurveyAlertFullOption": "",
        "editSurveyAlertStrictOption": "",
        "editSurveyButton": "",
        "exportGiftCardIncentivesButton": "",
        "exportGiftCardSharesButton": "",
        "exportProductIncentivesButton": "",
        "exportSharingButton": "",
        "exportSurveyButton": "",
        "exportSurveyPhotosButton": "",
        "forms": {
            "uniqueNameTooltip": {
                "add": "",
                "edit": ""
            }
        },
        "funnelActions": "",
        "hideNextButtonTooltip": "",
        "imageDisplayOptionsHelper": "",
        "importGiftCardIncentives": "",
        "importGiftCardShares": "",
        "importProductIncentives": "",
        "importSurveyShares": "",
        "invalidSurveyPhotos": "",
        "likingQuestionRestricted": "",
        "moreActions": "",
        "newProduct": "",
        "newQuestion": "",
        "notProcessedSurveyPhotos": "",
        "operatorSurveyDetailBar": {
            "after": "",
            "basics": "",
            "before": "",
            "linkedSurveys": "",
            "payments": "",
            "products": "",
            "screening": "",
            "settings": "",
            "tasting": "",
            "tastingNotes": ""
        },
        "pauseSurvey": "",
        "previewDraft": "",
        "product": {
            "brand": "",
            "canNotDelete": "",
            "isAvailable": "",
            "name": "",
            "picture": "",
            "reward": ""
        },
        "productDisplayDragAndDrop": "",
        "productDisplayOptions": "",
        "publishSurvey": "",
        "questionCreation": {
            "maxProductsToTaste": "",
            "minProductsToTaste": "",
            "prompt": "",
            "secondaryPrompt": ""
        },
        "questionHeader": {
            "choose-payment": "",
            "choose-product": "",
            "paypal-email": ""
        },
        "questionType": {
            "choose-date": "",
            "choose-multiple": "",
            "choose-one": "",
            "dropdown": "",
            "email": "",
            "info": "",
            "location": "",
            "numeric": "",
            "open-answer": "",
            "paired-questions": "",
            "select-and-justify": "",
            "slider": "",
            "time-stamp": "",
            "upload-picture": "",
            "vertical-rating": ""
        },
        "removeQuestion": "",
        "resumeSurvey": "",
        "saveDraft": "",
        "saveDraftSurvey": "",
        "screenerOnly": "",
        "ShareSurveyStats": "",
        "showGeneratePdf": "Permite a su catador descargar los gráficos en formato PDF.",
        "stats": {
            "addColor": "",
            "reset": "",
            "setGlobal": ""
        },
        "strictOptions": "",
        "surveyBasicInfoForm": {
            "authorizationType": "",
            "continueButton": "",
            "country": "",
            "customizeSharing": "",
            "instruction": "",
            "instructionSteps": "",
            "loginText": "",
            "name": "",
            "nextButton": "",
            "pauseText": "",
            "referralAmount": "",
            "rejection": "",
            "screening": "",
            "securitySettings": "",
            "selectLanguage": "",
            "skipButton": "",
            "startSurveyButton": "",
            "staticUniqueName": "",
            "thankYou": "",
            "uniqueName": ""
        },
        "surveyCharts": "",
        "updateSurvey": "",
        "updateSurveyDraft": "",
        "validSurveyPhotos": ""
    },
    "tooltips.likingQuestionRestricted": "",
    "validation": {
        "analyticsValue": "",
        "analyticsValueIsPositive": "",
        "analyticsValueWithoutSpaces": "",
        "basics": {
            "allowedDaysToFillTheTasting": {
                "integer": "",
                "max": "",
                "min": "",
                "required": ""
            },
            "customButtons": {
                "continueEmptySpaces": "",
                "continueRequired": "",
                "nextEmptySpaces": "",
                "nextRequired": "",
                "skipEmptySpaces": "",
                "skipRequired": "",
                "startEmptySpaces": "",
                "startRequired": ""
            },
            "excluseiveTasters": {
                "email": "",
                "required": "",
                "withoutSpaces": ""
            },
            "instruction": "La instrucción no debe estar compuesta únicamente por espacios en blanco",
            "instructionRequired": "Se requiere instrucción",
            "instructionWithoutSpaces": "La instrucción no debe comenzar con espacios en blanco",
            "maxProductStatCount": {
                "isMax": "",
                "max": "",
                "min": "",
                "required": ""
            },
            "name": {
                "required": "",
                "withoutSpaces": ""
            },
            "referralAmount": {
                "isNumber": "",
                "max": "",
                "min": "",
                "required": ""
            },
            "uniquName": {
                "required": "",
                "restrict": "",
                "withoutSpaces": ""
            }
        },
        "birthday": {
            "required": ""
        },
        "chartTitle": {
            "required": "",
            "whitespace": ""
        },
        "chartTopic": {
            "required": "",
            "whitespace": ""
        },
        "chartType": {
            "minProductsForCorrelation": "",
            "required": "",
            "wrongChartType": ""
        },
        "chooseProduct": {
            "equalOrLess": "",
            "greaterThan": "",
            "maxProducts": {
                "integer": "",
                "required": ""
            },
            "minProducts": {
                "integer": "",
                "required": ""
            }
        },
        "confirmPassword": {
            "required": "Ingrese la nueva contraseña"
        },
        "currentPassword": {
            "required": "Ingrese la contraseña actual"
        },
        "dropdown": {
            "minim": "",
            "options": {
                "analytics": {
                    "required": ""
                },
                "label": {
                    "required": ""
                }
            },
            "prompt": "",
            "uniqueOptions": ""
        },
        "email": {
            "email": "",
            "required": ""
        },
        "emailTemplate": {
            "html": {
                "required": ""
            },
            "subject": {
                "required": ""
            },
            "text": {
                "required": ""
            }
        },
        "firstname": {
            "required": ""
        },
        "info": {
            "prompt": "",
            "secondaryPrompt": ""
        },
        "integer": "",
        "label": "",
        "labelWithoutSpaces": "",
        "lastname": {
            "required": ""
        },
        "location": {
            "region": ""
        },
        "multiple": {
            "maxAnswerValues": {
                "lessThanTotal": "",
                "min": "",
                "moreThanMin": "",
                "typeError": ""
            },
            "minAnswerValues": {
                "lessThanMax": "",
                "lessThanTotal": "",
                "min": "",
                "typeError": ""
            },
            "minim": "",
            "options": {
                "analytics": {
                    "required": ""
                },
                "label": {
                    "required": ""
                }
            },
            "uniqueOptions": ""
        },
        "newPassword": {
            "required": "¡Confirme su contraseña!"
        },
        "numeric": {
            "greaterOrEqual": "El valor debe ser mayor o igual a {{min}}",
            "integer": "El valor debe ser un número entero",
            "lessOrEqual": "El valor debe ser menor o igual a {{max}}",
            "maxNumber": "",
            "minNumber": "",
            "moreThan": "",
            "questionRequired": ""
        },
        "one": {
            "minim": "",
            "options": {
                "analytics": {
                    "required": ""
                },
                "label": {
                    "required": ""
                }
            },
            "uniqueOptions": ""
        },
        "organizationForm": {
            "name": {
                "maxLength": "",
                "required": "",
                "withoutSpaces": ""
            },
            "uniqueName": {
                "matches": "",
                "required": ""
            }
        },
        "paired": {
            "likingQuestion": "",
            "options": {
                "integer": "",
                "max": "",
                "min": "",
                "required": ""
            },
            "pairs": {
                "min": "",
                "unique": ""
            },
            "profileTitle": {
                "required": "",
                "string": ""
            }
        },
        "product": {
            "reward": ""
        },
        "products": {
            "brand": "",
            "brandWithoutSpaces": "",
            "isAvailable": "",
            "name": "",
            "nameWithoutSpaces": "",
            "rewardMin": "",
            "rewardNumber": "",
            "rewardWithoutSpaces": ""
        },
        "profileTitle": {
            "required": "",
            "string": "",
            "withoutSpaces": ""
        },
        "prompt": "",
        "promptWithoutSpaces": "",
        "questionCreation": {
            "questionType": {
                "required": ""
            }
        },
        "required": "",
        "requiredField": "",
        "secondaryPrompt": "",
        "secondaryPromptWithoutSpaces": "",
        "selectAndJustify": {
            "minim": "",
            "options": {
                "analytics": {
                    "required": ""
                },
                "label": {
                    "required": ""
                }
            },
            "prompt": "",
            "secondaryPrompt": "",
            "uniqueOptions": ""
        },
        "slider": {
            "promptString": "",
            "range": {
                "marks": {
                    "label": {
                        "required": "",
                        "string": ""
                    },
                    "unique": "",
                    "value": {
                        "lessThan": "",
                        "moreThan": "",
                        "number": "",
                        "required": ""
                    },
                    "withoutSpaces": ""
                },
                "max": {
                    "digits": "",
                    "greaterThan": "",
                    "number": "",
                    "required": ""
                },
                "min": {
                    "digits": "",
                    "greaterThan": "",
                    "lessThan": "",
                    "number": "",
                    "required": ""
                },
                "sliders": {
                    "atLeast": "",
                    "required": "",
                    "unique": "",
                    "withoutSpaces": ""
                },
                "step": {
                    "digits": "",
                    "greaterThan": "",
                    "lessThan": "",
                    "number": "",
                    "required": "",
                    "submultiple": ""
                }
            },
            "secondaryPrompt": ""
        },
        "surveyAnalysis": {
            "analysisTypes": {
                "minRequired": ""
            },
            "filterProducts": {
                "minRequired": ""
            },
            "filterQuestions": {
                "error": "",
                "minRequired": ""
            },
            "question": {
                "required": ""
            },
            "referenceQuestion": {
                "required": ""
            }
        },
        "surveyBasicInfoForm": {
            "name": {
                "required": ""
            }
        },
        "tasterName": {
            "digitsOnly": "",
            "lettersDigitsOnly": "",
            "maxLength": "",
            "minLength": "",
            "noSpaces": "",
            "settings": {
                "maxLength": {
                    "min": "",
                    "moreThanMin": "",
                    "typeError": ""
                },
                "minLength": {
                    "lessThanMax": "",
                    "min": "",
                    "typeError": ""
                }
            }
        },
        "userForm": {
            "email": {
                "maxLength": "",
                "required": "Se requiere correo electrónico"
            },
            "fullName": {
                "maxLength": "",
                "nameWithoutSpaces": "El nombre completo no debe comenzar con espacios en blanco",
                "required": "Se requiere el nombre completo"
            },
            "organization": {
                "typeError": ""
            }
        },
        "vertical": {
            "range": {
                "labels": {
                    "canBeUsed": "",
                    "required": ""
                },
                "max": {
                    "greaterThanMin": "",
                    "integer": "",
                    "moreThan": ""
                },
                "min": {
                    "greaterThan0": "",
                    "integer": "",
                    "lessThan": "",
                    "moreThan": ""
                },
                "skipMax": {
                    "integer": "",
                    "lessThan": "",
                    "moreThan": "",
                    "number": ""
                },
                "skipMin": {
                    "integer": "",
                    "lessThan": "",
                    "moreThan": "",
                    "number": ""
                }
            }
        }
    }
}