// Jest Snapshot v1, https://goo.gl/fbAQLP

exports[`NewPassword should render NewPassword 1`] = `
<ApolloProvider
  client={MockedClient {}}
>
  <Router
    history={
      Object {
        "createHref": [Function],
        "listen": [Function],
        "location": Object {
          "pathname": "",
        },
        "push": [Function],
      }
    }
  >
    <withRouter(NewPassword)
      location={
        Object {
          "email": "test@flower-wiki.com",
          "token": "token",
        }
      }
    >
      <Route>
        <NewPassword
          history={
            Object {
              "createHref": [Function],
              "listen": [Function],
              "location": Object {
                "pathname": "",
              },
              "push": [Function],
            }
          }
          location={
            Object {
              "pathname": "",
            }
          }
          match={
            Object {
              "isExact": false,
              "params": Object {},
              "path": "/",
              "url": "/",
            }
          }
        >
          <Title>
            <styled.p>
              <p
                className="sc-bdVaJa crHsrX"
              >
                containers.page.onboarding.newPassword.title
              </p>
            </styled.p>
          </Title>
          <SubTitle>
            <Styled(styled.span)>
              <styled.span
                className="sc-htpNat eUXImp"
              >
                <span
                  className="sc-htpNat eUXImp sc-bwzfXH kKRACt"
                >
                  containers.page.onboarding.newPassword.subTitle
                </span>
              </styled.span>
            </Styled(styled.span)>
          </SubTitle>
          <Component
            onSetNewPassword={[Function]}
          >
            <div />
          </Component>
          <TermsAndPrivacyFooter>
            <TermsAndPrivacyFooterComponent
              t={[Function]}
            >
              <styled.div
                isSurvey={false}
              >
                <div
                  className="sc-bxivhb edoxwl"
                >
                  <Link
                    replace={false}
                    target="_blank"
                    to="/terms-of-use"
                  >
                    <a
                      onClick={[Function]}
                      target="_blank"
                    >
                      survey.termsOfUse
                    </a>
                  </Link>
                </div>
              </styled.div>
            </TermsAndPrivacyFooterComponent>
          </TermsAndPrivacyFooter>
        </NewPassword>
      </Route>
    </withRouter(NewPassword)>
  </Router>
</ApolloProvider>
`;
