// Jest Snapshot v1, https://goo.gl/fbAQLP

exports[`Home should render Home 1`] = `
<AuthenticatedLayoutContainer
  withFooter={true}
>
  <CategoriesSection />
  <OngoingSurveysSection />
  <PaidSurveysSection />
  <PointsSurveysSection />
</AuthenticatedLayoutContainer>
`;
