// Jest Snapshot v1, https://goo.gl/fbAQLP

exports[`OperatorSurveyCreationTabBar should render OperatorSurveyCreationTabBar 1`] = `
<withRouter(OperatorSurveyDetailTabBar)
  actions={
    Array [
      <withRouter(PreviewSurveyDraft) />,
      <withRouter(UpdateSurveyDraft) />,
      <withRouter(PublishSurveyDraft) />,
    ]
  }
/>
`;
