// Jest Snapshot v1, https://goo.gl/fbAQLP

exports[`OperatorRoute should render OperatorRoute 1`] = `
<PrivateRoute
  authenticateAnalytics={true}
  authenticateOperator={true}
  authenticatePowerUser={true}
/>
`;
