// Jest Snapshot v1, https://goo.gl/fbAQLP

exports[`Overlay should render Overlay 1`] = `
<styled.div>
  <styled.span>
    3
  </styled.span>
  <Styled(styled.div)
    src="lock.svg"
  />
</styled.div>
`;
