// Jest Snapshot v1, https://goo.gl/fbAQLP

exports[`EditSurveyButton should render EditSurveyButton 1`] = `
<withRouter(EditSurveyButton)
  history={
    Object {
      "action": "POP",
      "block": [Function],
      "createHref": [Function],
      "go": [Function],
      "goBack": [Function],
      "goForward": [Function],
      "length": 1,
      "listen": [Function],
      "location": Object {
        "hash": "",
        "pathname": "/",
        "search": "",
        "state": undefined,
      },
      "push": [Function],
      "replace": [Function],
    }
  }
  surveyId={1}
  surveyState="status"
>
  <Route>
    <EditSurveyButton
      history={
        Object {
          "action": "POP",
          "block": [Function],
          "createHref": [Function],
          "go": [Function],
          "goBack": [Function],
          "goForward": [Function],
          "length": 1,
          "listen": [Function],
          "location": Object {
            "hash": "",
            "pathname": "/",
            "search": "",
            "state": undefined,
          },
          "push": [Function],
          "replace": [Function],
        }
      }
      location={
        Object {
          "hash": "",
          "pathname": "/",
          "search": "",
          "state": undefined,
        }
      }
      match={
        Object {
          "isExact": true,
          "params": Object {},
          "path": "/",
          "url": "/",
        }
      }
      surveyId={1}
      surveyState="status"
    >
      <IconButton
        onClick={[Function]}
        tooltip="Edit survey"
        type="edit"
      >
        <styled.div
          onClick={[Function]}
        >
          <div
            className="sc-bdVaJa lpoqCS"
            onClick={[Function]}
          >
            <Tooltip
              arrowPointAtCenter={false}
              autoAdjustOverflow={true}
              mouseEnterDelay={0.1}
              mouseLeaveDelay={0.1}
              placement="top"
              title="Edit survey"
              transitionName="zoom-big-fast"
            >
              <Tooltip
                align={Object {}}
                arrowContent={null}
                arrowPointAtCenter={false}
                autoAdjustOverflow={true}
                builtinPlacements={
                  Object {
                    "bottom": Object {
                      "ignoreShake": true,
                      "offset": Array [
                        0,
                        4,
                      ],
                      "overflow": Object {
                        "adjustX": 1,
                        "adjustY": 1,
                      },
                      "points": Array [
                        "tc",
                        "bc",
                      ],
                      "targetOffset": Array [
                        0,
                        0,
                      ],
                    },
                    "bottomLeft": Object {
                      "ignoreShake": true,
                      "offset": Array [
                        0,
                        4,
                      ],
                      "overflow": Object {
                        "adjustX": 1,
                        "adjustY": 1,
                      },
                      "points": Array [
                        "tl",
                        "bl",
                      ],
                      "targetOffset": Array [
                        0,
                        0,
                      ],
                    },
                    "bottomRight": Object {
                      "ignoreShake": true,
                      "offset": Array [
                        0,
                        4,
                      ],
                      "overflow": Object {
                        "adjustX": 1,
                        "adjustY": 1,
                      },
                      "points": Array [
                        "tr",
                        "br",
                      ],
                      "targetOffset": Array [
                        0,
                        0,
                      ],
                    },
                    "left": Object {
                      "ignoreShake": true,
                      "offset": Array [
                        -4,
                        0,
                      ],
                      "overflow": Object {
                        "adjustX": 1,
                        "adjustY": 1,
                      },
                      "points": Array [
                        "cr",
                        "cl",
                      ],
                      "targetOffset": Array [
                        0,
                        0,
                      ],
                    },
                    "leftBottom": Object {
                      "ignoreShake": true,
                      "offset": Array [
                        -4,
                        0,
                      ],
                      "overflow": Object {
                        "adjustX": 1,
                        "adjustY": 1,
                      },
                      "points": Array [
                        "br",
                        "bl",
                      ],
                      "targetOffset": Array [
                        0,
                        0,
                      ],
                    },
                    "leftTop": Object {
                      "ignoreShake": true,
                      "offset": Array [
                        -4,
                        0,
                      ],
                      "overflow": Object {
                        "adjustX": 1,
                        "adjustY": 1,
                      },
                      "points": Array [
                        "tr",
                        "tl",
                      ],
                      "targetOffset": Array [
                        0,
                        0,
                      ],
                    },
                    "right": Object {
                      "ignoreShake": true,
                      "offset": Array [
                        4,
                        0,
                      ],
                      "overflow": Object {
                        "adjustX": 1,
                        "adjustY": 1,
                      },
                      "points": Array [
                        "cl",
                        "cr",
                      ],
                      "targetOffset": Array [
                        0,
                        0,
                      ],
                    },
                    "rightBottom": Object {
                      "ignoreShake": true,
                      "offset": Array [
                        4,
                        0,
                      ],
                      "overflow": Object {
                        "adjustX": 1,
                        "adjustY": 1,
                      },
                      "points": Array [
                        "bl",
                        "br",
                      ],
                      "targetOffset": Array [
                        0,
                        0,
                      ],
                    },
                    "rightTop": Object {
                      "ignoreShake": true,
                      "offset": Array [
                        4,
                        0,
                      ],
                      "overflow": Object {
                        "adjustX": 1,
                        "adjustY": 1,
                      },
                      "points": Array [
                        "tl",
                        "tr",
                      ],
                      "targetOffset": Array [
                        0,
                        0,
                      ],
                    },
                    "top": Object {
                      "ignoreShake": true,
                      "offset": Array [
                        0,
                        -4,
                      ],
                      "overflow": Object {
                        "adjustX": 1,
                        "adjustY": 1,
                      },
                      "points": Array [
                        "bc",
                        "tc",
                      ],
                      "targetOffset": Array [
                        0,
                        0,
                      ],
                    },
                    "topLeft": Object {
                      "ignoreShake": true,
                      "offset": Array [
                        0,
                        -4,
                      ],
                      "overflow": Object {
                        "adjustX": 1,
                        "adjustY": 1,
                      },
                      "points": Array [
                        "bl",
                        "tl",
                      ],
                      "targetOffset": Array [
                        0,
                        0,
                      ],
                    },
                    "topRight": Object {
                      "ignoreShake": true,
                      "offset": Array [
                        0,
                        -4,
                      ],
                      "overflow": Object {
                        "adjustX": 1,
                        "adjustY": 1,
                      },
                      "points": Array [
                        "br",
                        "tr",
                      ],
                      "targetOffset": Array [
                        0,
                        0,
                      ],
                    },
                  }
                }
                destroyTooltipOnHide={false}
                mouseEnterDelay={0.1}
                mouseLeaveDelay={0.1}
                onPopupAlign={[Function]}
                onVisibleChange={[Function]}
                overlay="Edit survey"
                placement="top"
                prefixCls="ant-tooltip"
                title="Edit survey"
                transitionName="zoom-big-fast"
                trigger={
                  Array [
                    "hover",
                  ]
                }
                visible={false}
              >
                <Trigger
                  action={
                    Array [
                      "hover",
                    ]
                  }
                  afterPopupVisibleChange={[Function]}
                  arrowContent={null}
                  arrowPointAtCenter={false}
                  autoAdjustOverflow={true}
                  blurDelay={0.15}
                  builtinPlacements={
                    Object {
                      "bottom": Object {
                        "ignoreShake": true,
                        "offset": Array [
                          0,
                          4,
                        ],
                        "overflow": Object {
                          "adjustX": 1,
                          "adjustY": 1,
                        },
                        "points": Array [
                          "tc",
                          "bc",
                        ],
                        "targetOffset": Array [
                          0,
                          0,
                        ],
                      },
                      "bottomLeft": Object {
                        "ignoreShake": true,
                        "offset": Array [
                          0,
                          4,
                        ],
                        "overflow": Object {
                          "adjustX": 1,
                          "adjustY": 1,
                        },
                        "points": Array [
                          "tl",
                          "bl",
                        ],
                        "targetOffset": Array [
                          0,
                          0,
                        ],
                      },
                      "bottomRight": Object {
                        "ignoreShake": true,
                        "offset": Array [
                          0,
                          4,
                        ],
                        "overflow": Object {
                          "adjustX": 1,
                          "adjustY": 1,
                        },
                        "points": Array [
                          "tr",
                          "br",
                        ],
                        "targetOffset": Array [
                          0,
                          0,
                        ],
                      },
                      "left": Object {
                        "ignoreShake": true,
                        "offset": Array [
                          -4,
                          0,
                        ],
                        "overflow": Object {
                          "adjustX": 1,
                          "adjustY": 1,
                        },
                        "points": Array [
                          "cr",
                          "cl",
                        ],
                        "targetOffset": Array [
                          0,
                          0,
                        ],
                      },
                      "leftBottom": Object {
                        "ignoreShake": true,
                        "offset": Array [
                          -4,
                          0,
                        ],
                        "overflow": Object {
                          "adjustX": 1,
                          "adjustY": 1,
                        },
                        "points": Array [
                          "br",
                          "bl",
                        ],
                        "targetOffset": Array [
                          0,
                          0,
                        ],
                      },
                      "leftTop": Object {
                        "ignoreShake": true,
                        "offset": Array [
                          -4,
                          0,
                        ],
                        "overflow": Object {
                          "adjustX": 1,
                          "adjustY": 1,
                        },
                        "points": Array [
                          "tr",
                          "tl",
                        ],
                        "targetOffset": Array [
                          0,
                          0,
                        ],
                      },
                      "right": Object {
                        "ignoreShake": true,
                        "offset": Array [
                          4,
                          0,
                        ],
                        "overflow": Object {
                          "adjustX": 1,
                          "adjustY": 1,
                        },
                        "points": Array [
                          "cl",
                          "cr",
                        ],
                        "targetOffset": Array [
                          0,
                          0,
                        ],
                      },
                      "rightBottom": Object {
                        "ignoreShake": true,
                        "offset": Array [
                          4,
                          0,
                        ],
                        "overflow": Object {
                          "adjustX": 1,
                          "adjustY": 1,
                        },
                        "points": Array [
                          "bl",
                          "br",
                        ],
                        "targetOffset": Array [
                          0,
                          0,
                        ],
                      },
                      "rightTop": Object {
                        "ignoreShake": true,
                        "offset": Array [
                          4,
                          0,
                        ],
                        "overflow": Object {
                          "adjustX": 1,
                          "adjustY": 1,
                        },
                        "points": Array [
                          "tl",
                          "tr",
                        ],
                        "targetOffset": Array [
                          0,
                          0,
                        ],
                      },
                      "top": Object {
                        "ignoreShake": true,
                        "offset": Array [
                          0,
                          -4,
                        ],
                        "overflow": Object {
                          "adjustX": 1,
                          "adjustY": 1,
                        },
                        "points": Array [
                          "bc",
                          "tc",
                        ],
                        "targetOffset": Array [
                          0,
                          0,
                        ],
                      },
                      "topLeft": Object {
                        "ignoreShake": true,
                        "offset": Array [
                          0,
                          -4,
                        ],
                        "overflow": Object {
                          "adjustX": 1,
                          "adjustY": 1,
                        },
                        "points": Array [
                          "bl",
                          "tl",
                        ],
                        "targetOffset": Array [
                          0,
                          0,
                        ],
                      },
                      "topRight": Object {
                        "ignoreShake": true,
                        "offset": Array [
                          0,
                          -4,
                        ],
                        "overflow": Object {
                          "adjustX": 1,
                          "adjustY": 1,
                        },
                        "points": Array [
                          "br",
                          "tr",
                        ],
                        "targetOffset": Array [
                          0,
                          0,
                        ],
                      },
                    }
                  }
                  defaultPopupVisible={false}
                  destroyPopupOnHide={false}
                  focusDelay={0}
                  getDocument={[Function]}
                  getPopupClassNameFromAlign={[Function]}
                  hideAction={Array []}
                  mask={false}
                  maskClosable={true}
                  mouseEnterDelay={0.1}
                  mouseLeaveDelay={0.1}
                  onPopupAlign={[Function]}
                  onPopupVisibleChange={[Function]}
                  overlay="Edit survey"
                  popup={[Function]}
                  popupAlign={Object {}}
                  popupClassName=""
                  popupPlacement="top"
                  popupStyle={Object {}}
                  popupTransitionName="zoom-big-fast"
                  popupVisible={false}
                  prefixCls="ant-tooltip"
                  showAction={Array []}
                  title="Edit survey"
                  visible={false}
                >
                  <Icon
                    onMouseEnter={[Function]}
                    onMouseLeave={[Function]}
                    style={
                      Object {
                        "fontSize": "1.2em",
                      }
                    }
                    type="edit"
                  >
                    <LocaleReceiver
                      componentName="Icon"
                    >
                      <i
                        aria-label="icon: edit"
                        className="anticon anticon-edit"
                        onMouseEnter={[Function]}
                        onMouseLeave={[Function]}
                        style={
                          Object {
                            "fontSize": "1.2em",
                          }
                        }
                      >
                        <IconReact
                          className=""
                          type="edit-o"
                        >
                          <svg
                            aria-hidden="true"
                            className=""
                            data-icon="edit"
                            fill="currentColor"
                            focusable="false"
                            height="1em"
                            viewBox="64 64 896 896"
                            width="1em"
                          >
                            <path
                              d="M257.7 752c2 0 4-.2 6-.5L431.9 722c2-.4 3.9-1.3 5.3-2.8l423.9-423.9a9.96 9.96 0 0 0 0-14.1L694.9 114.9c-1.9-1.9-4.4-2.9-7.1-2.9s-5.2 1-7.1 2.9L256.8 538.8c-1.5 1.5-2.4 3.3-2.8 5.3l-29.5 168.2a33.5 33.5 0 0 0 9.4 29.8c6.6 6.4 14.9 9.9 23.8 9.9zm67.4-174.4L687.8 215l73.3 73.3-362.7 362.6-88.9 15.7 15.6-89zM880 836H144c-17.7 0-32 14.3-32 32v36c0 4.4 3.6 8 8 8h784c4.4 0 8-3.6 8-8v-36c0-17.7-14.3-32-32-32z"
                            />
                          </svg>
                        </IconReact>
                      </i>
                    </LocaleReceiver>
                  </Icon>
                </Trigger>
              </Tooltip>
            </Tooltip>
          </div>
        </styled.div>
      </IconButton>
      <ConfirmEditMode
        onCancel={[Function]}
        onOk={[Function]}
        visible={false}
      >
        <Modal
          confirmLoading={false}
          maskTransitionName="fade"
          okType="primary"
          onCancel={[Function]}
          onOk={[Function]}
          title="Do you really want to edit a published survey?"
          transitionName="zoom"
          visible={false}
          width={520}
        >
          <Component
            closeIcon={
              <span
                className="ant-modal-close-x"
              >
                <Icon
                  className="ant-modal-close-icon"
                  type="close"
                />
              </span>
            }
            confirmLoading={false}
            footer={
              <LocaleReceiver
                componentName="Modal"
                defaultLocale={
                  Object {
                    "cancelText": "Cancel",
                    "justOkText": "OK",
                    "okText": "OK",
                  }
                }
              >
                [Function]
              </LocaleReceiver>
            }
            maskTransitionName="fade"
            okType="primary"
            onCancel={[Function]}
            onClose={[Function]}
            onOk={[Function]}
            prefixCls="ant-modal"
            title="Do you really want to edit a published survey?"
            transitionName="zoom"
            visible={false}
            width={520}
            wrapClassName=""
          >
            <PortalWrapper
              visible={false}
            />
          </Component>
        </Modal>
      </ConfirmEditMode>
    </EditSurveyButton>
  </Route>
</withRouter(EditSurveyButton)>
`;
