// Jest Snapshot v1, https://goo.gl/fbAQLP

exports[`SurveyScreeningCompleted should render SurveyScreeningCompleted 1`] = `
<ApolloProvider
  client={MockedClient {}}
>
  <SurveyScreeningCompleted
    history={
      Object {
        "listen": [Function],
        "location": Object {
          "pathname": "",
        },
        "push": [Function],
      }
    }
    match={
      Object {
        "params": Object {
          "surveyId": "survey-1",
        },
      }
    }
  >
    <AuthenticatedLayoutContainer
      mergeNavbarToContent={true}
    >
      <AuthenticatedLayout
        getEntryName={[Function]}
        handleNavigate={[Function]}
        mergeNavbarToContent={true}
        navigationEntries={
          Array [
            Object {
              "route": "/",
              "title": "Home",
            },
            Object {
              "action": [Function],
              "title": "Sign out",
            },
          ]
        }
        user={null}
      >
        <styled.div>
          <div
            className="sc-kgoBCf OhgbK"
          >
            <withI18nextTranslation(Navbar)
              entriesData={
                Array [
                  Object {
                    "route": "/",
                    "title": "Home",
                  },
                  Object {
                    "action": [Function],
                    "title": "Sign out",
                  },
                ]
              }
              getEntryName={[Function]}
              mergeNavbarToContent={true}
              onClickEntry={[Function]}
              user={null}
            >
              <Navbar
                entriesData={
                  Array [
                    Object {
                      "route": "/",
                      "title": "Home",
                    },
                    Object {
                      "action": [Function],
                      "title": "Sign out",
                    },
                  ]
                }
                getEntryName={[Function]}
                i18n={I18n {}}
                mergeNavbarToContent={true}
                onClickEntry={[Function]}
                t={[Function]}
                tReady={true}
                user={null}
              >
                <Component>
                  <MediaQuery
                    query="(min-width: 992px)"
                    values={null}
                  >
                    <styled.div
                      withoutShadow={true}
                    >
                      <div
                        className="sc-htoDjs ebBDLh"
                      >
                        <styled.div
                          desktop={false}
                        >
                          <div
                            className="sc-iwsKbI fsEGCz"
                          >
                            <styled.div
                              onClick={[Function]}
                              src="FlavorWiki_Full_Logo.png"
                            >
                              <div
                                className="sc-gZMcBi dMrBgC"
                                onClick={[Function]}
                                src="FlavorWiki_Full_Logo.png"
                              />
                            </styled.div>
                          </div>
                        </styled.div>
                      </div>
                    </styled.div>
                  </MediaQuery>
                </Component>
              </Navbar>
            </withI18nextTranslation(Navbar)>
            <styled.div>
              <div
                className="sc-kGXeez egiofs"
              >
                <Row
                  gutter={0}
                  justify="center"
                  type="flex"
                >
                  <div
                    className="ant-row-flex ant-row-flex-center"
                    style={Object {}}
                  >
                    <Col
                      lg={
                        Object {
                          "span": 12,
                        }
                      }
                      xs={
                        Object {
                          "span": 20,
                        }
                      }
                    >
                      <div
                        className="ant-col ant-col-xs-20 ant-col-lg-12"
                        style={Object {}}
                      >
                        <Component
                          surveyId="survey-1"
                        >
                          <div>
                            children
                          </div>
                        </Component>
                      </div>
                    </Col>
                  </div>
                </Row>
              </div>
            </styled.div>
            <PageContainer>
              <styled.div>
                <div
                  className="sc-chPdSV kSKTub"
                />
              </styled.div>
            </PageContainer>
          </div>
        </styled.div>
      </AuthenticatedLayout>
    </AuthenticatedLayoutContainer>
  </SurveyScreeningCompleted>
</ApolloProvider>
`;
