// Jest Snapshot v1, https://goo.gl/fbAQLP

exports[`QuestionCreation List Should update MandatoryQuestionsToCreate mandatoryQuestions toBe null 1`] = `
<ApolloProvider
  client={MockedClient {}}
>
  <MandatoryQuestionsToCreate
    location={
      Object {
        "search": "?section=end",
      }
    }
  />
</ApolloProvider>
`;
