// Jest Snapshot v1, https://goo.gl/fbAQLP

exports[`Notification should render Notification 1`] = `
<styled.div
  onClick={[Function]}
>
  <styled.div>
    <CircleWithIcon
      backgroundColor="#237b9f"
    >
      <Icon
        type="team"
      />
    </CircleWithIcon>
    <styled.div>
      <Title>
        Survey Completed
      </Title>
      <Message>
        Congratulations
      </Message>
      <Date>
        1 Oct 2019
      </Date>
    </styled.div>
  </styled.div>
  <Points
    points={20}
  />
</styled.div>
`;
