// Jest Snapshot v1, https://goo.gl/fbAQLP

exports[`Body should render Body 1`] = `
<styled.div>
  <styled.div>
    <styled.span>
      FLAVORWIKI PRIVACY AND PERSONAL DATA PROTECTION POLICY
    </styled.span>
    <styled.div>
      Index
    </styled.div>
    <styled.ol>
      <styled.a
        href="#Privacy Statement"
      >
        • Privacy Statement
      </styled.a>
      <styled.a
        href="#Glossar"
      >
        • Glossary
      </styled.a>
      <styled.a
        href="#The Data Controller"
      >
        • The Data Controller
      </styled.a>
      <styled.a
        href="#FlavorWiki Core Activity – Service Catalog and Lawful Basis"
      >
        • FlavorWiki Core Activity – Service Catalog and Lawful Basis
      </styled.a>
      <styled.a
        href="#WHAT Personal Data is “treated” by FlavorWiki"
      >
        • WHAT Personal Data is “treated” by FlavorWiki
      </styled.a>
      <styled.a
        href="#WHAT “Treatment” occurs over Personal Data"
      >
        • WHAT “Treatment” occurs over Personal Data
      </styled.a>
      <styled.a
        href="#HOW is Personal Data Security, Privacy and Confidentiality assured"
      >
        • HOW is Personal Data Security, Privacy and Confidentiality assured
      </styled.a>
      <styled.a
        href="#WHY and with WHO is Personal Data Shared"
      >
        • WHY and with WHO is Personal Data Shared
      </styled.a>
      <styled.a
        href="#For HOW LONG is Personal Data maintained"
      >
        • For HOW LONG is Personal Data maintained
      </styled.a>
      <styled.a
        href="#HOW to exercise Data Subjects’ rights"
      >
        • HOW to exercise Data Subjects’ rights
      </styled.a>
      <styled.a
        href="#FlavorWiki’ DPO"
      >
        • FlavorWiki’ DPO
      </styled.a>
    </styled.ol>
    <styled.a
      name="Privacy Statement"
    >
      Privacy Statement
    </styled.a>
    <styled.span>
      “Personal Data” is what enables other individuals or companies to identify you and get to know you; meaning, whereas a minimum amount of Personal Data (e.g. name, registry number, and e-mail) enables any third party to univocally identify you; another type of Personal Data (e.g. football club, wine preferences, favorite movie) enables those entities to get to know you.
    </styled.span>
    <styled.span>
      Personal Data may render you at risk if accessed by unauthorized ill intended 3rd parties.
    </styled.span>
    <styled.span>
      FlavorWiki (both as an organization as each of its staff members) is perfectly aware of this fact, and that is why a set of Policies, Operational Processes, and mechanisms (technological and human-based) has been developed to ensure that the Personal Data entrusted by you to FlavorWiki will be maintained, handled and shared in a manner that ensures its Security, Accuracy, Confidentiality, and Privacy, hence ensuring your Personal Data Protection.
    </styled.span>
    <styled.span>
      GDPR is (at present Date) the most advanced and demanding piece of legislation towards Personal Data Protection, ruling and establishing requirements that must be followed by companies and individuals towards having in place a “Modus Operandi” that ensures your Personal Data to be safely handled by third parties not rendering you at risk, and that is why FLAVORWIKI has adopted it as a Corporate Guideline (more than “just” a Legal Obligation).
    </styled.span>
    <styled.div>
      Applicability
    </styled.div>
    <styled.span>
      FlavorWiki reserves the right to modify this Privacy Policy at all times by posting an updated version on its websites.
    </styled.span>
    <styled.a
      name="The Data Controller"
    >
      The Data Controller
    </styled.a>
    <styled.span>
      Smart Sensory Analytics LLC, registration number 82-1401303 established in 140 Jonathans Drive, West End, NC 27376 U.S. (operating under the brand “FlavorWiki”) is the entity that acts as the Data Controller for the purpose of this Privacy Policy and all data processing practices herein contemplated. All questions or requests regarding the processing of the personal data under our control or processing may be addressed to
       
      <styled.a
        href="mailto:privacy@FlavorWiki.com"
        rel="noopener"
        target="blank"
      >
        privacy@FlavorWiki.com
      </styled.a>
    </styled.span>
    <styled.span>
      FlavorWiki DPO contacts
      <br />
      Mr. Rui Serrano
      <br />
      Country: Portugal, European Union
      <br />
      email -
       
      <styled.a
        href="mailto:phrdpoaas@gmail.com"
        rel="noopener"
        target="blank"
      >
        phrdpoaas@gmail.com
      </styled.a>
      <br />
      phone - +351932579434
    </styled.span>
    <styled.a
      name="FlavorWiki Core Activity – Service Catalog and Lawful Basis"
    >
      FLAVORWIKI Core Activity – Service Catalog and “Lawful Basis”
    </styled.a>
    <styled.span>
      FLAVORWIKI renders a set of services towards other companies as well as natural persons, which successful completion requires “Personal Data Processing Activities”.
    </styled.span>
    <styled.span>
      Under this scope, FLAVORWIKI’ Service Catalog comprehends the following services and applicable “Lawful Basis” for processing Personal Data (respectively), meaning how is FLAVORWIKI permitted by law to process “Personal Data” under such services scope:
    </styled.span>
    <styled.ol>
      <styled.li>
        • 
        <styled.span>
          Reaching out to prospect Natural Persons
        </styled.span>
        <styled.span />
        <styled.span>
          FlavorWiki, in general, does not directly reach out to natural persons with whom it has no established relationship (although it could do so if observing GDPR Article 14); the way in which FlavorWiki reaches out to prospects (individuals who may be interested in its Services Portfolio), consists of publishing information on Social Media platforms about its services. Those Prospects who are members of such platforms and become interested in the posted message may click on the links made available which will lead them to one of FlavorWiki’s website landing pages.
        </styled.span>
        <styled.span>
          Nevertheless, the “Lawful Basis” towards reaching out to prospects, including directly while strictly observing by GDPR article 14, consists of Legitimate Interest.
        </styled.span>
      </styled.li>
      <styled.li>
        •
         
        <styled.span>
          Flavor Experience - allowing Data Subjects to participate in flavor tests and compensating them for it
        </styled.span>
        <styled.span />
        <styled.span>
          The Lawful Basis in the case of this service consists of “Explicit Consent”.
        </styled.span>
        <styled.span>
          The Data Subjects adhere to their own free will and having understood the context, purpose, and scope of this service (and inherent “Personal Data Processing Activities”) while providing their Consent to it.
        </styled.span>
      </styled.li>
      <styled.li>
        •
         
        <styled.span>
          Allowing Corporate Client companies to use FlavorWiki’ platform as a Service in order to conduct their own flavor tests
        </styled.span>
        <styled.span />
        <styled.span>
          In this case, the applicable Lawful Basis for Processing by FlavorWiki consists of the fulfillment of contractual obligations, since it plays the role of a Processor, while its Corporate Client is the Controller.
        </styled.span>
        <styled.span>
          In the case of flavor tests as a Service, the Controller (Corporate Client) is the sole responsible entity for ensuring that the Data Subject is fully aware and informed of Personal Data Processing scope, context, and purpose including the service components enabled by FlavorWiki’ platform and that there is a documented Lawful Basis in place from its side towards the Data Subject.
        </styled.span>
      </styled.li>
      <styled.li>
        • 
        <styled.span>
          Flavor Tests
        </styled.span>
        <styled.span />
        <styled.span>
          Besides allowing its Corporate Clients to conduct their own flavor tests over FlavorWiki’ platform as a Service, the company also provides this service on its own towards Corporate Clients.
        </styled.span>
        <styled.span>
          The Corporate Client is also a Controller, for it is the one that established which tests shall run addressing which products or services and towards what type of Customers (Data Subjects).
        </styled.span>
        <styled.span>
          Notwithstanding what has been mentioned above, FlavorWiki is the party under a Services Contract with its Corporate Client which directly addresses the Data Subjects and Processes their Personal Data, because, under this Service scope, no Personal Data is shared by FlavorWiki with its Corporate Client, merely anonymized Data, hence the Lawful Basis for Processing Personal Data consists of Explicit Consent from the Data Subjects, making FlavorWiki also a Controller.
        </styled.span>
      </styled.li>
      <styled.li>
        • 
        <styled.span>
          Generic Marketing information
        </styled.span>
        <styled.span />
        <styled.span>
          FlavorWiki sends out information towards its registered Data Subjects (meaning those whom have participated or have enlisted to participate in flavor tests) under the Lawful Basis of Legitimate Interest that derives from the fact that those individuals have demonstrated interest to participate in flavor tests, hence are interested to know which flavor tests are available as well as related information.
        </styled.span>
        <styled.span>
          Nevertheless, those Data Subjects may opt-out from this information service at any time by requesting it towards FlavorWiki while exercising their Rights under GDPR.
        </styled.span>
      </styled.li>
    </styled.ol>
    <styled.a
      name="WHAT Personal Data is “treated” by FlavorWiki"
    >
      WHAT “Personal Data” is subject to Processing by FlavorWiki
    </styled.a>
    <styled.span>
      In the case of FlavorWiki Direct Flavor Test service the following categories of Personal Data will be directly processed:
    </styled.span>
    <styled.ol>
      <styled.li>
        • Contact Data (e.g. Name; Email; Phone number)
      </styled.li>
      <styled.li>
        • Location Data (e.g. Country; City; State)
      </styled.li>
      <styled.li>
        • Personal Information (e.g. Gender; Birth Date; Children)
      </styled.li>
      <styled.li>
        • Financial Data (e.g. Annual income; electronic payment username)
      </styled.li>
      <styled.li>
        • Consuming habits (e.g. Consuming habits; usual purchasing place)
      </styled.li>
      <styled.li>
        • Flavor Test feedback (e.g. Flavor; Aroma)
      </styled.li>
    </styled.ol>
    <styled.span>
      <styled.span>
        The univocal identification and documentation of the “Data Subject”
      </styled.span>
    </styled.span>
    <styled.span>
      FlavorWiki adherent flavor test subjects (Data Subjects who have decided to adhere to the Flavor Experience) will be registered on FlavorWiki digital platform, therefore having a Login which enables their univocal identification and authentication towards the Service.
    </styled.span>
    <styled.span>
      In those cases where “Data Subjects” who may interact with FlavorWiki cannot be identified through their Login, FlavorWiki will resort to a two-factor authentication consisting of sending/ receiving messages that imply some action or permission/ objection to “Personal Data Processing Activities” by e-mail and having it confirmed with a unique individual code that was conveyed to those “Data Subjects” by SMS to their mobile phones.
    </styled.span>
    <styled.a
      name="WHAT “Treatment” occurs over Personal Data"
    >
      WHAT Treatment occurs over “Personal Data”
    </styled.a>
    <styled.span>
      <styled.span>
        <styled.span>
          Gathering/ Collection
        </styled.span>
      </styled.span>
    </styled.span>
    <styled.span>
      As previously mentioned, although in general FlavorWiki exclusively gathers the Personal Data directly from the Data Subjects themselves, when they reach out to FlavorWiki via the Social Media published Links, it may happen that FlavorWiki gathers a minimum amount of “Personal Data” that enables to entice contact with a “Data Subject” from a 3rd party source.
    </styled.span>
    <styled.span>
      In such case the type of “Personal Data” collected consists of basic minimum Contact and Location Data as well as Personal Information that is relevant to decide whom will be contacted, namely (yet not exclusively):
    </styled.span>
    <styled.ol>
      <styled.li>
        • Name
      </styled.li>
      <styled.li>
        • Email
      </styled.li>
      <styled.li>
        • Phone number
      </styled.li>
      <styled.li>
        • Country, City, State
      </styled.li>
      <styled.li>
        • Gender
      </styled.li>
      <styled.li>
        • Age
      </styled.li>
    </styled.ol>
    <styled.span>
      Where “Personal Data” was collected from a 3rd party (including “public sources”), FlavorWiki will act as per “GDPR” Article 14 ruling, meaning the “Data Subject” will be contacted and informed about which type of “Personal Data” was gathered by FLAVORWIKI, for which purpose and from which source and the “Data Subject” will be requested to provide his/ her Explicit Consent towards “Personal Data” Processing under the conveyed service scope.
    </styled.span>
    <styled.span>
      If the “Data Subject” either does not reply within 28 days or his/ her answer is of not consenting towards FlavorWiki Processing his/ her “Personal Data”, FLAVORWIKI shall erase the “Personal Data” which has been collected about that “Data Subject”.
    </styled.span>
    <styled.span>
      To prevent further contact within the same scope, the “Data Subject’s” Name and e-mail address will be “blacklisted” (therefore maintained by FlavorWiki) on a dedicated repository that is accessible to relevant internal Departments only.
    </styled.span>
    <styled.span>
      Detailed and extensive amounts of “Personal Data” that is vital for rendering FlavorWiki services will exclusively be collected either directly towards the “Data Subjects” themselves or through 3rd party entities having the “Data Subject” fully informed of such collection process and once he/ she has provided his/ her explicit consent to it.
    </styled.span>
    <styled.span>
      FlavorWiki does not profile “Data Subjects” without their knowledge and consent, least of all from public platforms such as Social Media or “Affiliate” entities’ information repositories.
    </styled.span>
    <styled.span>
      When a Data Subject visits FlavorWiki’ websites, session cookie files are either placed on his/ her browser device, or the website reads such already existing files.
    </styled.span>
    <styled.span>
      FlavorWiki exclusively uses those cookies that record information about the “IT architecture and Landscape” of the device being used by the visitor (e.g. browser; browsing preferences; other…) however, without identifying that visitor personally (as a Data Subject).
    </styled.span>
    <styled.span>
      This information, except for IP addresses, is never combined with the data pertaining to either “Prospect Customers” or “Customers”, thus not leading to the identification and habits “profiling” of any particular Data Subject.
    </styled.span>
    <styled.span>
      IP addresses are exclusively cross-referenced with other data for the purpose of safekeeping the company from fraud attempts plus with regards to “Customers” documenting operations by (1) verifying the identity of a person signing in, and (2) making records of your consent and other legally binding actions (Legitimate Interest).
    </styled.span>
    <styled.span>
      For detailed information about cookies in use and similar employed technologies please refer to the
       
      <styled.span>
        <styled.span>
          Cookies Policy
        </styled.span>
      </styled.span>
      .
    </styled.span>
    <styled.span>
      <styled.span>
        <styled.span>
          Storing
        </styled.span>
      </styled.span>
    </styled.span>
    <styled.span>
      FLAVORWIKI is a Digital company, which means that the overwhelming amount of Data and information the company requires to operate is exclusively maintained under Digital format on IT Systems.
    </styled.span>
    <styled.span>
      Paper is used exclusively either for short periods of time and once no longer required properly disposed of (shredders) or if mandatory under any accessory local legal requirement which implies having “Personal Data” printed and stored.
    </styled.span>
    <styled.span>
      FLAVORWIKI Service “IT Landscape” consists of a core dedicated Service Platform for flavor tests registry, that is segregated by FlavorWiki’ direct Services and all the other Corporate Clients which use it as a Service. In the latter case, each Corporate Client “work area” is also fully segregated to ensure Data Security, Confidentiality and the Data Subject’s privacy.
    </styled.span>
    <styled.span>
      Personal Data Processing by FlavorWiki requires the contribution of some Partners that deliver part of the Service and with which only the minimum amount of Personal Data that is mandatory for those service components to be delivered shall be shared, namely:
    </styled.span>
    <styled.ol>
      <styled.li>
        • Tableau
      </styled.li>
      <styled.li>
        • AWS
      </styled.li>
      <styled.li>
        • Hubspot
      </styled.li>
      <styled.li>
        • MongoDB
      </styled.li>
    </styled.ol>
    <styled.span>
      FLAVORWIKI acts as the Controller and these “Partners” as “Processors”, meaning they will not undergo any “Personal Data Processing Activities” activities towards information registered, submitted or conveyed by FLAVORWIKI unless under the scope of contracted services and that is agreed and documented under an existing “DPA” between the parties.
    </styled.span>
    <styled.span>
      <styled.span>
        <styled.span>
          Processing
        </styled.span>
      </styled.span>
    </styled.span>
    <styled.span>
      “Personal Data Processing Activities”, in specifics Processing Consists of:
    </styled.span>
    <styled.ol>
      <styled.li>
        • Gathering Corporate Client requirements towards a specific Flavor Test;
      </styled.li>
      <styled.li>
        • Identifying the registered Test Subjects (Data Subjects who have adhered to the Service) who are best-fit individuals for the test at hand;
      </styled.li>
      <styled.li>
        • Inform and Invite those Test Subjects to participate in the Flavor Test;
      </styled.li>
      <styled.li>
        • Gather and register the list of Test Subjects towards the specific Flavor Test;
      </styled.li>
      <styled.li>
        • Enable the Flavor Test to run and retrieve Test Feedback Data by Data Subject;
      </styled.li>
      <styled.li>
        • Prepare a Flavor Test report towards the Corporate Client where the Data has been anonymized.
      </styled.li>
    </styled.ol>
    <styled.span>
      Processing activities (as well as storing) by FlavorWiki side occurs in the EU, on its partner Hetzner Data Center in Germany.
    </styled.span>
    <styled.span>
      <styled.span>
        <styled.span>
          Sharing
        </styled.span>
      </styled.span>
    </styled.span>
    <styled.span>
      A portion of FLAVORWIKI’ “IT Landscape” is Cloud-based, therefore tools and services are either hosted or enabled by 3rd parties (“Partners”) and “Personal Data” is shared with those entities, not in the sense that they will change it or process it but that they will either store it or have their software processing it with FlavorWiki users logged.
    </styled.span>
    <styled.span>
      The existing DPAs with these types of “Partners” rule that these companies may not copy, use or process “Personal Data” “submitted” by FlavorWiki unless to enable FlavorWiki with storage or processing results that derive from the services rendered by FlavorWiki under defined “Lawful Basis” towards the “Data Subjects”.
    </styled.span>
    <styled.span>
      Yet (as previously mentioned) another set of “Partners” actively processes “Personal Data” submitted by FlavorWiki within the scope of complementary specific services that are part of FlavorWiki’s overall Service Catalog. These companies have agreed under a DPA to exclusively process “Personal Data” “enabled” by FlavorWiki as per FlavorWiki definitions and not to share or make it available to any third parties which do not play the role of “Sub-processors” within the scope of those shared services.
    </styled.span>
    <styled.span>
      In both cases, the DPAs also gather mutual commitment (from FlavorWiki and its “Partners”) to ensure that their “Sub-processors” will act in strict observance of “GDPR”.
    </styled.span>
    <styled.span>
      Last, FlavorWiki (as any company) and under specific circumstances may be bound by local legislation to share or make available some “Personal Data” to legal/ government authorities (as an example we have the case of invoices).
    </styled.span>
    <styled.a
      name="WHY and with WHO is Personal Data Shared"
    >
      International Data Transfers
    </styled.a>
    <styled.span>
      Some of FlavorWiki’ partners (Processors or Controllers) are established on 3rd countries (meaning not the EU Member States nor within the European Economic Area), therefore not enjoying an adequacy qualification by the European Commission pursuant to GDPR Article 45 ruling, such as Belize, Bosnia and Herzegovina, and Russia.
    </styled.span>
    <styled.span>
      To make such transfers fully compliant with the GDPR, the Data Processing Agreements with those partners include the EU Standard Contractual Clauses in accordance with Commission Decision of 5 February 2010 on standard contractual clauses for the transfer of personal data to processors established in third countries under Directive 95/46/EC of the European Parliament and of the Council.
    </styled.span>
    <styled.div>
      EU-U.S. Privacy Shield and Swiss-U.S. Privacy Shield
    </styled.div>
    <styled.span>
      FlavorWiki complies with the EU-U.S. Privacy Shield Framework and Swiss-U.S. Privacy Shield Framework as set forth by the U.S. Department of Commerce regarding the collection, use, and retention of personal information transferred from the European Union and Switzerland to the United States. FlavorWiki has certified to the Department of Commerce that it adheres to the Privacy Shield Principles. If there is any conflict between the terms in this privacy policy and the Privacy Shield Principles, the Privacy Shield Principles shall govern. To learn more about the Privacy Shield program, and to view our certification, please visit
       
      <styled.a
        href="https://www.privacyshield.gov/"
        rel="noopener"
        target="blank"
      >
        https://www.privacyshield.gov/
      </styled.a>
      .
    </styled.span>
    <styled.span>
      FlavorWiki also complies with the Privacy Shield Principles for all onward transfers of personal data from the EU and Switzerland, including the onward transfer liability provisions, while taking reasonable and appropriate steps to ensure that third-party agents, resellers, licensees, and service providers process Personal Data in accordance with Our Privacy Shield obligations and to stop and remediate any unauthorized processing.
    </styled.span>
    <styled.span>
      FlavorWiki may transfer Personal Data to our third-party agents, resellers, licensees, or service providers who perform functions on Our behalf or on behalf of Our Clients as described in this Privacy Policy (under the GDPR named as Controllers or Processors). Regardless of being or not required by the Privacy Shield, and since it is a GDPR requirement, FlavorWiki enters into written agreements (DPAs) with those Partners/ service providers requiring them to provide the same level of protection the Privacy Shield requires and limiting their use of the data to the specified services provided on Our behalf or on behalf of Our Clients (under the GDPR referred to a Data Protection Agreements).
    </styled.span>
    <styled.span>
      If FlavorWiki were to transfer Personal Data to one of its affiliated entities within its corporate group, it will ensure that a Documented Lawful Basis is in place and take steps to ensure that Personal Data remains Secure, Confidential and the Data Subject's privacy is ensured as per GDPR requirements as also with the same level of protection the Privacy Shield requires.
    </styled.span>
    <styled.span>
      With respect to personal data received or transferred pursuant to the Privacy Shield Framework, FlavorWiki is subject to the investigatory and enforcement powers of the U.S. Federal Trade Commission. In certain situations, FlavorWiki may be required to disclose personal data in response to lawful requests by public authorities, including to meet national security or law enforcement requirements (where the Lawful Basis for Processing Personal Data shall consist of a Legal Obligation).
    </styled.span>
    <styled.span>
      In compliance with the Privacy Shield Principles, FlavorWiki commits to resolve complaints about our collection or use of your personal information. EU and Swiss individuals with inquiries or complaints regarding our Privacy Shield policy should first contact FlavorWiki at:
      <br />
      <styled.a
        href="privacy@FlavorWiki.com"
        rel="noopener"
        target="blank"
      >
        privacy@FlavorWiki.com
      </styled.a>
      <br />
      or
      <br />
      <styled.a
        href="phrdpoaas@gmail.com"
        rel="noopener"
        target="blank"
      >
        phrdpoaas@gmail.com
      </styled.a>
      <br />
      or
      <br />
      Smart Sensory Analytics LLC, 140 Jonathans Drive, West End, NC 27376 U.S.
      <br />
      order
      <br />
      +351932579434
    </styled.span>
    <styled.span>
      FlavorWiki has further committed to cooperate with the panel established by the EU data protection authorities (DPAs) and the Swiss Federal Data Protection and Information Commissioner (FDPIC) with regard to unresolved Privacy Shield complaints concerning data transferred from the EU and Switzerland.
    </styled.span>
    <styled.span>
      With regards to the choices and means FlavorWiki enables individuals for limiting the use and disclosure of their personal data please check below the description under the point titled “HOW to exercise “Data Subjects’” rights”.
    </styled.span>
    <styled.span>
      With regards to the possibility, under certain conditions, for the individual to invoke binding arbitration please also check below the description under the point titled “HOW to exercise “Data Subjects’” rights”.
    </styled.span>
    <styled.a
      name="HOW is Personal Data Security, Privacy and Confidentiality assured"
    >
      HOW is “Personal Data” Security, Privacy and Confidentiality assured
    </styled.a>
    <styled.span>
      FlavorWiki has its “IT Landscape” configured and monitored under the strictest Security market standards and it has reviewed and adopted changes to its operational processes in a manner that ensures compliance with the requirements posed under “GDPR” towards “Personal Data” Protection. This means to assure its Confidentiality and Privacy while under “Personal Data Processing Activities” performed by itself and its “Partners” within the scope of FlavorWiki rendered services.
    </styled.span>
    <styled.a
      name="For HOW LONG is Personal Data maintained"
    >
      For HOW LONG is “Personal Data” maintained
    </styled.a>
    <styled.span>
      Data retention is one major potential risk generator towards “Personal Data”, since having the Data available means it may be accessed if a “Personal Data Breach” occurs.
    </styled.span>
    <styled.span>
      FlavorWiki has set the Data Retention periods according to its services’ lifecycle, so that in one hand, the company will not hold to “Personal Data” for any day longer that it is effectively necessary and on the other hand the risk of having needed information deleted prior to the end of its lifecycle within FlavorWiki Service Catalog scope and commitment is minimized.
    </styled.span>
    <styled.span>
      This means, in the case of FlavorWiki’ platform as a Service component, where its Corporate Clients will use the platform on their own, that in case the contract ends or the service comes to an end, FlavorWiki will allow a 1 month period for the Corporate Client to withdraw all of the Data and Information stored under its segregated repository and then FlavorWiki will erase the Data contained on such repository.
    </styled.span>
    <styled.span>
      In the case of FlavorWiki direct service, and besides the fact that each Data Subject is entitled to request the erasure of his/ her Personal Data as per defined under GDPR, where a Data Subject has not participated in the Flavor Experience for over 6 months and after FlavorWiki has attempted contact with him/ her for the period of two calendar weeks by the contacts available to FlavorWiki, the Data Subject’ Personal Data shall be erased.
    </styled.span>
    <styled.a
      name="HOW to exercise Data Subjects’ rights"
    >
      HOW to exercise “Data Subjects’” rights
    </styled.a>
    <styled.span>
      “GDPR” configures a set of rights that assist the “Data Subjects”, namely:
    </styled.span>
    <styled.ol>
      <styled.li>
        • 
        <styled.span>
          Right of Access
        </styled.span>
        <styled.span>
          The right to know whether data pertaining to him/ herself is being “Treated” by the organization and if so to be informed of which “Personal Data” is it (Article 15).
        </styled.span>
      </styled.li>
      <styled.li>
        • 
        <styled.span>
          Right to Rectification
        </styled.span>
        <styled.span>
          The right to have the company updating any inaccurate “Personal Data” (Article 16).
        </styled.span>
      </styled.li>
      <styled.li>
        • 
        <styled.span>
          Right of Access
        </styled.span>
        <styled.span>
          Also known as the Right to be Forgotten means that any “Data Subject” may request FlavorWiki to erase all “Personal Data” that pertains him/ her from its repositories and inform/ have its “Processors” doing the same (Article 17).
        </styled.span>
        <styled.span>
          Please note that “GDPR” does not overrule local legislation, hence in some cases, FlavorWiki may not be able to immediately (or at all) comply with such “Data Subject” request.
        </styled.span>
        <styled.span>
          If a “Data Subject” has pending contractual obligations towards FlavorWiki that require FlavorWiki to maintain the means to have such registry and identify the “Data Subject” or if U.S. legislation requires some “Personal Data” to be maintained for a certain period (e.g. invoices), FlavorWiki will not be able to erase the “Personal Data” that is vital to obey by such accessory legal obligations.
        </styled.span>
        <styled.span>
          The “Data Subject” must also bear in conscience that fully erasing all of his/ her “Personal Data” from FlavorWiki’ repositories will mean that FlavorWiki is no longer able to identify the “Data Subject” nor the services that were being rendered towards him/ her, therefore FlavorWiki will no longer be able to deliver any service towards that “Data Subject”.
        </styled.span>
        <styled.span>
          Exercising the Right to Erasure means the “Data Subject” will have all of his/ her services automatically canceled and all relationship history lost.
        </styled.span>
      </styled.li>
      <styled.li>
        • 
        <styled.span>
          Restriction of Processing
        </styled.span>
        <styled.span>
          The right to limit the processing of the “Data Subject’s” “Personal Data” (Article 18).
        </styled.span>
        <styled.span>
          Processing derives the needs and requirements of FlavorWiki’ Services (being rendered towards the “Data Subject”). Some services are independent, meaning they may be delivered if other services are not, whereas other services require accessory services that enable them. This means that restricting some processing activities may render the inherent service as well as other services undeliverable.
        </styled.span>
        <styled.span>
          To give a concrete example of a case where restricting processing affects other services you may consider the “Profiling Service”. FlavorWiki will profile its Members and Customers (upon Explicit Consent from them), in order to understand what “Data Subject’s” needs are and convey potentially interesting information about training, content (books, article), contacts from relevant 3rd parties that may bear leverage towards those needs/ points of interest. Restricting the “Profiling” processing of “Personal Data” will render FlavorWiki unable to perform such proactive support towards the “Data Subject”.
        </styled.span>
      </styled.li>
      <styled.li>
        • 
        <styled.span>
          Right to be Informed
        </styled.span>
        <styled.span>
          FLAVORWIKI will inform the “Data Subject” if any rectification, erasure or rectification of processing has taken place (Article 19).
        </styled.span>
        <styled.span>
          So, the “Data Subject” has the right to be informed and will be by FlavorWiki if any “Personal Data Processing Activities” activity changes towards his/ her “Personal Data”, including but not limited to, changes in service scope and most relevant in case of any “Personal Data Breach” which may have affected the “Data Subject’s” “Personal Data” (which will be conveyed within a period of 72 hours upon the incident).
        </styled.span>
      </styled.li>
      <styled.li>
        • 
        <styled.span>
          The right to Data Portability
        </styled.span>
        <styled.span>
          The “Data Subject” is entitled to request and shall have his/ her “Personal Data” directly transmitted from FlavorWiki to another “Controller” of his/ her choice, where technically feasible or to receive such “Personal Data” in an intelligible format so he/ she may provide it to that other “Processor” (Article 20).
        </styled.span>
      </styled.li>
      <styled.li>
        • 
        <styled.span>
          Right to Object
        </styled.span>
        <styled.span>
          The right to instruct FlavorWiki not to process his/ her “Personal Data” (Article 21).
        </styled.span>
        <styled.span>
          As an example, the “Data Subject” may inform FlavorWiki that he/ she no longer wishes to receive Marketing information/ emails, hence his/ her “Personal Data” must no longer be processed by FlavorWiki for such purpose.
        </styled.span>
        <styled.span>
          Again, depending on which specific type of processing the “Data Subject” requests FLAVORWIKI to act upon by stopping the activities, FLAVORWIKI may no longer be able to deliver other services which depend from that specific one.
        </styled.span>
      </styled.li>
      <styled.li>
        • 
        <styled.span>
          The right to stop Automated Decisions over “Personal Data”
        </styled.span>
        <styled.span>
          The right to request FlavorWiki to stop “Personal Data” Processing which derives from software automated triggers (Article 22).
        </styled.span>
        <styled.span>
          One example pertains to Members or Customers that have reached a certain “level” of interactions or achieved “goals”, will be assessed by FLAVORWIKI software tools as eligible for a certain perk or benefit. The software will then automatically trigger such action. The “Data Subject” is entitled to object having automated decisions based on pre-established criteria occurring over his/ her “Personal Data”.
        </styled.span>
        <styled.span>
          Again, this may result in the inability from FlavorWiki to ensure benefits or perks, because dues to the number of “Data Subjects” whose “Personal Data” FLAVORWIKI processes the only effective manner to ensure timely identification of that “Data Subject” is to have such processing occur in an automated manner.
        </styled.span>
      </styled.li>
      <styled.li>
        • 
        <styled.span>
          The right to present a formal complaint
        </styled.span>
        <styled.span>
          The Data Subject has the right to present a complaint towards the Supervisory Authority of his/ her EU Member State or the European Data Protection Board (EDPB) if not a resident in the EU. Such complaint submission entitles the Data Subject to benefit from binding arbitration from such Supervisory Authority with regards to the lawfulness of Personal Data Processing activities over Data that pertains to him/ her.
        </styled.span>
      </styled.li>
    </styled.ol>
    <styled.span>
      Any “Data Subject” may exercise his/ her rights under “GDPR” by reaching out to FlavorWiki’ “DPO” through the e-mail address
       
      <styled.a
        href="privacy@FlavorWiki.com."
        rel="noopener"
        target="blank"
      >
        privacy@FlavorWiki.com.
      </styled.a>
    </styled.span>
    <styled.span>
      If you have any questions, complaints or wish to exercise your rights under “GDPR”, please do make clear on your message:
    </styled.span>
    <styled.ol>
      <styled.li>
        • Purpose: Question; Complaint; Exercise of the “Data Subject’s” rights under “GDPR”
      </styled.li>
      <styled.li>
        • WHAT triggered your need to contact us?
      </styled.li>
      <styled.li>
        • WHEN did the root cause which triggered the need to contact us took place?
      </styled.li>
      <styled.li>
        • If a Member, your Member ID or if not a mobile phone number or alternative personal e-mail address so we may proceed with a two-factor authentication process.
      </styled.li>
    </styled.ol>
    <styled.span>
      Why the need to provide alternative personal contact?
    </styled.span>
    <styled.span>
      Under “GDPR” only the “Data Subject” may exercise his/ her rights, hence companies must ensure and document that the “Data Subject” or his/ her legal representatives are the ones interacting with the company while acting over his/ her “Personal Data”. The way to ensure such “authentication” with regards to “Data Subjects” who do not have digital credentials on any FLAVORWIKI web-based platforms is to forward a code to that “Data Subject” via an alternative communication channel to the standard e-mail address which served the purpose of the initial contact and have a code generated by FLAVORWIKI included on all messages that pertain the exercise of “Data Subjects’” rights or actions over such “Data Subject’” “Personal Data”.
    </styled.span>
    <styled.a
      name="Glossar"
    >
      Glossary
    </styled.a>
    <styled.span>
      ”
      <styled.span>
        Affiliate
      </styled.span>
      ” means any entity that directly or indirectly controls, is controlled by or is under common control with each Party. Whereas “Control,” for purposes of this definition, means direct or indirect ownership or control of more than 50% of the voting interests of the Party.
    </styled.span>
    <styled.span>
      “
      <styled.span>
        Controller
      </styled.span>
      ” means the “Party” which determines the “Personal Data” which is forward to the other “Party” under the “Services” scope, and the inherent “Personal Data” Treatment” purposes, processes and/ or workflows which must be observed by the other “Party” within the mutual relationship.
    </styled.span>
    <styled.span>
      “
      <styled.span>
        Data Protection Officer
      </styled.span>
      ”/ “
      <styled.span>
        DPO
      </styled.span>
      ” means the natural person within a company who bear the responsibility of ensuring corporate compliance towards “GDPR” (as per defined under this Regulation), both by means of monitoring compliance status as well as acting towards the organization and management structure informing those about existing non-conformity points and the need for the organization to act upon them in order to make them compliant with “GDPR” rules, guidelines and requirements.
    </styled.span>
    <styled.span>
      “
      <styled.span>
        Data Subject
      </styled.span>
      ” means the identified or identifiable natural person to whom “Personal Data” relates. Both Parties understand that the “Data Subject” is the sole owner of “Personal Data” which pertains to him/ her.
    </styled.span>
    <styled.span>
      “
      <styled.span>
        Data Subjects’ Rights
      </styled.span>
      ” means the rights established towards the “Data Subjects” under “GDPR”. Please check the item below under the title “HOW to exercise Data Subjects’ rights”
    </styled.span>
    <styled.span>
      “
      <styled.span>
        GDPR
      </styled.span>
      ” means the Regulation (EU) 2016/679 of the European Parliament and of the Council of 27 April 2016 on the protection of natural persons with regards to the “Personal Data” Treatment” and on the free movement of such data, while repealing and replacing the Directive 95/46/EC from May 25th, 2018 onwards.
    </styled.span>
    <styled.span>
      “
      <styled.span>
        IT Landscape
      </styled.span>
      ” means the set of IT assets and services of and at the disposal of each “Party” that enables their “Personal Data” Treatment” operation, meaning the communications infrastructure (LAN, WAN, Wi-Fi networks), Data Center and technical rooms, Cloud-based services, workstations, software systems and tools, mobile devices in use, peripheral IT devices, Firewalls and web-based resources.
    </styled.span>
    <styled.span>
      “
      <styled.span>
        Lawful Basis
      </styled.span>
      ” means the enlisted lawful grounds that a company has to entice “Personal Data” Treatment” activities under “GDPR”, namely (but not limited to) having documented: the “Data Subject’” Explicit Consent towards “Personal Data” Treatment” activities; the company Legitimate Interest in proceeding with ““Personal Data” Treatment” activities; accessory legal obligations that the company must observe and which entitled it to proceed with “Personal Data Processing Activities” activities within the limits of such ruling and inherent obligations; other as per defined under “GDPR”.
    </styled.span>
    <styled.span>
      “
      <styled.span>
        Partner
      </styled.span>
      ” means any 3rd party entity towards which each “Party” may resort in order to ensure “Personal Data Processing Activities” under a “Lawful Basis” (as established by “GDPR”) and within the scope of agreed “Services”.
    </styled.span>
    <styled.span>
      “
      <styled.span>
        Personal Data
      </styled.span>
      ” means any data which by itself or when cross-referenced with other data enables one to univocally identify one given natural person, the “Data Subject”.
    </styled.span>
    <styled.span>
      “
      <styled.span>
        Personal Data Breach
      </styled.span>
      ” means any “event” or “incident” (as per ITIL definition) which enables the accidental or unlawful destruction, loss, alteration, unauthorized disclosure of, or access to “Personal Data”.
    </styled.span>
    <styled.span>
      “
      <styled.span>
        Processor
      </styled.span>
      ” means the entity which proceeds with authorized “Personal Data Processing Activities” (under this DPA and the “Agreement”) on behalf of the “Controller”.
    </styled.span>
    <styled.span>
      “
      <styled.span>
        Service Catalog
      </styled.span>
      ” means the set of Services rendered by FLAVORWIKI that requires “Personal Data Processing Activities”.
    </styled.span>
    <styled.span>
      “
      <styled.span>
        Sub-processor
      </styled.span>
      ” means any “Processor” engaged by any of the “Parties” which performs complimentary “Personal Data Processing Activities” within the scope of the “Services”.
    </styled.span>
  </styled.div>
  <styled.div>
    <styled.span>
      The Privacy Policy was last updated on November 25, 2019 and are effective immediately.
    </styled.span>
    <styled.span>
      Should You have questions or comments regarding the Policy Policy or suggestions regarding it's improvement, please contact our support team at
       
      <styled.a
        href="mailto:support@flavorwiki.com"
        rel="noopener"
        target="blank"
      >
        support@flavorwiki.com
      </styled.a>
       
      or by phone at +1 (910) 722 1560 of +41 79 137 2228.
    </styled.span>
    <styled.span>
      All rights on the Privacy Policy belong to it's author. Any reproduction, without prior license, is strictly forbidden.
    </styled.span>
    <styled.span>
      <styled.span>
        Thank You for visiting FlavorWiki.
      </styled.span>
    </styled.span>
  </styled.div>
</styled.div>
`;
