// Jest Snapshot v1, https://goo.gl/fbAQLP

exports[`Survey should render Survey 1`] = `
<Fragment>
  <Switch>
    <Route
      component={[Function]}
      path="/survey/demo/:demoName"
    />
    <Redirect
      exact={true}
      path="/survey/:surveyId"
      push={false}
      to={
        Object {
          "pathname": "/survey/:surveyId/login",
          "search": "",
        }
      }
    />
    <Route
      component={[Function]}
      exact={true}
      path="/survey/:surveyId/login"
    />
    <withRouter(InSurveyRoute)
      component={[Function]}
      exact={true}
      path="/survey/:surveyId/instructions"
    />
    <withRouter(InSurveyRoute)
      component={[Function]}
      exact={true}
      path="/survey/:surveyId/screening/:stepId"
    />
    <withRouter(InSurveyRoute)
      component={[Function]}
      exact={true}
      path="/survey/:surveyId/screening-completed"
    />
    <withRouter(InSurveyRoute)
      component={[Function]}
      exact={true}
      path="/survey/:surveyId/payments/:stepId"
    />
    <withRouter(InSurveyRoute)
      component={[Function]}
      exact={true}
      path="/survey/:surveyId/tasting/:stepId"
    />
    <withRouter(InSurveyRoute)
      component={[Function]}
      exact={true}
      path="/survey/:surveyId/question/:stepId"
    />
    <withRouter(InSurveyRoute)
      component={[Function]}
      exact={true}
      path="/survey/:surveyId/survey-signup"
    />
    <withRouter(InSurveyRoute)
      component={[Function]}
      exact={true}
      path="/survey/:surveyId/finished"
    />
    <withRouter(InSurveyRoute)
      component={[Function]}
      exact={true}
      path="/survey/:surveyId/rejected"
    />
    <Route
      component={[Function]}
    />
  </Switch>
</Fragment>
`;
