// Jest Snapshot v1, https://goo.gl/fbAQLP

exports[`PieChart should render PieChart 1`] = `
<PieChart
  chartIndex={1}
  inputData={
    Object {
      "chart_id": "121",
      "chart_type": "pie",
      "labels": Array [
        "2-3 times a day",
        "Daily",
        "2-3 times a week",
      ],
      "results": Object {
        "data": Array [
          Object {
            "label": "2-3 times a day",
            "value": 25,
          },
          Object {
            "label": "Daily",
            "value": 103,
          },
          Object {
            "label": "2-3 times a week",
            "value": 144,
          },
        ],
      },
      "title": "Consumption Frequency",
      "trial": "",
    }
  }
>
  <Styled(styled.div)>
    <styled.div
      className="sc-htpNat gambkB"
    >
      <div
        className="sc-htpNat gambkB sc-bwzfXH cKtaFA"
      >
        <div
          className="pieChartCont"
          id="piechart_121"
        />
      </div>
    </styled.div>
  </Styled(styled.div)>
</PieChart>
`;

exports[`PieChart should render PieChart 2`] = `"<div id=\\"piechart_121\\" class=\\"pieChartCont\\"><svg class=\\"piechart_121\\" width=\\"NaN\\" height=\\"NaN\\"><g class=\\"donutcontainer\\" transform=\\"translate(NaN,NaN)\\"><g class=\\"slices\\"></g><g class=\\"labels\\"><g class=\\"label\\"><text dy=\\".35em\\" transform=\\"translate(NaN,NaN)\\" style=\\"text-anchor: middle;\\">25</text><path d=\\"MNaN,NaNQNaN,NaN,NaN,NaN\\" stroke=\\"#3497db\\" opacity=\\"1\\" stroke-width=\\"2px\\" fill=\\"none\\"></path></g></g><path class=\\"slices\\" d=\\"M0,0Z\\" fill=\\"#3497db\\"></path><path class=\\"slices\\" d=\\"M0,0Z\\" fill=\\"#e74c3c\\"></path><path class=\\"slices\\" d=\\"M0,0Z\\" fill=\\"#2fcc71\\"></path></g></svg><div class=\\"msgInner\\" style=\\"display: none;\\"></div><div class=\\"chart-legend\\"><div class=\\"legend\\"><div class=\\"legend-marker\\" style=\\"background: rgb(52, 151, 219);\\"></div><span>2-3 times a day</span></div><div class=\\"legend\\"><div class=\\"legend-marker\\" style=\\"background: rgb(231, 76, 60);\\"></div><span>Daily</span></div><div class=\\"legend\\"><div class=\\"legend-marker\\" style=\\"background: rgb(47, 204, 113);\\"></div><span>2-3 times a week</span></div></div></div>"`;

exports[`PieChart should render PieChart 3`] = `"<div id=\\"piechart_121\\" class=\\"pieChartCont\\"><svg class=\\"piechart_121\\" width=\\"NaN\\" height=\\"NaN\\"><g class=\\"donutcontainer\\" transform=\\"translate(NaN,NaN)\\"><g class=\\"slices\\"></g><g class=\\"labels\\"><g class=\\"label\\"><text dy=\\".35em\\" transform=\\"translate(NaN,NaN)\\" style=\\"text-anchor: middle;\\">25</text><path d=\\"MNaN,NaNQNaN,NaN,NaN,NaN\\" stroke=\\"#3497db\\" opacity=\\"1\\" stroke-width=\\"2px\\" fill=\\"none\\"></path></g></g><path class=\\"slices\\" d=\\"M0,0Z\\" fill=\\"#3497db\\"></path><path class=\\"slices\\" d=\\"M0,0Z\\" fill=\\"#e74c3c\\"></path><path class=\\"slices\\" d=\\"M0,0Z\\" fill=\\"#2fcc71\\"></path></g></svg><div class=\\"msgInner\\" style=\\"display: none;\\"></div><div class=\\"chart-legend\\"><div class=\\"legend\\"><div class=\\"legend-marker\\" style=\\"background: rgb(52, 151, 219);\\"></div><span>2-3 times a day</span></div><div class=\\"legend\\"><div class=\\"legend-marker\\" style=\\"background: rgb(231, 76, 60);\\"></div><span>Daily</span></div><div class=\\"legend\\"><div class=\\"legend-marker\\" style=\\"background: rgb(47, 204, 113);\\"></div><span>2-3 times a week</span></div></div></div>"`;
