<?xml version="1.0" encoding="UTF-8"?>
<svg width="24px" height="17px" viewBox="0 0 24 17" version="1.1" xmlns="http://www.w3.org/2000/svg" xmlns:xlink="http://www.w3.org/1999/xlink">
    <!-- Generator: Sketch 52.2 (67145) - http://www.bohemiancoding.com/sketch -->
    <title>Combined Shape</title>
    <desc>Created with Sketch.</desc>
    <g id="Symbols" stroke="none" stroke-width="1" fill="none" fill-rule="evenodd">
        <g id="Chat" transform="translate(-20.000000, -21.000000)" fill="#FFFFFF" fill-rule="nonzero">
            <g id="Group-9">
                <g id="Group-3">
                    <path d="M25.0064734,21.0548363 L25.5,21 L39,21 C41.3527389,21.2940924 43.2059076,23.1472611 43.5,25.5 L43.5,33 C42.8780975,35.1766586 41.1766586,36.8780975 39,37.5 L22.5,37.5 C21.3954305,37.5 20.5,36.6045695 20.5,35.5 L20.5,25.5 C20.7932109,23.1543127 22.65699,21.31589 25.0064734,21.0548363 Z M25,26 C24.4477153,26 24,26.4477153 24,27 C24,27.5522847 24.4477153,28 25,28 L39,28 C39.5522847,28 40,27.5522847 40,27 C40,26.4477153 39.5522847,26 39,26 L25,26 Z M25,31 C24.4477153,31 24,31.4477153 24,32 C24,32.5522847 24.4477153,33 25,33 L34,33 C34.5522847,33 35,32.5522847 35,32 C35,31.4477153 34.5522847,31 34,31 L25,31 Z" id="Combined-Shape"></path>
                </g>
            </g>
        </g>
    </g>
</svg>