<?xml version="1.0" encoding="UTF-8"?>
<svg width="339px" height="325px" viewBox="0 0 339 325" version="1.1" xmlns="http://www.w3.org/2000/svg" xmlns:xlink="http://www.w3.org/1999/xlink">
    <!-- Generator: Sketch 52.2 (67145) - http://www.bohemiancoding.com/sketch -->
    <title>Group 4</title>
    <desc>Created with Sketch.</desc>
    <defs>
        <circle id="path-1" cx="161.5" cy="161.5" r="161.5"></circle>
    </defs>
    <g id="Website" stroke="none" stroke-width="1" fill="none" fill-rule="evenodd">
        <g id="Admin---Sign-In-Option-1" transform="translate(-1031.000000, -291.000000)">
            <g id="Group-8" transform="translate(963.000000, 292.000000)">
                <g id="Group-4" transform="translate(68.000000, 0.000000)">
                    <g id="device" transform="translate(15.000000, 0.000000)">
                        <mask id="mask-2" fill="white">
                            <use xlink:href="#path-1"></use>
                        </mask>
                        <use id="Mask" stroke="#F0F0F0" stroke-width="2" fill="#FFFFFF" fill-rule="nonzero" xlink:href="#path-1"></use>
                        <g id="Group-3" mask="url(#mask-2)">
                            <g transform="translate(39.060465, 100.655814)">
                                <path d="M20,0.515902778 L223.828119,0.515902778 C234.873814,0.515902778 243.828119,9.47020778 243.828119,20.5159028 L243.828119,322.233559 L-2.84217094e-14,322.233559 L-3.19744231e-14,20.5159028 C-3.33271306e-14,9.47020778 8.954305,0.515902778 20,0.515902778 Z" id="device" stroke="#70C1B3" stroke-width="2" fill="#FFFFFF"></path>
                                <g id="Group-2" stroke="none" stroke-width="1" fill="none" transform="translate(18.662222, 61.728889)">
                                    <g id="Artwork">
                                        <g id="3-copy">
                                            <path d="M6.5,0 L195.913333,0 C199.503184,-6.59444907e-16 202.413333,2.91014913 202.413333,6.5 L202.413333,68.9088889 C202.413333,72.4987398 199.503184,75.4088889 195.913333,75.4088889 L6.5,75.4088889 C2.91014913,75.4088889 7.52252171e-15,72.4987398 -8.8817842e-16,68.9088889 L8.8817842e-16,6.5 C4.48548481e-16,2.91014913 2.91014913,6.59444907e-16 6.5,0 Z" id="Rectangle-18" fill="#E4E4E5"></path>
                                            <path d="M74.6951323,16.0444444 L179.124762,16.0444444 C181.340037,16.0444444 183.135873,17.8402801 183.135873,20.0555556 L183.135873,20.0555556 C183.135873,22.2708311 181.340037,24.0666667 179.124762,24.0666667 L74.6951323,24.0666667 C72.4798568,24.0666667 70.6840212,22.2708311 70.6840212,20.0555556 L70.6840212,20.0555556 C70.6840212,17.8402801 72.4798568,16.0444444 74.6951323,16.0444444 Z" id="Rectangle" fill="#3A3C43" opacity="0.5"></path>
                                            <path d="M74.6951323,30.4844444 L151.815026,30.4844444 C154.030302,30.4844444 155.826138,32.2802801 155.826138,34.4955556 L155.826138,34.4955556 C155.826138,36.7108311 154.030302,38.5066667 151.815026,38.5066667 L74.6951323,38.5066667 C72.4798568,38.5066667 70.6840212,36.7108311 70.6840212,34.4955556 L70.6840212,34.4955556 C70.6840212,32.2802801 72.4798568,30.4844444 74.6951323,30.4844444 Z" id="Rectangle-Copy" fill="#3A3C43" opacity="0.5"></path>
                                            <path d="M74.6951323,51.3422222 L98.8020106,51.3422222 C101.017286,51.3422222 102.813122,53.1380578 102.813122,55.3533333 L102.813122,55.3533333 C102.813122,57.5686088 101.017286,59.3644444 98.8020106,59.3644444 L74.6951323,59.3644444 C72.4798568,59.3644444 70.6840212,57.5686088 70.6840212,55.3533333 L70.6840212,55.3533333 C70.6840212,53.1380578 72.4798568,51.3422222 74.6951323,51.3422222 Z" id="Rectangle-Copy-2" fill="#3A3C43" opacity="0.35"></path>
                                            <ellipse id="Oval-8" fill="#DF625F" cx="37.7516931" cy="28.0777778" rx="18.4742328" ry="18.4511111"></ellipse>
                                            <path d="M33.6577209,34.7605085 C34.0346046,35.1189936 34.5271561,35.2977778 35.0206714,35.2977778 C35.5141867,35.2977778 36.0067381,35.1189936 36.3836219,34.7605085 L46.022593,25.5920908 C46.7753967,24.8760374 46.7753967,23.7153157 46.022593,22.9992623 C45.2697894,22.2832089 44.0494956,22.2832089 43.296692,22.9992623 L35.0206714,30.8703489 L30.6002392,26.6666294 C29.8474356,25.9505759 28.6271418,25.9505759 27.8743382,26.6666294 C27.1215345,27.3826828 27.1215345,28.5434045 27.8743382,29.2594579 L33.6577209,34.7605085 Z" id="Shape" fill="#FFFFFF" fill-rule="nonzero"></path>
                                        </g>
                                        <g id="3-copy-2" transform="translate(0.000000, 85.035556)">
                                            <path d="M6.5,0 L195.913333,8.8817842e-16 C199.503184,2.28733512e-16 202.413333,2.91014913 202.413333,6.5 L202.413333,68.9088889 C202.413333,72.4987398 199.503184,75.4088889 195.913333,75.4088889 L6.5,75.4088889 C2.91014913,75.4088889 -4.48548481e-16,72.4987398 -8.8817842e-16,68.9088889 L8.8817842e-16,6.5 C4.48548481e-16,2.91014913 2.91014913,6.59444907e-16 6.5,0 Z" id="Rectangle-18" fill="#E4E4E5"></path>
                                            <path d="M74.6951323,16.0444444 L179.124762,16.0444444 C181.340037,16.0444444 183.135873,17.8402801 183.135873,20.0555556 L183.135873,20.0555556 C183.135873,22.2708311 181.340037,24.0666667 179.124762,24.0666667 L74.6951323,24.0666667 C72.4798568,24.0666667 70.6840212,22.2708311 70.6840212,20.0555556 L70.6840212,20.0555556 C70.6840212,17.8402801 72.4798568,16.0444444 74.6951323,16.0444444 Z" id="Rectangle" fill="#3A3C43" opacity="0.5"></path>
                                            <path d="M74.6951323,30.4844444 L151.815026,30.4844444 C154.030302,30.4844444 155.826138,32.2802801 155.826138,34.4955556 L155.826138,34.4955556 C155.826138,36.7108311 154.030302,38.5066667 151.815026,38.5066667 L74.6951323,38.5066667 C72.4798568,38.5066667 70.6840212,36.7108311 70.6840212,34.4955556 L70.6840212,34.4955556 C70.6840212,32.2802801 72.4798568,30.4844444 74.6951323,30.4844444 Z" id="Rectangle-Copy" fill="#3A3C43" opacity="0.5"></path>
                                            <path d="M74.6951323,51.3422222 L98.8020106,51.3422222 C101.017286,51.3422222 102.813122,53.1380578 102.813122,55.3533333 L102.813122,55.3533333 C102.813122,57.5686088 101.017286,59.3644444 98.8020106,59.3644444 L74.6951323,59.3644444 C72.4798568,59.3644444 70.6840212,57.5686088 70.6840212,55.3533333 L70.6840212,55.3533333 C70.6840212,53.1380578 72.4798568,51.3422222 74.6951323,51.3422222 Z" id="Rectangle-Copy-2" fill="#3A3C43" opacity="0.35"></path>
                                            <ellipse id="Oval-8" fill="#237B9F" cx="37.7516931" cy="28.0777778" rx="18.4742328" ry="18.4511111"></ellipse>
                                            <path d="M33.6577209,34.7605085 C34.0346046,35.1189936 34.5271561,35.2977778 35.0206714,35.2977778 C35.5141867,35.2977778 36.0067381,35.1189936 36.3836219,34.7605085 L46.022593,25.5920908 C46.7753967,24.8760374 46.7753967,23.7153157 46.022593,22.9992623 C45.2697894,22.2832089 44.0494956,22.2832089 43.296692,22.9992623 L35.0206714,30.8703489 L30.6002392,26.6666294 C29.8474356,25.9505759 28.6271418,25.9505759 27.8743382,26.6666294 C27.1215345,27.3826828 27.1215345,28.5434045 27.8743382,29.2594579 L33.6577209,34.7605085 Z" id="Shape" fill="#FFFFFF" fill-rule="nonzero"></path>
                                        </g>
                                    </g>
                                </g>
                            </g>
                        </g>
                    </g>
                    <g id="2" transform="translate(0.000000, 44.000000)">
                        <path d="M13.5,0 L268.5,0 C275.955844,-1.36961635e-15 282,6.04415588 282,13.5 L282,91.5 C282,98.9558441 275.955844,105 268.5,105 L13.5,105 C6.04415588,105 9.13077564e-16,98.9558441 0,91.5 L0,13.5 C-9.13077564e-16,6.04415588 6.04415588,1.36961635e-15 13.5,0 Z" id="Rectangle-18" fill="#A7DDBD"></path>
                        <path d="M104.25,22.5 L251.25,22.5 C254.149495,22.5 256.5,24.8505051 256.5,27.75 L256.5,27.75 C256.5,30.6494949 254.149495,33 251.25,33 L104.25,33 C101.350505,33 99,30.6494949 99,27.75 L99,27.75 C99,24.8505051 101.350505,22.5 104.25,22.5 Z" id="Rectangle" fill="#FFFFFF"></path>
                        <path d="M102.75,42 L209.25,42 C212.149495,42 214.5,44.3505051 214.5,47.25 L214.5,47.25 C214.5,50.1494949 212.149495,52.5 209.25,52.5 L102.75,52.5 C99.8505051,52.5 97.5,50.1494949 97.5,47.25 L97.5,47.25 C97.5,44.3505051 99.8505051,42 102.75,42 Z" id="Rectangle-Copy" fill="#FFFFFF"></path>
                        <path d="M102.75,72 L137.25,72 C140.149495,72 142.5,74.3505051 142.5,77.25 L142.5,77.25 C142.5,80.1494949 140.149495,82.5 137.25,82.5 L102.75,82.5 C99.8505051,82.5 97.5,80.1494949 97.5,77.25 L97.5,77.25 C97.5,74.3505051 99.8505051,72 102.75,72 Z" id="Rectangle-Copy-2" fill="#FFFFFF" opacity="0.5"></path>
                        <circle id="Oval-8" fill="#FFFFFF" cx="51" cy="39" r="25.5"></circle>
                        <path d="M45.8970412,48.746558 C46.3955786,49.2492812 47.0471199,49.5 47.6999362,49.5 C48.3527526,49.5 49.0042939,49.2492812 49.5028313,48.746558 L62.2531501,35.8891855 C63.24895,34.8850247 63.24895,33.2572814 62.2531501,32.2531206 C61.2573502,31.2489598 59.6431598,31.2489598 58.6473599,32.2531206 L47.6999362,43.2911748 L41.8526401,37.3960696 C40.8568402,36.3919088 39.2426498,36.3919088 38.2468499,37.3960696 C37.25105,38.4002304 37.25105,40.0279737 38.2468499,41.0321345 L45.8970412,48.746558 Z" id="Shape" fill="#A7DDBD" fill-rule="nonzero"></path>
                    </g>
                </g>
            </g>
        </g>
    </g>
</svg>