{
    "buttons": {
        "cancel": "取消",
        "submit": "提交"
    },
    "changePassword": "",
    "chartRegions": {
        "br": "",
        "ca": "",
        "de": "",
        "fr": "",
        "fr-dep": "",
        "uk": "",
        "us": ""
    },
    "charts": {
        "axis": {
            "stackedAnswerName": ""
        },
        "lineChart": {
            "answers": "",
            "percentage": ""
        },
        "noResults": "",
        "table": {
            "answer": "",
            "attribute": "",
            "mean": "",
            "score": "",
            "stdev": "",
            "value": ""
        },
        "tooltip": {
            "percentageOfProductGroup": "",
            "percentageOfTehGroup": "",
            "percentageOfTotal": "",
            "responses": "",
            "total": ""
        },
        "totalRespondents": ""
    },
    "chartTypes": {
        "bar": "",
        "column": "",
        "columns-mean": "",
        "horizontal-bars-mean": "",
        "line": "",
        "map": "",
        "no-chart": "",
        "pearson-table": "",
        "pie": "",
        "spearmann-table": "",
        "spider": "",
        "stacked-bar": "",
        "stacked-column": "",
        "stacked-column-horizontal-bars": "",
        "table": "",
        "tags-list": ""
    },
    "components": {
        "additionalInfo": {
            "childrenAgeLabel": "",
            "childrenAgePlaceholder": "",
            "childrenAtHome": "",
            "childrenAtHomeMsg": "",
            "childrenAtHomePlaceholder": "",
            "dietaryPlaceholder": "",
            "dietaryTitle": "",
            "ethnicity": "",
            "ethnicityPlaceholder": "",
            "income": "",
            "incomePlaceholder": "",
            "incomeRangePlaceholder": "",
            "productTypePlaceholder": "选择一项或多项",
            "productTypeTitle": "5 - 产品类型",
            "smokerPlaceholder": "",
            "smokerTitle": "4 - 是否吸烟",
            "updateButton": "更新信息"
        },
        "alertModal": {
            "cancel": "取消",
            "delete": "删除"
        },
        "backNavigation": {
            "back": "返回"
        },
        "bottomNavBar": {
            "steps": ""
        },
        "changePassword": {
            "confirmPassword": "",
            "currentPassword": "",
            "forgotPasswordButton": "",
            "newPassword": "",
            "passwordPrompt": "",
            "savePasswordButton": ""
        },
        "chooseMultipleSkipOptions": {
            "answersToBeSelected": "",
            "maxCondintionalOptions": "",
            "showQuestions": ""
        },
        "coverProduct": {
            "empty": "",
            "prompt": "",
            "remove": ""
        },
        "createQrCode": {
            "save": ""
        },
        "createTasterAccount": {
            "forms": {
                "first": {
                    "confirm": {
                        "label": "",
                        "placeholder": ""
                    },
                    "email": {
                        "label": "",
                        "placeholder": ""
                    },
                    "password": {
                        "label": "",
                        "placeholder": ""
                    }
                },
                "second": {
                    "country": {
                        "label": "",
                        "placeholder": ""
                    },
                    "dateofbirth": {
                        "label": "",
                        "placeholder": ""
                    },
                    "firstName": {
                        "label": "",
                        "placeholder": ""
                    },
                    "gender": {
                        "label": "",
                        "placeholder": ""
                    },
                    "langugage": {
                        "label": "",
                        "placeholder": ""
                    },
                    "lastName": {
                        "label": "",
                        "placeholder": ""
                    },
                    "state": {
                        "label": "",
                        "placeholder": ""
                    }
                },
                "third": {
                    "childrenAges": {
                        "label": "",
                        "placeholder": ""
                    },
                    "ethnicity": {
                        "label": "",
                        "placeholder": ""
                    },
                    "foodAllergies": {
                        "label": "",
                        "placeholder": ""
                    },
                    "incomeRange": {
                        "label": "",
                        "placeholder": ""
                    },
                    "marketResearchParticipation": {
                        "label": "",
                        "placeholder": ""
                    },
                    "numberOfChildren": {
                        "label": "",
                        "placeholder": ""
                    },
                    "paypalEmailAddress": {
                        "label": "",
                        "placeholder": ""
                    },
                    "smokerKind": {
                        "label": "",
                        "placeholder": ""
                    }
                }
            },
            "main": {
                "cancelText": "",
                "extraActionText": "",
                "nextStepDefault": "",
                "stepsText": ""
            },
            "steps": {
                "first": {
                    "description": "",
                    "okText": "",
                    "title": ""
                },
                "second": {
                    "description": "",
                    "okText": "",
                    "title": ""
                },
                "third": {
                    "description": "",
                    "okText": "",
                    "title": ""
                }
            },
            "validations": {
                "first": {
                    "confirm": {
                        "oneOf": "",
                        "required": ""
                    },
                    "email": {
                        "required": "",
                        "valid": ""
                    },
                    "password": {
                        "min": "",
                        "required": ""
                    }
                },
                "second": {
                    "firstName": {
                        "required": ""
                    },
                    "lastName": {
                        "required": ""
                    }
                },
                "third": {
                    "childrenAges": {
                        "required": ""
                    },
                    "paypal": {
                        "required": "",
                        "valid": ""
                    }
                }
            }
        },
        "dasboard": {
            "survey": {
                "actions": {
                    "analyzeSurvey": "",
                    "photoValidation": "",
                    "shareStats": {
                        "modal": {
                            "title": ""
                        },
                        "success": {
                            "message": ""
                        }
                    }
                }
            }
        },
        "download": {
            "cancel": "",
            "checking": "",
            "download": "",
            "goToDashboard": "",
            "subTitle": "",
            "title": ""
        },
        "downloadMenu": {
            "downloadJpeg": "",
            "downloadPdf": "",
            "downloadPng": ""
        },
        "editQrCode": {
            "save": "更新"
        },
        "footer": {
            "aboutText": "",
            "privacyPolicy": "",
            "termsAndConditions": ""
        },
        "forgotPasswordForm": {
            "sendButton": ""
        },
        "impersonate": {
            "impersonate": "",
            "impersonatedAs": "",
            "impersonateUser": "",
            "toGoToAdmin": ""
        },
        "inputArea": {
            "addImage": "",
            "linkTitle": ""
        },
        "inputList": {
            "addStep": ""
        },
        "maxProductStatCount": {
            "label": ""
        },
        "ongoingSurveysGrid": {
            "notFound": ""
        },
        "operatorQrCode": {
            "createQr": ""
        },
        "operatorQrCodeDownload": {
            "prompt": "",
            "title": ""
        },
        "operatorQrCodeForm": {
            "alert": {
                "description": "",
                "okText": "",
                "title": ""
            },
            "cancel": "",
            "copy": "",
            "download": "",
            "draft": "",
            "generateQrCodeNotice": "",
            "linkToSurvey": "",
            "linkToUrl": "",
            "name": "",
            "notFound": "",
            "suspended": "",
            "uniqueName": "",
            "uniqueNameHelper": "",
            "validate": {
                "name": {
                    "required": ""
                },
                "redirectLink": "",
                "survey": {
                    "required": ""
                },
                "targetLink": {
                    "required": "",
                    "urlValid": ""
                },
                "uniqueName": {
                    "matches": "",
                    "max": "",
                    "required": ""
                }
            }
        },
        "operatorSurveyDetailBar": {
            "after": "",
            "basics": "",
            "before": "",
            "emailSettings": "",
            "linkedSurveys": "",
            "payments": "",
            "products": "",
            "screening": "",
            "settings": "",
            "tasting": "",
            "tastingNotes": ""
        },
        "operatorSurveyDetailBarChrHansen": {
            "after": ""
        },
        "operatorSurveys": {
            "actions": "",
            "activeSurveys": "",
            "createNew": "",
            "multipleProducts": "",
            "multipleTastings": "",
            "screenerOnly": "",
            "singleProduct": "",
            "title": ""
        },
        "organizationForm": {
            "addedSuccessfully": "",
            "addTitle": "",
            "deletedSuccessfully": "",
            "editTitle": "",
            "organizationName": "",
            "uniqueName": "",
            "uniqueNameTooltip": {
                "add": "",
                "edit": ""
            },
            "updateSuccessfully": ""
        },
        "organizationsList": {
            "actionsColumnTitle": "",
            "add": "",
            "createdColumnTitle": "",
            "delete": "",
            "edit": "",
            "modifiedColumnTitle": "",
            "nameColumnTitle": "",
            "search": "",
            "usersColumnTitle": ""
        },
        "paymentDetailsForm": {
            "bankAccount": "",
            "bankAccountName": "",
            "bankAccountNumber": "",
            "bankBIC": "",
            "bankDescription": "",
            "bankIBAN": "",
            "bankName": "",
            "payPalCard": "使用 PayPal",
            "paypalEmail": "PayPal 电子邮件地址",
            "submitButton": "更新信息"
        },
        "paypalEmailModal": {
            "prompt": "为了获得您的奖励,我们将需要您 PayPal 账户的邮箱地址",
            "title": "请输入您的 PayPal 邮箱地址"
        },
        "personalDetailsForm": {
            "birthday": "",
            "email": "",
            "firstName": "",
            "gender": "",
            "language": "",
            "lastName": "",
            "submitButton": ""
        },
        "privacyForm": {
            "marketingEmails": {
                "description": "",
                "title": ""
            },
            "marketingNotifications": "",
            "marketingPushes": {
                "description": "",
                "title": ""
            },
            "pushNotifications": {
                "description": "",
                "title": ""
            }
        },
        "product": {
            "brand": "",
            "isAvailable": "",
            "name": "",
            "reward": ""
        },
        "productDisplayOptions": {
            "dragAndDropSort": "",
            "forced": "",
            "none": "",
            "note": "",
            "permutation": "",
            "productDisable": "",
            "productDisplayType": "",
            "randomise": "",
            "reverse": ""
        },
        "products": {
            "addProducts": "",
            "apply": "",
            "category": "",
            "columns": {
                "action": "",
                "add": "",
                "name": "",
                "photo": ""
            },
            "search": ""
        },
        "productsTable": {
            "actionEdit": "",
            "actionRemove": "",
            "alertModaldescription": "",
            "alertModalTitle": "",
            "columnAction": "",
            "columnCategory": "",
            "columnClient": "",
            "columnDate": "",
            "columnProductName": ""
        },
        "profile": {
            "title": ""
        },
        "qrCode": {
            "actionsTitle": "",
            "missed": "",
            "nameTitle": ""
        },
        "question": {
            "chooseProduct": {
                "noImage": "",
                "reward": "奖励:"
            }
        },
        "questionCreation": {
            "addOtherConditions": "",
            "analyticalValueOfAnswer": "",
            "chartSection": {
                "chartSettings": "",
                "chartTitle": "",
                "chartTopic": "",
                "chartType": ""
            },
            "chooseMultiple": {
                "maxAnswerValues": "",
                "minAnswerValues": ""
            },
            "chooseOne": {
                "optionsSection": ""
            },
            "chooseProduct": {
                "maxProductsToTaste": "",
                "minProductsToTaste": "",
                "notSelected": ""
            },
            "displayAll": "",
            "displaySurveyName": "",
            "dropdown": {
                "optionsSection": "",
                "prompt": "",
                "secondaryPrompt": ""
            },
            "duplicateButton": "",
            "existingAnswer": "",
            "hideConditionButton": "",
            "hideSkip": "",
            "hideSkipOptions": "",
            "imageAndLabelSettings": {
                "imageAndLabel": "",
                "imageDisplayOptions": "",
                "imageOnly": "",
                "labelOnly": "",
                "questionSettings": "",
                "removeImage": ""
            },
            "infoForm": {
                "prompt": "",
                "secondaryPrompt": ""
            },
            "jumpTo": "",
            "jumpToQuestions": "",
            "location": {
                "region": "",
                "regionRestricted": ""
            },
            "mandatory": "",
            "markAll": "",
            "newQuestion": "",
            "numeric": {
                "labels": {
                    "additionalInformationText": "",
                    "maximum": "",
                    "minimum": "",
                    "numberFormat": "",
                    "questionText": "",
                    "sampleOfNumber": ""
                }
            },
            "openAnswer": "",
            "optionsSection": {
                "addAnswer": "",
                "notSelected": ""
            },
            "paired": {
                "bothPresent": "",
                "customDescriptor": "",
                "descriptors": "",
                "hasFollowUpProfile": "",
                "likingQuestion": "",
                "maximumPairs": "",
                "maxPairs": "",
                "minimumPairs": "",
                "minPairs": "",
                "missingBoth": "",
                "missingOne": "",
                "noverticalRating": "",
                "options": "",
                "pairsOptions": {
                    "bothFlavorsPresentEnabled": "",
                    "customFlavorEnabled": "",
                    "neitherFlavorPresentEnabled": "",
                    "oneFlavorNotPresentEnabled": ""
                },
                "profilePrompt": ""
            },
            "pictureOnAll": "",
            "prompt": "",
            "questionDuplicateError": "",
            "questionDuplicateSuccess": "",
            "questionSectionSelect": "",
            "questionSectionSelectOption": {
                "begin": "",
                "middle": "",
                "screening": ""
            },
            "questionType": "",
            "removeButton": "",
            "removeButtonHelper": "",
            "secondaryPrompt": "",
            "selectAndJustify": {
                "options": "",
                "prompt": "",
                "secondaryPrompt": ""
            },
            "showConditionButton": "",
            "showSkip": "",
            "showSkipOptions": "",
            "slider": {
                "addMarks": "",
                "addSlider": "",
                "addSliders": "",
                "alert": {
                    "deleteMark": "",
                    "deleteSlider": "",
                    "description": "",
                    "okText": ""
                },
                "isInOneRow": "",
                "marks": {
                    "add": "",
                    "isMajor": ""
                },
                "max": "",
                "min": "",
                "profileStepTitle": "",
                "prompt": "",
                "secondaryPrompt": "",
                "showProfile": "",
                "step": ""
            },
            "tagInput": {
                "add": ""
            },
            "tasterName": {
                "allowSpaces": "",
                "answerFormat": "",
                "answerFormats": {
                    "any": "",
                    "digits": "",
                    "letters-and-digits": ""
                },
                "maxLength": "",
                "minLength": ""
            },
            "timestamp": {
                "info": ""
            },
            "verticalRating": {
                "additionalText": "",
                "addSkipingRule": "",
                "maximum": "",
                "minimum": "",
                "noSkipingRule": "",
                "questionText": "",
                "scaleLabels": "",
                "startingFrom": "",
                "upTo": ""
            }
        },
        "register": {
            "back": "",
            "creatingError": "",
            "creatingErrorCheckAgain": "",
            "doLater": "",
            "nextStep": ""
        },
        "requestAccountForm": {
            "submit": "提交"
        },
        "retakes": {
            "header": "此调查仅可参加一次。",
            "subHeader": "您已经完成调查。"
        },
        "shareStatsForm": {
            "organizations": {
                "label": "",
                "tabs": {
                    "all": "",
                    "selected": ""
                }
            },
            "users": {
                "label": "",
                "tabs": {
                    "all": "",
                    "selected": ""
                }
            }
        },
        "socialMedia": {
            "shareFB": "分享到 Facebook",
            "shareLI": "分享到 LinkedIn",
            "shareTW": "分享到 Twitter"
        },
        "storesTable": {
            "actionEdit": "",
            "actionRemove": "",
            "alertModaldescription": "",
            "alertModalTitle": "",
            "columnAction": "",
            "columnCompanyName": "",
            "columnCountry": "",
            "columnDate": "",
            "columnState": ""
        },
        "survey": {
            "notAuthorized": {
                "content": "",
                "title": ""
            }
        },
        "surveyBasicInfoForm": {
            "alert": {
                "description": "",
                "okText": "",
                "title": ""
            },
            "allowedDaysToFillTheTasting": "",
            "allowedUsers": "",
            "authorizationType": "",
            "continueButton": "",
            "copy": "",
            "copySuccessfull": "",
            "country": "",
            "customizeSharing": {
                "description": "",
                "title": ""
            },
            "forceAccount": {
                " end": "",
                "end": "",
                "start": ""
            },
            "forceTasterAccount": "",
            "instruction": "",
            "instructionSteps": "指导步骤",
            "loginText": "",
            "minimumNumber": "",
            "name": "",
            "nextButton": "",
            "pauseText": "",
            "rejection": "",
            "requireRecaptcha": "",
            "screening": "",
            "securitySettings": "",
            "selectLanguage": "",
            "skipButton": "",
            "startSurveyButton": "",
            "surveyUrl": "",
            "takeSurveyMultipleTimes": "",
            "tastingSettings": "",
            "thankYou": "",
            "uniqueName": "",
            "uniqueNameExists": ""
        },
        "surveyComplete": {
            "backToDashboard": "返回操作面板",
            "text": "刚刚完成调查,请检查"
        },
        "surveyFunnel": {
            "columns": {
                "product": "",
                "question": "",
                "responses": ""
            },
            "mainHeader": ""
        },
        "surveyInfoTest": {
            "addYourOwn": "添加您自己的",
            "answered": "已回答",
            "atLeast": "至少回答",
            "bothOptionsPresent": "两个描述项都存在",
            "cantDecide": "我没法决定",
            "close": "关闭",
            "completed": "调查已完成",
            "congratulations": "恭喜",
            "customOption": "自定义描述项",
            "information": "信息",
            "isNotPresent": "不存在",
            "isPresent": "存在",
            "noDescriptorPresent": "两个描述项都不存在",
            "noMorePairs": "没有其他对了,请点击\"下一步\"继续",
            "optionsModalTitle": "错误的描述项？",
            "otherOptions": "其他选项",
            "pair": "一对",
            "pairedQuestionInfo": "在以下问题中,将有多个两两一组的描述性词语。请选择您认为最符合产品的描述性词语。请尽所能回答。答案没有对错之分。",
            "pairs": "多对",
            "pickOption": "选择最能描述您的情况的选项。",
            "rejected": "您被拒绝了",
            "rejectedReasonFirst": "很抱歉,根据您的品鉴资料,您不是此次品鉴调查要找的人。",
            "rejectedReasonSecond": "不过,请不要气馁,我们会考虑让您参加我们未来的品鉴调查。",
            "screeningOk": "您有资格参加此次品鉴调查。请点击下面的按钮以继续。您很快还会收到一封包含此链接的电子邮件作为提醒。",
            "uploadPicture": "请上传您打开的产品的照片,以确认您已正确完成所有操作。为了使您有资格获得奖励,您需要提供一张清楚展示了品鉴中的产品的照片。",
            "writeOption": "在下面输入您自己的选项"
        },
        "surveyInstructions": {
            "title": "品鉴调查说明"
        },
        "surveyList": {
            "completed": "",
            "finished": "",
            "ready": "",
            "rejected": "",
            "retake": ""
        },
        "surveyLogIn": {
            "access": "点击这里进入登录页面。",
            "accessLogin": "如果您有权访问此调查,请先登录。",
            "askForAccount": "",
            "askForEmail": "输入您的电子邮箱以继续。",
            "loginText": "<p>欢迎来到品鉴调查！<\/p>\n<p>请输入您的电子邮箱以继续。<\/p>\n<p>如果您在完成品鉴调查前离开,则可以通过在开始页面中输入您的电子邮箱来继续完成剩余的部分。<\/p>",
            "loginTo": "登录到",
            "nextTimeDetails": "如果您在完成品鉴调查前离开,则可以通过在开始页面中输入您的电子邮箱来继续完成剩余的部分。",
            "notARobot": "请先确认您不是机器人,然后才能开始。",
            "notSelectedToParticipate": "您不在选定的用户之列,无法参与此调查。",
            "pauseText": "<p style='text-align: left;'><strong>感谢您的关注。<\/strong><\/p><p style='text-align: left;'><strong>此项研究已结束。<\/strong><\/p><p style='text-align: left;'><strong>如有其他任何问题,您也可以联系 support@flavorwiki.com。<\/strong><\/p><br><p style='text-align: left;'><strong>谢谢,<\/strong><\/p><p style='text-align: left;'><strong>FlavorWiki 团队。<\/strong><\/p>",
            "pressToStart": "请按下面的按钮开始。",
            "signupFor": "",
            "surveyAvailable": "此调查仅特定用户可参与。",
            "surveyExpired": "感谢您对这项市场研究的关注。该品鉴调查的完成时限已过。",
            "welcome": "欢迎来到品鉴调查！"
        },
        "surveyNavigation": {
            "skipProgressText": "您已经回答了 $t(countProduct, { 'count': {{products}} })。您至少要回答 $t(countProduct, { 'count': {{minimumProducts}} })才可以跳过。"
        },
        "surveyPhotos": {
            "mainHeader": "",
            "noneAvailable": "",
            "successPopup": ""
        },
        "surveyQuestion": {
            "maxAnswerValues": "您必须最多选择 $t(countAnswer, { \"count\": {{maxAnswerValues}} }) 个。",
            "minAnswerValues": "您必须最少选择 $t(countAnswer, { \"count\": {{minAnswerValues}} }) 个,最多可选择 $t(countAnswer, { \"count\": {{maxAnswerValues}} }) 个。",
            "minMaxDiffAnswerValues": "您必须选择 $t(countAnswer, { \"count\": {{minAnswerValues}} }) 到 $t(countAnswer, { \"count\": {{maxAnswerValues}} }) 个。",
            "minMaxSameAnswerValues": "您必须选择 $t(countAnswer, { \"count\": {{maxAnswerValues}} }) 个。",
            "onlyMaxAnswerValues": "您最多只能选择 $t(countAnswer, { \"count\": {{maxAnswerValues}} }) 个。",
            "onlyMinAnswerValues": "您必须至少选择 $t(countAnswer, { \"count\": {{minAnswerValues}} }) 个。"
        },
        "surveysList": {
            "answeredSurveys": ""
        },
        "surveyValidate": {
            "filters": {
                "email": "",
                "total": ""
            }
        },
        "table": {
            "actionRemove": "",
            "alertModalDescription": "",
            "alertModalTitle": "",
            "dateColumnActionTitle": "",
            "dateColumnTitle": "",
            "nameColumnTitle": "",
            "productsColumnTitle": ""
        },
        "tagInput": {
            "add": ""
        },
        "tasterProfile": {
            "birthYear": "",
            "fullName": "",
            "gender": "",
            "nationality": "",
            "submitButton": ""
        },
        "userList": {
            "addFormTitle": "",
            "editFormTitle": ""
        },
        "usersList": {
            "add": "",
            "emailAddress": "",
            "fullName": "",
            "selectOrganization": "",
            "selectType": "",
            "table": {
                "actions": "",
                "delete": "",
                "edit": "",
                "email": "",
                "name": "",
                "organization": "",
                "type": ""
            }
        },
        "userSurvey": {
            "inProgress": "进行中的调查",
            "productsPurchase": "要购买并品尝的产品",
            "timeLeftInProgressDays": "还剩…天来完成调查",
            "timeLeftInProgressHours": "",
            "timeLeftSurveyOngoingDays": "还剩…天来购买并品尝产品",
            "timeLeftSurveyOngoingHours": ""
        },
        "userSurveyCard": {
            "products": "",
            "seeShops": ""
        },
        "verticalRating": {
            "additionalText": "",
            "maximum": "",
            "minimum": "",
            "questionText": "",
            "scaleLabels": "",
            "startingFrom": "",
            "upTo": ""
        }
    },
    "containers": {
        "additionalInfo": {
            "error": "",
            "success": ""
        },
        "addProductsToCreate": {
            "newProduct": ""
        },
        "addQuestionsToCreate": {
            "newStep": ""
        },
        "addQuestionToCreate": {
            "error": "",
            "success": ""
        },
        "authenticatedLayut": {
            "home": "",
            "signOut": ""
        },
        "changePassword": {
            "error": "",
            "success": "",
            "userPasswordError": ""
        },
        "cloneSurveyButton": {
            "alertModalDescriptionNo": "",
            "alertModalDescriptionYes": "",
            "alertModalOkText": "",
            "alertModalTitleNo": "",
            "alertModalTitleYes": "",
            "error": "",
            "success": ""
        },
        "completeTasterProfile": {
            "home": "",
            "signOut": "",
            "subtitle": "",
            "title": ""
        },
        "CompleteTasterProfileForm": {
            "error": "",
            "submissionError": "",
            "validation": {
                "birthYearMax": "",
                "birthYearMin": "",
                "birthYearRequire": "",
                "fullnameRequire": "",
                "genderRequire": "",
                "nationalityRequire": ""
            }
        },
        "createAccount": {
            "additionalInfo": {
                "childrenAgesMin": "",
                "childrenAgesRequire": "",
                "incomeRangeRequire": "",
                "numberOfChildError": "",
                "numberOfChildLessthan": "",
                "numberOfChildMorethan": "",
                "numberOfChildRequire": ""
            },
            "personalInfo": {
                "birthdayRequire": "",
                "firstnameRequire": "",
                "lastnameRequire": "",
                "recaptchaError": "",
                "recaptchaRequire": ""
            },
            "welcomeForm": {
                "confirmMatch": "",
                "confirmRequire": "",
                "emailRequire": "",
                "emailValid": "",
                "passwordMin": "",
                "passwordRequire": ""
            }
        },
        "customButtons": {
            "continue": "",
            "next": "",
            "skip": "",
            "start": ""
        },
        "deleteSurveyButton": {
            "alertModalDescriptionNo": "",
            "alertModalDescriptionYes": "",
            "alertModalOkText": "",
            "alertModalTitleNo": "",
            "alertModalTitleYes": "",
            "error": "",
            "success": ""
        },
        "editQrCode": {
            "save": ""
        },
        "editSurveyButton": {
            "alertModalDefaultOption": {
                "AfterHelpText": "",
                "BeforeHelpText": "",
                "HelpText": ""
            },
            "alertModalOkText": "",
            "alertModalStrictedOption": {
                "BeforeHelpText": "",
                "HelpText": ""
            },
            "alertModalTitle": ""
        },
        "exportSharingContainer": {
            "popups": {
                "downloaded": "",
                "downloading": "",
                "error": ""
            }
        },
        "exportSurveyButton": {
            "alertModalDescription": "",
            "alertModalOkText": "",
            "alertModalTitle": "",
            "emailSend": "",
            "notFound": "",
            "selectUser": ""
        },
        "exportSurveyPhotosButton": {
            "alertModalDescription": "",
            "alertModalOkText": "",
            "alertModalTitle": "",
            "emailSend": "",
            "notFound": "",
            "selectUser": ""
        },
        "forgotPassword": {
            "emailRequire": "",
            "emailValid": "",
            "error": "",
            "infoMessage": ""
        },
        "hooks": {
            "useLoginToSurvey": {
                "errorOnRequest": ""
            }
        },
        "impersonate": {
            "impersonate": "",
            "impersonatedAs": "",
            "toGoToAdmin": ""
        },
        "importGiftCardIncentives": {
            "prompt": "",
            "title": ""
        },
        "importGiftCardShares": {
            "prompt": "",
            "title": ""
        },
        "importProductIncentives": {
            "prompt": "",
            "title": ""
        },
        "importSurveyShares": {
            "prompt": "",
            "title": ""
        },
        "loginForm": {
            "incomingLoginError": "",
            "incomingValidError": "",
            "preventMobileOperatorLogin": "",
            "validation": {
                "emailRequire": "",
                "emailValid": "",
                "passwordMin": "",
                "passwordRequire": ""
            }
        },
        "mandatoryQuestions": {
            "title": ""
        },
        "newPasswordF": {
            "error": "",
            "success": "",
            "validation": {
                "confirmMatch": "",
                "confirmRequire": "",
                "passwordMin": "",
                "passwordRequire": ""
            }
        },
        "operatorCreateQrCode": {
            "successMessage": "",
            "title": ""
        },
        "operatorEditQrCode": {
            "successMessage": "",
            "title": ""
        },
        "operatorQrCode": {
            "description": "",
            "okText": "",
            "title": ""
        },
        "operatorSurveyInfo": {
            "alertModalkLanDescription": "",
            "alertModalLanOkText": "",
            "alertModalLanTitle": "",
            "alertModalOkText": "",
            "alertModalTitle": ""
        },
        "organizationForm": {
            "addedSuccessfully": "",
            "addTitle": "",
            "deletedSuccessfully": "",
            "editTitle": "",
            "organizationName": "",
            "uniqueName": "",
            "updateSuccessfully": ""
        },
        "organizationsList": {
            "alertModalDescription": "",
            "alertModalOkText": "",
            "alertModalTitle": ""
        },
        "page": {
            "additionalInfo": {
                "childAgeLabel": "",
                "childAgePlaceholder": "",
                "childAtHome": "",
                "childAtHomePlaceholder": "",
                "dietary": "",
                "dietaryPlaceholder": "",
                "ethnicity": "",
                "ethnicityPlaceholder": "",
                "income": "",
                "incomePlaceholder": "",
                "incomeRangePlaceholder": "",
                "numberChildPlaceholder": "",
                "product": "",
                "productPlaceholder": "",
                "smoke": "",
                "smokePlaceholder": ""
            },
            "categoriesGridSection": {
                "title": ""
            },
            "createAccount": {
                "additionalInformartionStep": {
                    "description": "",
                    "title": ""
                },
                "personalInformationStep": {
                    "description": "",
                    "title": ""
                },
                "welcomeStep": {
                    "description": "",
                    "title": ""
                }
            },
            "main": {
                "cancelText": "",
                "extraActionText": "",
                "nextStepDefault": ""
            },
            "notFound": {
                "styledText": ""
            },
            "onboarding": {
                "createAccount": {
                    "buttonText": "创建您的账户",
                    "msgText": "创建您的账户,以便开始品鉴调查并获得奖励。",
                    "signupBtnText": "登录",
                    "signupText": "已经有账户？",
                    "title": "新账户"
                },
                "forgotPassword": {
                    "subTitle": "请输入您的电子邮件地址,以便我们向您发送链接以重置您的密码。",
                    "title": "恢复密码"
                },
                "login": {
                    "title": "登录"
                },
                "loginCarousel": {
                    "text": {
                        "buyProductText": "在本地商店购买选定的产品。不用担心,我们来付款！",
                        "cashInText": "品尝一下,然后告诉我们您的想法。赚取现金并赢得超棒的独家品鉴奖励。",
                        "discoverProductText": "注册以品尝您喜欢的类别中的产品。介绍一下您的情况,我们会找到最适合您的选择。",
                        "welcomeText": "在品鉴今日最佳产品的同时,也在影响着今后的食品。获得现金报酬,并赢取超赞的奖励！"
                    },
                    "titles": {
                        "buyProduct": "",
                        "cashIn": "",
                        "discoverProduct": "",
                        "welcome": ""
                    }
                },
                "loginToRole": {
                    "backBtn": "",
                    "styledButton": "",
                    "styledButtonOperator": "",
                    "styledButtonTaster": "",
                    "text": ""
                },
                "newPassword": {
                    "subTitle": "",
                    "title": ""
                },
                "requestAccount": {
                    "subTitle": "",
                    "title": ""
                },
                "requestSubmitted": {
                    "subTitle": "",
                    "title": ""
                }
            },
            "ongoingSurveysSection": {
                "title": ""
            },
            "operator": {
                "menu": {
                    "dashboard": "",
                    "organizations": "",
                    "privacyPolicy": "",
                    "qr-codes": "",
                    "surveys": "",
                    "termsOfUse": "",
                    "users": ""
                }
            },
            "operatorCreateBasics": {
                "title": ""
            },
            "operatorCreateEmailSettings": {
                "title": ""
            },
            "operatorCreatePayments": {
                "title": ""
            },
            "operatorCreateSettings": {
                "title": ""
            },
            "operatorCreateSurveyLinkedSurveys": {
                "label": "",
                "tabs": {
                    "all": "",
                    "selected": ""
                },
                "title": ""
            },
            "OperatorCreateSurveyProducts": {
                "title": ""
            },
            "OperatorCreateSurveyQuestions": {
                "title": ""
            },
            "operatorCreateTastingNotes": {
                "title": ""
            },
            "paidSurveysSection": {
                "title": ""
            },
            "personalInfo": {
                "dobLabel": "",
                "firstnameLabel": "",
                "firstnamePlaceholder": "",
                "genderLabel": "",
                "genderPlaceholder": "",
                "languagesLabel": "",
                "languagesPlaceholder": "",
                "lastnameLabel": "",
                "lastnamePlaceholder": ""
            },
            "pointsSurveySection": {
                "title": ""
            },
            "taster": {
                "promt": "",
                "title": ""
            },
            "welcomeForm": {
                "confirmLabel": "",
                "confirmPlaceholder": "",
                "emailLabel": "",
                "emailPlaceholder": "",
                "passwordLabel": "",
                "passwordPlceholder": ""
            }
        },
        "paymentDetails": {
            "error": "",
            "success": ""
        },
        "personalDetails": {
            "error": "",
            "success": ""
        },
        "previewSurveyDraft": {
            "buttonText": ""
        },
        "privacy": {
            "error": ""
        },
        "productsCreateList": {
            "alertModalDescription": "",
            "alertModalOkText": "",
            "alertModalTitle": ""
        },
        "profileLayout": {
            "additionalInfo": "",
            "changePassword": "",
            "paymentDetails": "",
            "personalDetails": "",
            "privacy": ""
        },
        "publishEditedSurvey": {
            "errorMessage": "",
            "loadingText": "",
            "publishButton": "",
            "successMessage": ""
        },
        "publishSurvey": {
            "errorMessage": "",
            "loadingText": "",
            "publishButton": "",
            "successMessage": ""
        },
        "publishSurveyDraft": {
            "errorMessage": "",
            "loadingText": "",
            "publishButton": "",
            "successMessage": ""
        },
        "questionCreationCardBody": {
            "choose-one": {
                "other": ""
            },
            "OptionsSection": {
                "includeOthers": ""
            }
        },
        "questionCreationCardHeader": {
            "description": "",
            "okText": "",
            "title": ""
        },
        "questionsList": {
            "skipToOptions": {
                "finish": "",
                "reject": "",
                "removeSkip": ""
            }
        },
        "requestAccountForm": {
            "code": "",
            "companyName": "",
            "emailRequired": "",
            "emailValid": "",
            "firstName": "",
            "lastName": "",
            "number": ""
        },
        "saveDraftSurvey": {
            "errorMessage": "",
            "loadingText": "",
            "publishButton": "",
            "successMessage": "",
            "surveyInitialState": ""
        },
        "surveyBasicInfoForm": {
            "alert": {
                "description": "",
                "okText": "",
                "title": ""
            },
            "allowedUsers": "",
            "authorizationType": "",
            "continueButton": "",
            "forceTasterAccount": "",
            "instruction": "",
            "instructionSteps": "指导步骤",
            "minimumNumber": "",
            "name": "",
            "nextButton": "",
            "referralAmount": "",
            "rejection": "",
            "requireRecaptcha": "",
            "screening": "",
            "securitySettings": "",
            "selectLanguage": "",
            "skipButton": "",
            "startSurveyButton": "",
            "takeSurveyMultipleTimes": "",
            "tastingSettings": "",
            "thankYou": "",
            "uniqueName": "",
            "uniqueNameExists": ""
        },
        "surveyList": {
            "completed": ""
        },
        "surveyLogIn": {
            "access": "",
            "accessLogin": "如果您有权访问此调查,请先登录。",
            "askForAccount": "您需要创建一个账户才能继续进行此品鉴调查。请填写所需的密码,并选择您的国家\/地区。",
            "askForEmail": "输入您的电子邮箱以继续。",
            "loginText": "<p>欢迎来到品鉴调查！<\/p>\n<p>请输入您的电子邮箱以继续。<\/p>\n<p>如果您在完成品鉴调查前离开,则可以通过在开始页面中输入您的电子邮箱来继续完成剩余的部分。<\/p>",
            "loginTo": "登录到",
            "nextTimeDetails": "如果您在完成品鉴调查前离开,则可以通过在开始页面中输入您的电子邮箱来继续完成剩余的部分。",
            "notARobot": "请先确认您不是机器人,然后才能开始。",
            "notSelectedToParticipate": "您不在选定的用户之列,无法参与此调查。",
            "pauseText": "<p style='text-align: left;'><strong>感谢您的关注。<\/strong><\/p><p style='text-align: left;'><strong>此项研究已结束。<\/strong><\/p><p style='text-align: left;'><strong>如有其他任何问题,您也可以联系 support@flavorwiki.com。<\/strong><\/p><br><p style='text-align: left;'><strong>谢谢,<\/strong><\/p><p style='text-align: left;'><strong>FlavorWiki 团队。<\/strong><\/p>",
            "pressToStart": "请按下面的按钮开始。",
            "surveyAvailable": "此调查仅特定用户可参与。",
            "surveyExpired": "感谢您对这项市场研究的关注。该品鉴调查的完成时限已过。",
            "surveySuspended.line1": "感谢您对这项市场研究的关注。",
            "surveySuspended.line2": "此项研究已结束。",
            "surveySuspended.line3": "如有其他任何问题,您也可以联系 support@flavorwiki.com。",
            "surveySuspended.line4": "谢谢,",
            "surveySuspended.line5": "FlavorWiki 团队",
            "welcome": "欢迎来到品鉴调查！"
        },
        "surveySharing": {
            "copiedMessage": "链接已复制到剪贴板。",
            "shareTextFirst": "分享此品鉴调查,每有一位您推荐的朋友完成该品鉴调查,您便可获得 {{amount}}！",
            "shareTextLast": "复制您的分享链接。",
            "shareTextMiddle": "点击这里复制您的分享链接。"
        },
        "surveyStats": {
            "editOperatorLayout": "",
            "editTasterLayout": "",
            "fetchError": {
                "description": "",
                "message": ""
            },
            "generateReport": {
                "text": ""
            },
            "invalidError": {
                "description": "",
                "message": ""
            },
            "otherFilters": {
                "buttonText": "",
                "filterText": "",
                "noFilter": "",
                "resetText": "",
                "selectProductsFirst": "",
                "title": ""
            },
            "productsTab": {
                "backToProductSelection": "",
                "buttonText": "",
                "maxNumberError": "您需要选择最少 {{minNumber}} 个产品,最多可选择 {{maxNumber}} 个。您目前已选择了 {{currentNumber}} 个产品。",
                "title": ""
            },
            "validation": {
                "required": "",
                "typeError": ""
            }
        },
        "updateSurvey": {
            "buttonText": "",
            "errorMessage": "",
            "successMessage": "",
            "updatingText": ""
        },
        "updateSurveyDraft": {
            "buttonText": "",
            "errorMessage": "",
            "successMessage": "",
            "updatingText": ""
        },
        "uploadProductPicture": {
            "label": "",
            "limit": ""
        },
        "userProfile": {
            "mainTitle": "",
            "messages": {
                "password": {
                    "error": "",
                    "success": ""
                }
            },
            "tabs": {
                "additional": "",
                "password": "",
                "payment": "",
                "personal": "",
                "privacy": ""
            },
            "validations": {
                "password": {
                    "confirmNewPassword": {
                        "required": "",
                        "shouldMatch": ""
                    },
                    "currentPassword": {
                        "minChars": "",
                        "required": "",
                        "sameAsBefore": ""
                    },
                    "newPassword": {
                        "minChars": "",
                        "required": ""
                    }
                }
            }
        },
        "usersListContainer": {
            "added": "",
            "alertModalDescription": "",
            "alertModalokText": "",
            "alertModalTitle": "",
            "deleted": "",
            "updated": ""
        },
        "useSurveyValidate": {
            "showOnlyMandatoryQuestionErrors": "至少需要一个问题。",
            "showProductsErrors": "",
            "showQuestionsErrors": ""
        }
    },
    "countAnswer": "{{count}} 个回答",
    "countAnswer_plural": "{{count}} 个回答",
    "countProduct": "{{count}} 个产品",
    "countProduct_plural": "{{count}} 个产品",
    "defaultValues": {
        "customButtons": {
            "continue": "继续",
            "next": "下一步",
            "skip": "跳过",
            "start": "开始"
        },
        "customizeSharingMessage": "分享此品鉴调查,每有一位您推荐的朋友完成该品鉴调查,您便可获得 {{amount}}！",
        "instructionSteps": [
            "开始品鉴调查之前,请确保您已拥有所有选定的产品。",
            "找一个安静的地方。",
            "品鉴调查过程中将为您提供其他说明。",
            "待您准备好后,请点击下面的\"开始品鉴调查\"。"
        ],
        "instructionsText": "<p><strong><span style=\"font-size: 20pt;\">欢迎来到品鉴调查！<\/span><\/strong>\n<br \/>感谢您同意参加此次品鉴调查。这份问卷将会询问您目前所消费的产品,帮助我们找到最适合您购买并品尝的产品。调查大概需要 2 到 3 分钟。\n<br \/>答案没有对错之分,因此请如实回答。\n<br \/>如有任何疑问,请使用下面的支持框或发送电子邮件至:support@flavorwiki.com\n<br \/><strong>快乐品尝！ FlavorWiki 团队<\/strong><\/p>",
        "loginText": "<p style='text-align: center;'><strong>欢迎来到品鉴调查！<\/strong><\/p><p style='text-align: center;'><strong>请输入您的电子邮箱以继续。<\/strong><\/p><p style='text-align: center;'><strong>如果您在完成品鉴调查前离开,则可以通过在开始页面中输入您的电子邮箱来继续完成剩余的部分。<\/strong><\/p>",
        "pauseText": "<p style='text-align: left;'><strong>感谢您的关注。<\/strong><\/p><p style='text-align: left;'><strong>此项研究已结束。<\/strong><\/p><p style='text-align: left;'><strong>如有其他任何问题,您也可以联系 support@flavorwiki.com。<\/strong><\/p><br><p style='text-align: left;'><strong>谢谢,<\/strong><\/p><p style='text-align: left;'><strong>FlavorWiki 团队。<\/strong><\/p>",
        "rejectionText": "<p><strong><span style=\"font-size: 20pt;\" data-mce-style=\"font-size: 20pt;\">我们真的非常抱歉……您不能参加此次品鉴！<\/span><\/strong><\/p>\n<p>很抱歉,根据您的品鉴资料,您不是此次品鉴调查要找的人。<br\/>不过,请不要气馁,我们会考虑让您参加我们未来的品鉴调查。<\/p>\n<p>如有任何疑问,请使用下面的支持框或发送电子邮件至:<\/p>\n<p><a href=\"mailto:support@flavorwiki.com\">support@flavorwiki.com<\/a><\/p>\n<p>快乐品尝！<\/p>\n<p>FlavorWiki 团队<\/p>",
        "screeningText": "<p><strong><span style=\"font-size: 20pt;\">恭喜<\/span><\/strong><\/p>\n<p>您有资格参加此次品鉴调查。请点击下面的按钮以继续。<br\/>\n您很快还会收到一封包含此链接的电子邮件作为提醒。<\/p>\n<p>如有任何疑问,请使用下面的支持框或发送电子邮件至:<\/p>\n<p><a href=\"mailto:support@flavorwiki.com\">support@flavorwiki.com<\/a><\/p>\n<p>快乐品尝！<\/p>\n<p>FlavorWiki 团队<\/p>",
        "thankYouText": "<p><strong><span style=\"font-size: 20pt;\">感谢您参与此次调查。<\/span><\/strong>\n<br \/>如果您喜欢此次品鉴调查,请将我们推荐给他人或在我们的 Facebook 主页上留言评论。\n<br \/>如有任何疑问,请使用下面的支持框或发送电子邮件至:support@flavorwiki.com\n<br \/><strong>快乐品尝！ FlavorWiki 团队<\/strong><\/p>"
    },
    "dontHaveAccount": "",
    "dropDownOptions": {
        "choose-date": "",
        "choose-multiple": "",
        "choose-one": "",
        "choose-payment": "",
        "choose-product": "",
        "dropdown": "",
        "email": "",
        "info": "",
        "location": "",
        "numeric": "",
        "open-answer": "",
        "paired-questions": "",
        "paypal-email": "",
        "select-and-justify": "",
        "slider": "",
        "time-stamp": "",
        "upload-picture": "",
        "vertical-rating": ""
    },
    "email": {
        "rejected": "感谢您参与此次调查。<br><br>\n如果您将下面的链接分享给您的朋友,每有一位您推荐的朋友完成该品鉴调查,您便可以获得额外 <strong>{{SSHARING_REWARD}}<\/strong> 的现金奖励 。<br><br>\n{{SHARING_LINK}}<br><br>\n 如果您有任何问题,请发送电子邮件至 <a href=\"mailto:support@flavorwiki.com\">support@flavorwiki.com<\/a>.<br><br>\n              快乐品尝！<br>\n              FlavorWiki 团队",
        "surveyCompleted": {
            "html": "",
            "subject": "",
            "text": ""
        },
        "surveyRejected": {
            "html": "",
            "subject": "",
            "text": ""
        },
        "surveyWaiting": {
            "html": "",
            "subject": "",
            "text": ""
        }
    },
    "emailUs": "如有任何疑问,请使用下面的支持框或发送电子邮件",
    "errors": {
        "ANALYSIS_ERROR": "",
        "E_EXPORT_DEFAULT": "",
        "E_ORG_UNIQUE": "",
        "E_QR_CODE_CREATE": "",
        "E_QR_CODE_SEARCH": "",
        "E_QR_CODE_UNIQUE": "",
        "E_QR_CODE_UPDATE": "",
        "E_REQUEST_ACCOUNT": "",
        "E_UNIQUE": "",
        "E_UNIQUE_USER": "",
        "E_USER_IS_EXISTED": "",
        "FILE_NOT_FOUND": "分享链接无效。",
        "FILE_UNAUTHORIZED": "",
        "inputValidCountry": "",
        "inputValidEmail": "",
        "inputValidPassword": "",
        "NO_APP_URL": "",
        "NO_ORGANIZATION": "",
        "notAuthQrCode": "",
        "notAuthSurvey": "",
        "ORG_DEFAULT_CREATE": "",
        "ORG_DEFAULT_UPDATE": "",
        "pictureTooLarge": "",
        "privacyUpdateError": "",
        "submitAnswerFailed": "",
        "UNAUTHORIZED": "",
        "update": "",
        "updatePaypallFailed": "",
        "uploadPictureFailed": "上传失败,请选择一张照片然后再试一次。",
        "uploadProductPictureFailed": ""
    },
    "forgotPassword": "",
    "happyTasting": "快乐品尝！",
    "languages": {
        "chinese": "",
        "deutsch": "",
        "english": "",
        "french": "",
        "italian": "",
        "japanese": "",
        "korean": "",
        "polish": "",
        "portuguese": "",
        "russian": "",
        "spanish": "",
        "turkish": ""
    },
    "page": {
        "surveyList": {
            "completed": "",
            "finsihed": "",
            "rejected": ""
        }
    },
    "pdfLayoutEditor": {
        "addPage": {
            "tooltip": ""
        },
        "discard": {
            "description": "",
            "ok": "",
            "title": ""
        },
        "loadingData": "",
        "messages": {
            "downloadError": "",
            "saveError": "",
            "saveSuccess": ""
        },
        "pageText": "",
        "paperSize": "",
        "removePage": {
            "disabledTooltip": "",
            "tooltip": ""
        },
        "rendering": "",
        "saveAsTemplate": "",
        "showLayoutBorder": "",
        "title": {
            "operator": "",
            "taster": ""
        },
        "zoom": ""
    },
    "placeholders": {
        "addDescriptor": "输入您自己的描述项",
        "addOpinion": "在这里添加您的选项",
        "addOption": "添加您自己的选项",
        "analyticsValue": "",
        "availableInCountry": "",
        "bankAccountName": "",
        "bankAccountNumber": "",
        "bankBIC": "",
        "bankDescription": "",
        "bankIBAN": "",
        "bankName": "",
        "category": "",
        "chartsSettings": {
            "absolutePercentageValues": "",
            "barsSortOrder": "",
            "howManyDecimals": "",
            "howManyDecimals_axis": "",
            "isDataTableShown_format": "",
            "outlineWidth": ""
        },
        "companyName": "",
        "confirmPassword": "",
        "country": "",
        "currentPassword": "",
        "email": "",
        "emailAddress": "",
        "emailToReach": "",
        "firstName": "",
        "fullName": "",
        "gender": "",
        "inputOption": "输入您自己的选项",
        "jumpTo": "",
        "language": "",
        "lastName": "",
        "MarkLabel": "",
        "markPosition": "",
        "maximumScaleValue": "",
        "mininumScaleValue": "",
        "nationality": "",
        "newPassword": "",
        "password": "",
        "paypalEmail": "",
        "phoneNumber": "",
        "questionAnalytics": "",
        "questionChartType": "",
        "questionJumpTo": "",
        "questionLabel": "",
        "questionMaximumScale": "",
        "questionMinimumScale": "",
        "questionRangeMax": "",
        "questionRangeMin": "",
        "questionSectionSelect": "",
        "questionType": "",
        "search": "",
        "selectAnswers": "",
        "selectBrand": "",
        "selectConditionType": "",
        "selectOne": "选择一个选项",
        "selectOrganization": "",
        "selectType": "",
        "startingFrom": "",
        "typeHere": "在此输入……",
        "upTo": "",
        "user": "",
        "username": "",
        "writeAnswer": "在这里输入您的答案"
    },
    "profileLink": "",
    "requestAccount": "",
    "requestAccountOr": "",
    "requestOneButton": "",
    "requestOperatorAccount": "",
    "requestTasterAccount": "",
    "settings": {
        "charts": {
            "alertModalDescription": "",
            "alertModalTitle": "",
            "cancel": "",
            "error": "",
            "filterByQuestionType": "",
            "globalSettingsTitle": "",
            "optionLabels": {
                "absolutePercentageValues": "",
                "barsSortOrder": "",
                "colorPicker": "",
                "dataformat": {
                    "abs": "",
                    "perc": "",
                    "perc_abs": "",
                    "perc_abs_prod": "",
                    "perc_abs_teh": "",
                    "valueType": ""
                },
                "generalColorPicker": "",
                "groupLabels": "",
                "hasOutline": "",
                "howManyDecimals": "",
                "isCountProGroupShown": "",
                "isCountProLabelShown": "",
                "isDataTableShown": "",
                "isDataTableShown_format": "",
                "isMeanProLabelsShown": "",
                "isProductLabelsSwapped": "",
                "isStackedLabelsReversed": "",
                "isStackedValuesShown": "",
                "isStatisticsTableShown": "",
                "isTotalRespondentsShown": "",
                "mapColorPicker": "",
                "outlineColor": "",
                "outlineWidth": "",
                "percentageGrouping": {
                    "inner": "",
                    "outer": ""
                },
                "percentageGroupingLabel": "",
                "sortOrder": {
                    "nameAsc": "",
                    "nameDesc": "",
                    "valueAsc": "",
                    "valueDesc": ""
                },
                "timestampColorPicker": ""
            },
            "resetDefaults": "",
            "set": "",
            "setGlobal": "",
            "setSimilar": "",
            "settingsPopupTitle": "",
            "success": ""
        }
    },
    "signIn": "",
    "signOut": "",
    "survey": {
        "already_taken": "感谢您的关注。您已经回答了此调查。",
        "surveysListing": "调查清单",
        "termsOfUse": "使用条款"
    },
    "surveyAnalysis": {
        "exitReport": {
            "desc": "",
            "ok": "",
            "title": ""
        },
        "filter": {
            "back": "",
            "next": ""
        },
        "settings": {
            "analysisTypes": "",
            "next": "",
            "question": "",
            "referenceQuestion": ""
        },
        "tabs": {
            "filter": "",
            "report": "",
            "settings": ""
        }
    },
    "surveyCreation": {
        "mandatoryQuestion": ""
    },
    "surveyEmailSettings": {
        "enabledEmailTypes": {
            "survey-completed": "",
            "survey-rejected": "",
            "survey-waiting": ""
        },
        "enabledEmailTypesCaption": ""
    },
    "surveyPayments": {
        "active": "",
        "paymentTypes": {
            "giftCard": "",
            "paypal": ""
        }
    },
    "surveySettings": {
        "autoAdvanceSettings": {
            "active": "",
            "autoAdvance": "",
            "caption": "",
            "debounce": "",
            "hideNextButton": "",
            "nextButton": ""
        },
        "pdfFooterData": {
            "label": ""
        },
        "pdfFooterSettings": {
            "note": ""
        },
        "screenerOnly": {
            "active": "",
            "title": ""
        },
        "sharingButtons": {
            "label": "",
            "yes": ""
        },
        "showGeneratePdf": {
            "active": "是",
            "title": "启用品鉴员端报告 (PDF)"
        },
        "tastingNotes": {
            "country": "",
            "customer": "",
            "dateOfTasting": "",
            "otherInfo": "",
            "tastingId": "",
            "tastingLeader": ""
        },
        "valdatedChartData": {
            "label": "",
            "yes": ""
        },
        "validations": {
            "debounce": {
                "max": "",
                "min": "",
                "required": "",
                "step": ""
            }
        }
    },
    "theFlavorWikiTeam": "FlavorWiki 团队",
    "tooltips": {
        "cloneSurveyButton": "",
        "copyQr": "",
        "copySurveyUrlButton": "",
        "debounceTooltip": "",
        "deletePicture": "",
        "deleteQr": "",
        "deleteSurveyButton": "",
        "downloadQr": "",
        "duplicateQuestion": "",
        "editDraftButton": "",
        "editQr": "",
        "editSurveyAlertFullOption": "",
        "editSurveyAlertStrictOption": "",
        "editSurveyButton": "",
        "exportGiftCardIncentivesButton": "",
        "exportGiftCardSharesButton": "",
        "exportProductIncentivesButton": "",
        "exportSharingButton": "",
        "exportSurveyButton": "",
        "exportSurveyPhotosButton": "",
        "forms": {
            "uniqueNameTooltip": {
                "add": "",
                "edit": ""
            }
        },
        "funnelActions": "",
        "hideNextButtonTooltip": "",
        "imageDisplayOptionsHelper": "",
        "importGiftCardIncentives": "",
        "importGiftCardShares": "",
        "importProductIncentives": "",
        "importSurveyShares": "",
        "invalidSurveyPhotos": "",
        "likingQuestionRestricted": "",
        "moreActions": "",
        "newProduct": "",
        "newQuestion": "",
        "notProcessedSurveyPhotos": "",
        "operatorSurveyDetailBar": {
            "after": "",
            "basics": "",
            "before": "",
            "linkedSurveys": "",
            "payments": "",
            "products": "",
            "screening": "",
            "settings": "",
            "tasting": "",
            "tastingNotes": ""
        },
        "pauseSurvey": "",
        "previewDraft": "",
        "product": {
            "brand": "",
            "canNotDelete": "",
            "isAvailable": "",
            "name": "",
            "picture": "",
            "reward": ""
        },
        "productDisplayDragAndDrop": "",
        "productDisplayOptions": "",
        "publishSurvey": "",
        "questionCreation": {
            "maxProductsToTaste": "",
            "minProductsToTaste": "",
            "prompt": "",
            "secondaryPrompt": ""
        },
        "questionHeader": {
            "choose-payment": "",
            "choose-product": "",
            "paypal-email": ""
        },
        "questionType": {
            "choose-date": "",
            "choose-multiple": "",
            "choose-one": "",
            "dropdown": "",
            "email": "",
            "info": "",
            "location": "",
            "numeric": "",
            "open-answer": "",
            "paired-questions": "",
            "select-and-justify": "",
            "slider": "",
            "time-stamp": "",
            "upload-picture": "",
            "vertical-rating": ""
        },
        "removeQuestion": "",
        "resumeSurvey": "",
        "saveDraft": "",
        "saveDraftSurvey": "",
        "screenerOnly": "",
        "ShareSurveyStats": "",
        "showGeneratePdf": "允许您的品鉴员下载 PDF 格式的图表。",
        "stats": {
            "addColor": "",
            "reset": "",
            "setGlobal": ""
        },
        "strictOptions": "",
        "surveyBasicInfoForm": {
            "authorizationType": "",
            "continueButton": "",
            "country": "",
            "customizeSharing": "",
            "instruction": "",
            "instructionSteps": "",
            "loginText": "",
            "name": "",
            "nextButton": "",
            "pauseText": "",
            "referralAmount": "",
            "rejection": "",
            "screening": "",
            "securitySettings": "",
            "selectLanguage": "",
            "skipButton": "",
            "startSurveyButton": "",
            "staticUniqueName": "",
            "thankYou": "",
            "uniqueName": ""
        },
        "surveyCharts": "",
        "updateSurvey": "",
        "updateSurveyDraft": "",
        "validSurveyPhotos": ""
    },
    "tooltips.likingQuestionRestricted": "",
    "validation": {
        "analyticsValue": "",
        "analyticsValueIsPositive": "",
        "analyticsValueWithoutSpaces": "",
        "basics": {
            "allowedDaysToFillTheTasting": {
                "integer": "",
                "max": "",
                "min": "",
                "required": ""
            },
            "customButtons": {
                "continueEmptySpaces": "",
                "continueRequired": "",
                "nextEmptySpaces": "",
                "nextRequired": "",
                "skipEmptySpaces": "",
                "skipRequired": "",
                "startEmptySpaces": "",
                "startRequired": ""
            },
            "excluseiveTasters": {
                "email": "",
                "required": "",
                "withoutSpaces": ""
            },
            "instruction": "",
            "instructionRequired": "需要说明",
            "instructionWithoutSpaces": "",
            "maxProductStatCount": {
                "isMax": "",
                "max": "",
                "min": "",
                "required": ""
            },
            "name": {
                "required": "",
                "withoutSpaces": ""
            },
            "referralAmount": {
                "isNumber": "",
                "max": "",
                "min": "",
                "required": ""
            },
            "uniquName": {
                "required": "",
                "restrict": "",
                "withoutSpaces": ""
            }
        },
        "birthday": {
            "required": ""
        },
        "chartTitle": {
            "required": "",
            "whitespace": ""
        },
        "chartTopic": {
            "required": "",
            "whitespace": ""
        },
        "chartType": {
            "minProductsForCorrelation": "",
            "required": "",
            "wrongChartType": ""
        },
        "chooseProduct": {
            "equalOrLess": "",
            "greaterThan": "",
            "maxProducts": {
                "integer": "",
                "required": ""
            },
            "minProducts": {
                "integer": "",
                "required": ""
            }
        },
        "confirmPassword": {
            "required": ""
        },
        "currentPassword": {
            "required": ""
        },
        "dropdown": {
            "minim": "",
            "options": {
                "analytics": {
                    "required": ""
                },
                "label": {
                    "required": ""
                }
            },
            "prompt": "",
            "uniqueOptions": ""
        },
        "email": {
            "email": "",
            "required": ""
        },
        "emailTemplate": {
            "html": {
                "required": ""
            },
            "subject": {
                "required": ""
            },
            "text": {
                "required": ""
            }
        },
        "firstname": {
            "required": ""
        },
        "info": {
            "prompt": "",
            "secondaryPrompt": ""
        },
        "integer": "",
        "label": "",
        "labelWithoutSpaces": "",
        "lastname": {
            "required": ""
        },
        "location": {
            "region": ""
        },
        "multiple": {
            "maxAnswerValues": {
                "lessThanTotal": "",
                "min": "",
                "moreThanMin": "",
                "typeError": ""
            },
            "minAnswerValues": {
                "lessThanMax": "",
                "lessThanTotal": "",
                "min": "",
                "typeError": ""
            },
            "minim": "",
            "options": {
                "analytics": {
                    "required": ""
                },
                "label": {
                    "required": ""
                }
            },
            "uniqueOptions": ""
        },
        "newPassword": {
            "required": ""
        },
        "numeric": {
            "greaterOrEqual": "",
            "integer": "",
            "lessOrEqual": "",
            "maxNumber": "",
            "minNumber": "",
            "moreThan": "",
            "questionRequired": ""
        },
        "one": {
            "minim": "",
            "options": {
                "analytics": {
                    "required": ""
                },
                "label": {
                    "required": ""
                }
            },
            "uniqueOptions": ""
        },
        "organizationForm": {
            "name": {
                "maxLength": "",
                "required": "",
                "withoutSpaces": ""
            },
            "uniqueName": {
                "matches": "",
                "required": ""
            }
        },
        "paired": {
            "likingQuestion": "",
            "options": {
                "integer": "",
                "max": "",
                "min": "",
                "required": ""
            },
            "pairs": {
                "min": "",
                "unique": ""
            },
            "profileTitle": {
                "required": "",
                "string": ""
            }
        },
        "product": {
            "reward": ""
        },
        "products": {
            "brand": "",
            "brandWithoutSpaces": "",
            "isAvailable": "",
            "name": "",
            "nameWithoutSpaces": "",
            "rewardMin": "",
            "rewardNumber": "",
            "rewardWithoutSpaces": ""
        },
        "profileTitle": {
            "required": "",
            "string": "",
            "withoutSpaces": ""
        },
        "prompt": "",
        "promptWithoutSpaces": "",
        "questionCreation": {
            "questionType": {
                "required": ""
            }
        },
        "required": "",
        "requiredField": "",
        "secondaryPrompt": "",
        "secondaryPromptWithoutSpaces": "",
        "selectAndJustify": {
            "minim": "",
            "options": {
                "analytics": {
                    "required": ""
                },
                "label": {
                    "required": ""
                }
            },
            "prompt": "",
            "secondaryPrompt": "",
            "uniqueOptions": ""
        },
        "slider": {
            "promptString": "",
            "range": {
                "marks": {
                    "label": {
                        "required": "",
                        "string": ""
                    },
                    "unique": "",
                    "value": {
                        "lessThan": "",
                        "moreThan": "",
                        "number": "",
                        "required": ""
                    },
                    "withoutSpaces": ""
                },
                "max": {
                    "digits": "",
                    "greaterThan": "",
                    "number": "",
                    "required": ""
                },
                "min": {
                    "digits": "",
                    "greaterThan": "",
                    "lessThan": "",
                    "number": "",
                    "required": ""
                },
                "sliders": {
                    "atLeast": "",
                    "required": "",
                    "unique": "",
                    "withoutSpaces": ""
                },
                "step": {
                    "digits": "",
                    "greaterThan": "",
                    "lessThan": "",
                    "number": "",
                    "required": "",
                    "submultiple": ""
                }
            },
            "secondaryPrompt": ""
        },
        "surveyAnalysis": {
            "analysisTypes": {
                "minRequired": ""
            },
            "filterProducts": {
                "minRequired": ""
            },
            "filterQuestions": {
                "error": "",
                "minRequired": ""
            },
            "question": {
                "required": ""
            },
            "referenceQuestion": {
                "required": ""
            }
        },
        "surveyBasicInfoForm": {
            "name": {
                "required": ""
            }
        },
        "tasterName": {
            "digitsOnly": "",
            "lettersDigitsOnly": "",
            "maxLength": "",
            "minLength": "",
            "noSpaces": "",
            "settings": {
                "maxLength": {
                    "min": "",
                    "moreThanMin": "",
                    "typeError": ""
                },
                "minLength": {
                    "lessThanMax": "",
                    "min": "",
                    "typeError": ""
                }
            }
        },
        "userForm": {
            "email": {
                "maxLength": "",
                "required": ""
            },
            "fullName": {
                "maxLength": "",
                "nameWithoutSpaces": "",
                "required": ""
            },
            "organization": {
                "typeError": ""
            }
        },
        "vertical": {
            "range": {
                "labels": {
                    "canBeUsed": "",
                    "required": ""
                },
                "max": {
                    "greaterThanMin": "",
                    "integer": "",
                    "moreThan": ""
                },
                "min": {
                    "greaterThan0": "",
                    "integer": "",
                    "lessThan": "",
                    "moreThan": ""
                },
                "skipMax": {
                    "integer": "",
                    "lessThan": "",
                    "moreThan": "",
                    "number": ""
                },
                "skipMin": {
                    "integer": "",
                    "lessThan": "",
                    "moreThan": "",
                    "number": ""
                }
            }
        }
    }
}