// Jest Snapshot v1, https://goo.gl/fbAQLP

exports[`BackNavigation should render BackNavigation 1`] = `
<styled.div
  onClick={[Function]}
>
  <Styled(Icon)
    type="left"
  />
  <Styled(Text)>
    Back nav
  </Styled(Text)>
</styled.div>
`;
