// Jest Snapshot v1, https://goo.gl/fbAQLP

exports[`Sider should render Sider 1`] = `
<Styled(Sider)
  collapsed={true}
  theme="light"
  width={256}
>
  <styled.div
    collapsed={true}
    src="FlavorWiki_Leaf_Logo.png"
  />
  <Styled(Divider)
    styled={
      Object {
        "collapsed": true,
      }
    }
  />
  <Menu
    activeMenuEntry="Menu 1"
    entries={
      Array [
        Object {
          "title": "Menu 1",
          "visible": true,
        },
        Object {
          "title": "Menu 2",
          "visible": true,
        },
      ]
    }
    handleMenuClick={[Function]}
  />
</Styled(Sider)>
`;
