// Jest Snapshot v1, https://goo.gl/fbAQLP

exports[`BackNavigation should render SurveysGridComponent 1`] = `
<ApolloProvider
  client={MockedClient {}}
>
  <Router
    history={
      Object {
        "goBack": [Function],
        "listen": [Function],
        "location": Object {
          "pathname": "",
        },
        "push": [Function],
      }
    }
  >
    <withRouter(BackNavigation)
      desktop=""
      title="Back"
    >
      <Route>
        <BackNavigation
          desktop=""
          history={
            Object {
              "goBack": [Function],
              "listen": [Function],
              "location": Object {
                "pathname": "",
              },
              "push": [Function],
            }
          }
          location={
            Object {
              "pathname": "",
            }
          }
          match={
            Object {
              "isExact": false,
              "params": Object {},
              "path": "/",
              "url": "/",
            }
          }
          title="Back"
        >
          <withI18nextTranslation(BackNavigation)
            action={[Function]}
            title="Back"
          >
            <BackNavigation
              action={[Function]}
              i18n={I18n {}}
              t={[Function]}
              tReady={true}
              title="Back"
            >
              <styled.div
                onClick={[Function]}
              >
                <div
                  className="sc-bwzfXH gJccbZ"
                  onClick={[Function]}
                >
                  <Styled(Icon)
                    type="left"
                  >
                    <Icon
                      className="sc-bxivhb cUKra"
                      type="left"
                    >
                      <LocaleReceiver
                        componentName="Icon"
                      >
                        <i
                          aria-label="icon: left"
                          className="anticon anticon-left sc-bxivhb cUKra"
                        >
                          <IconReact
                            className=""
                            type="left-o"
                          >
                            <svg
                              aria-hidden="true"
                              className=""
                              data-icon="left"
                              fill="currentColor"
                              focusable="false"
                              height="1em"
                              viewBox="64 64 896 896"
                              width="1em"
                            >
                              <path
                                d="M724 218.3V141c0-6.7-7.7-10.4-12.9-6.3L260.3 486.8a31.86 31.86 0 0 0 0 50.3l450.8 352.1c5.3 4.1 12.9.4 12.9-6.3v-77.3c0-4.9-2.3-9.6-6.1-12.6l-360-281 360-281.1c3.8-3 6.1-7.7 6.1-12.6z"
                              />
                            </svg>
                          </IconReact>
                        </i>
                      </LocaleReceiver>
                    </Icon>
                  </Styled(Icon)>
                  <Styled(Text)>
                    <Text
                      className="sc-htpNat ebOqKH"
                    >
                      <styled.span
                        className="sc-htpNat ebOqKH"
                      >
                        <span
                          className="sc-htpNat ebOqKH sc-bdVaJa lbzbgo"
                        >
                          Back
                        </span>
                      </styled.span>
                    </Text>
                  </Styled(Text)>
                </div>
              </styled.div>
            </BackNavigation>
          </withI18nextTranslation(BackNavigation)>
        </BackNavigation>
      </Route>
    </withRouter(BackNavigation)>
  </Router>
</ApolloProvider>
`;
