// Jest Snapshot v1, https://goo.gl/fbAQLP

exports[`ForgotPassword should render ForgotPassword 1`] = `
<ApolloProvider
  client={MockedClient {}}
>
  <Router
    history={
      Object {
        "createHref": [Function],
        "listen": [Function],
        "location": Object {
          "pathname": "",
        },
        "push": [Function],
      }
    }
  >
    <withRouter(ForgotPassword)>
      <Route>
        <ForgotPassword
          history={
            Object {
              "createHref": [Function],
              "listen": [Function],
              "location": Object {
                "pathname": "",
              },
              "push": [Function],
            }
          }
          location={
            Object {
              "pathname": "",
            }
          }
          match={
            Object {
              "isExact": false,
              "params": Object {},
              "path": "/",
              "url": "/",
            }
          }
        >
          <div>
            <Title>
              <styled.p>
                <p
                  className="sc-bdVaJa crHsrX"
                >
                  containers.page.onboarding.forgotPassword.title
                </p>
              </styled.p>
            </Title>
            <SubTitle>
              <Styled(styled.span)>
                <styled.span
                  className="sc-bxivhb foCTfh"
                >
                  <span
                    className="sc-bxivhb foCTfh sc-htpNat iKsDeC"
                  >
                    containers.page.onboarding.forgotPassword.subTitle
                  </span>
                </styled.span>
              </Styled(styled.span)>
            </SubTitle>
            <Component
              handleGoBack={[Function]}
            >
              <div />
            </Component>
            <TermsAndPrivacyFooter>
              <TermsAndPrivacyFooterComponent
                t={[Function]}
              >
                <styled.div
                  isSurvey={false}
                >
                  <div
                    className="sc-bwzfXH dPPbgQ"
                  >
                    <Link
                      replace={false}
                      target="_blank"
                      to="/terms-of-use"
                    >
                      <a
                        onClick={[Function]}
                        target="_blank"
                      >
                        survey.termsOfUse
                      </a>
                    </Link>
                  </div>
                </styled.div>
              </TermsAndPrivacyFooterComponent>
            </TermsAndPrivacyFooter>
          </div>
        </ForgotPassword>
      </Route>
    </withRouter(ForgotPassword)>
  </Router>
</ApolloProvider>
`;
