// Jest Snapshot v1, https://goo.gl/fbAQLP

exports[`SurveyNavigationButton should render SurveyNavigation Button 1`] = `
<styled.div
  fullWidth={false}
>
  <Styled(CustomButton)
    onClick={[Function]}
    type="primary"
  />
</styled.div>
`;
