// Jest Snapshot v1, https://goo.gl/fbAQLP

exports[`PointsSurveysSection should render PointsSurveysSection 1`] = `
<PointsSurveysSection>
  <Section
    dark={true}
    title="containers.page.pointsSurveySection.title"
  >
    <Component>
      <MediaQuery
        query="(min-width: 992px)"
        values={null}
      >
        <styled.div
          dark={true}
          desktop={false}
        >
          <div
            className="sc-htoDjs btckWo"
          >
            <PageContainer>
              <styled.div>
                <div
                  className="sc-gzVnrw ifcLWY"
                >
                  <SectionTitle
                    title="containers.page.pointsSurveySection.title"
                  >
                    <Component>
                      <MediaQuery
                        query="(min-width: 992px)"
                        values={null}
                      >
                        <styled.div
                          desktop={false}
                        >
                          <div
                            className="sc-bwzfXH fDBhUb"
                          >
                            <styled.div>
                              <div
                                className="sc-htpNat cTBEdg"
                              >
                                <Styled(Styled(Text))
                                  desktop={false}
                                >
                                  <Styled(Text)
                                    className="sc-ifAKCX gikKIl"
                                    desktop={false}
                                  >
                                    <Text
                                      className="sc-ifAKCX gikKIl sc-bxivhb xKxib"
                                      desktop={false}
                                    >
                                      <styled.span
                                        className="sc-ifAKCX gikKIl sc-bxivhb xKxib"
                                        desktop={false}
                                      >
                                        <span
                                          className="sc-ifAKCX gikKIl sc-bxivhb xKxib sc-bdVaJa lbzbgo"
                                        >
                                          containers.page.pointsSurveySection.title
                                        </span>
                                      </styled.span>
                                    </Text>
                                  </Styled(Text)>
                                </Styled(Styled(Text))>
                                <Styled(Styled(Text))>
                                  <Styled(Text)
                                    className="sc-EHOje jVOIXE"
                                  >
                                    <Text
                                      className="sc-EHOje jVOIXE sc-bxivhb xKxib"
                                    >
                                      <styled.span
                                        className="sc-EHOje jVOIXE sc-bxivhb xKxib"
                                      >
                                        <span
                                          className="sc-EHOje jVOIXE sc-bxivhb xKxib sc-bdVaJa lbzbgo"
                                        />
                                      </styled.span>
                                    </Text>
                                  </Styled(Text)>
                                </Styled(Styled(Text))>
                              </div>
                            </styled.div>
                          </div>
                        </styled.div>
                      </MediaQuery>
                    </Component>
                  </SectionTitle>
                  <Component>
                    <div />
                  </Component>
                </div>
              </styled.div>
            </PageContainer>
          </div>
        </styled.div>
      </MediaQuery>
    </Component>
  </Section>
</PointsSurveysSection>
`;
