// Jest Snapshot v1, https://goo.gl/fbAQLP

exports[`PointsSurveysGrid should render loader 1`] = `
<ApolloProvider
  client={MockedClient {}}
>
  <PointsSurveysGrid
    desktop=""
    user={null}
  />
</ApolloProvider>
`;
