// Jest Snapshot v1, https://goo.gl/fbAQLP

exports[`TabHeader should render TabHeader 1`] = `
<styled.div>
  <styled.div>
    100
  </styled.div>
  <styled.span>
    Answered
  </styled.span>
</styled.div>
`;
