// Jest Snapshot v1, https://goo.gl/fbAQLP

exports[`SelectCountry should render SelectCountry 1`] = `
<FormItem
  hasFeedback={false}
  help=""
  validateStatus="success"
>
  <Select
    fieldDecorator={[Function]}
    getOptionName={[Function]}
    getOptionValue={[Function]}
    isDisabledOption={[Function]}
    onChange={[Function]}
    optionFilterProp="children"
    options={
      Array [
        Object {
          "code": "AF",
          "dial": "+93",
          "name": "Afghanistan",
        },
        Object {
          "code": "AX",
          "dial": "+358",
          "name": "Åland Islands",
        },
        Object {
          "code": "AL",
          "dial": "+355",
          "name": "Albania",
        },
        Object {
          "code": "DZ",
          "dial": "+213",
          "name": "Algeria",
        },
        Object {
          "code": "AS",
          "dial": "+1684",
          "name": "American Samoa",
        },
        Object {
          "code": "AD",
          "dial": "+376",
          "name": "Andorra",
        },
        Object {
          "code": "AO",
          "dial": "+244",
          "name": "Angola",
        },
        Object {
          "code": "AI",
          "dial": "+1264",
          "name": "Anguilla",
        },
        Object {
          "code": "AQ",
          "dial": "+672",
          "name": "Antarctica",
        },
        Object {
          "code": "AG",
          "dial": "+1268",
          "name": "Antigua and Barbuda",
        },
        Object {
          "code": "AR",
          "dial": "+54",
          "name": "Argentina",
        },
        Object {
          "code": "AM",
          "dial": "+374",
          "name": "Armenia",
        },
        Object {
          "code": "AW",
          "dial": "+297",
          "name": "Aruba",
        },
        Object {
          "code": "AU",
          "currency": "AUD",
          "dial": "+61",
          "name": "Australia",
          "referralAmount": 0,
        },
        Object {
          "code": "AT",
          "dial": "+43",
          "name": "Austria",
        },
        Object {
          "code": "AZ",
          "dial": "+994",
          "name": "Azerbaijan",
        },
        Object {
          "code": "BS",
          "dial": "+1242",
          "name": "Bahamas",
        },
        Object {
          "code": "BH",
          "dial": "+973",
          "name": "Bahrain",
        },
        Object {
          "code": "BD",
          "currency": "BDT",
          "dial": "+880",
          "name": "Bangladesh",
          "referralAmount": 0,
        },
        Object {
          "code": "BB",
          "dial": "+1246",
          "name": "Barbados",
        },
        Object {
          "code": "BY",
          "dial": "+375",
          "name": "Belarus",
        },
        Object {
          "code": "BE",
          "dial": "+32",
          "name": "Belgium",
        },
        Object {
          "code": "BZ",
          "dial": "+501",
          "name": "Belize",
        },
        Object {
          "code": "BJ",
          "dial": "+229",
          "name": "Benin",
        },
        Object {
          "code": "BM",
          "dial": "+1441",
          "name": "Bermuda",
        },
        Object {
          "code": "BT",
          "dial": "+975",
          "name": "Bhutan",
        },
        Object {
          "code": "BO",
          "dial": "+591",
          "name": "Bolivia, Plurinational State of bolivia",
        },
        Object {
          "code": "BA",
          "dial": "+387",
          "name": "Bosnia and Herzegovina",
        },
        Object {
          "code": "BW",
          "dial": "+267",
          "name": "Botswana",
        },
        Object {
          "code": "BV",
          "dial": "+47",
          "name": "Bouvet Island",
        },
        Object {
          "code": "BR",
          "currency": "BRL",
          "dial": "+55",
          "name": "Brazil",
          "referralAmount": 0,
        },
        Object {
          "code": "IO",
          "dial": "+246",
          "name": "British Indian Ocean Territory",
        },
        Object {
          "code": "BN",
          "dial": "+673",
          "name": "Brunei Darussalam",
        },
        Object {
          "code": "BG",
          "currency": "BGN",
          "dial": "+359",
          "name": "Bulgaria",
          "referralAmount": 0,
        },
        Object {
          "code": "BF",
          "dial": "+226",
          "name": "Burkina Faso",
        },
        Object {
          "code": "BI",
          "dial": "+257",
          "name": "Burundi",
        },
        Object {
          "code": "KH",
          "dial": "+855",
          "name": "Cambodia",
        },
        Object {
          "code": "CM",
          "dial": "+237",
          "name": "Cameroon",
        },
        Object {
          "code": "CA",
          "currency": "CAD",
          "dial": "+1",
          "name": "Canada",
          "referralAmount": 0,
        },
        Object {
          "code": "CV",
          "dial": "+238",
          "name": "Cape Verde",
        },
        Object {
          "code": "KY",
          "dial": "+ 345",
          "name": "Cayman Islands",
        },
        Object {
          "code": "CF",
          "dial": "+236",
          "name": "Central African Republic",
        },
        Object {
          "code": "TD",
          "dial": "+235",
          "name": "Chad",
        },
        Object {
          "code": "CL",
          "currency": "CLP",
          "dial": "+56",
          "name": "Chile",
          "referralAmount": 0,
        },
        Object {
          "code": "CN",
          "currency": "CNY",
          "dial": "+86",
          "name": "China",
          "referralAmount": 0,
        },
        Object {
          "code": "CX",
          "dial": "+61",
          "name": "Christmas Island",
        },
        Object {
          "code": "CC",
          "dial": "+61",
          "name": "Cocos (Keeling) Islands",
        },
        Object {
          "code": "CO",
          "currency": "COP",
          "dial": "+57",
          "name": "Colombia",
          "referralAmount": 0,
        },
        Object {
          "code": "KM",
          "dial": "+269",
          "name": "Comoros",
        },
        Object {
          "code": "CG",
          "dial": "+242",
          "name": "Congo",
        },
        Object {
          "code": "CD",
          "dial": "+243",
          "name": "Congo, The Democratic Republic of the Congo",
        },
        Object {
          "code": "CK",
          "dial": "+682",
          "name": "Cook Islands",
        },
        Object {
          "code": "CR",
          "dial": "+506",
          "name": "Costa Rica",
        },
        Object {
          "code": "CI",
          "dial": "+225",
          "name": "Cote d'Ivoire",
        },
        Object {
          "code": "HR",
          "currency": "HRK",
          "dial": "+385",
          "name": "Croatia",
          "referralAmount": 0,
        },
        Object {
          "code": "CU",
          "dial": "+53",
          "name": "Cuba",
        },
        Object {
          "code": "CY",
          "dial": "+357",
          "name": "Cyprus",
        },
        Object {
          "code": "CZ",
          "dial": "+420",
          "name": "Czech Republic",
        },
        Object {
          "code": "DK",
          "currency": "DKK",
          "dial": "+45",
          "name": "Denmark",
          "referralAmount": 0,
        },
        Object {
          "code": "DJ",
          "dial": "+253",
          "name": "Djibouti",
        },
        Object {
          "code": "DM",
          "dial": "+1767",
          "name": "Dominica",
        },
        Object {
          "code": "DO",
          "dial": "+1849",
          "name": "Dominican Republic",
        },
        Object {
          "code": "EC",
          "dial": "+593",
          "name": "Ecuador",
        },
        Object {
          "code": "EG",
          "dial": "+20",
          "name": "Egypt",
        },
        Object {
          "code": "SV",
          "dial": "+503",
          "name": "El Salvador",
        },
        Object {
          "code": "GQ",
          "dial": "+240",
          "name": "Equatorial Guinea",
        },
        Object {
          "code": "ER",
          "dial": "+291",
          "name": "Eritrea",
        },
        Object {
          "code": "EE",
          "dial": "+372",
          "name": "Estonia",
        },
        Object {
          "code": "ET",
          "dial": "+251",
          "name": "Ethiopia",
        },
        Object {
          "code": "FK",
          "dial": "+500",
          "name": "Falkland Islands (Malvinas)",
        },
        Object {
          "code": "FO",
          "dial": "+298",
          "name": "Faroe Islands",
        },
        Object {
          "code": "FJ",
          "dial": "+679",
          "name": "Fiji",
        },
        Object {
          "code": "FI",
          "dial": "+358",
          "name": "Finland",
        },
        Object {
          "code": "FR",
          "dial": "+33",
          "name": "France",
        },
        Object {
          "code": "GF",
          "dial": "+594",
          "name": "French Guiana",
        },
        Object {
          "code": "PF",
          "dial": "+689",
          "name": "French Polynesia",
        },
        Object {
          "code": "TF",
          "dial": "+262",
          "name": "French Southern Territories",
        },
        Object {
          "code": "GA",
          "dial": "+241",
          "name": "Gabon",
        },
        Object {
          "code": "GM",
          "dial": "+220",
          "name": "Gambia",
        },
        Object {
          "code": "GE",
          "currency": "GEL",
          "dial": "+995",
          "name": "Georgia",
          "referralAmount": 0,
        },
        Object {
          "code": "DE",
          "currency": "EUR",
          "dial": "+49",
          "name": "Germany",
          "referralAmount": 0,
        },
        Object {
          "code": "GH",
          "dial": "+233",
          "name": "Ghana",
        },
        Object {
          "code": "GI",
          "dial": "+350",
          "name": "Gibraltar",
        },
        Object {
          "code": "GR",
          "dial": "+30",
          "name": "Greece",
        },
        Object {
          "code": "GL",
          "dial": "+299",
          "name": "Greenland",
        },
        Object {
          "code": "GD",
          "dial": "+1473",
          "name": "Grenada",
        },
        Object {
          "code": "GP",
          "dial": "+590",
          "name": "Guadeloupe",
        },
        Object {
          "code": "GU",
          "dial": "+1671",
          "name": "Guam",
        },
        Object {
          "code": "GT",
          "dial": "+502",
          "name": "Guatemala",
        },
        Object {
          "code": "GG",
          "dial": "+44",
          "name": "Guernsey",
        },
        Object {
          "code": "GN",
          "dial": "+224",
          "name": "Guinea",
        },
        Object {
          "code": "GW",
          "dial": "+245",
          "name": "Guinea-Bissau",
        },
        Object {
          "code": "GY",
          "dial": "+592",
          "name": "Guyana",
        },
        Object {
          "code": "HT",
          "dial": "+509",
          "name": "Haiti",
        },
        Object {
          "code": "HM",
          "dial": "+0",
          "name": "Heard Island and Mcdonald Islands",
        },
        Object {
          "code": "VA",
          "dial": "+379",
          "name": "Holy See (Vatican City State)",
        },
        Object {
          "code": "HN",
          "dial": "+504",
          "name": "Honduras",
        },
        Object {
          "code": "HK",
          "dial": "+852",
          "name": "Hong Kong",
        },
        Object {
          "code": "HU",
          "currency": "HUF",
          "dial": "+36",
          "name": "Hungary",
          "referralAmount": 0,
        },
        Object {
          "code": "IS",
          "dial": "+354",
          "name": "Iceland",
        },
        Object {
          "code": "IN",
          "currency": "INR",
          "dial": "+91",
          "name": "India",
          "referralAmount": 0,
        },
        Object {
          "code": "ID",
          "currency": "IDR",
          "dial": "+62",
          "name": "Indonesia",
          "referralAmount": 0,
        },
        Object {
          "code": "IR",
          "dial": "+98",
          "name": "Iran, Islamic Republic of Persian Gulf",
        },
        Object {
          "code": "IQ",
          "dial": "+964",
          "name": "Iraq",
        },
        Object {
          "code": "IE",
          "dial": "+353",
          "name": "Ireland",
        },
        Object {
          "code": "IM",
          "dial": "+44",
          "name": "Isle of Man",
        },
        Object {
          "code": "IL",
          "currency": "ILS",
          "dial": "+972",
          "name": "Israel",
          "referralAmount": 0,
        },
        Object {
          "code": "IT",
          "dial": "+39",
          "name": "Italy",
        },
        Object {
          "code": "JM",
          "dial": "+1876",
          "name": "Jamaica",
        },
        Object {
          "code": "JP",
          "currency": "JPY",
          "dial": "+81",
          "name": "Japan",
          "referralAmount": 0,
        },
        Object {
          "code": "JE",
          "dial": "+44",
          "name": "Jersey",
        },
        Object {
          "code": "JO",
          "dial": "+962",
          "name": "Jordan",
        },
        Object {
          "code": "KZ",
          "dial": "+7",
          "name": "Kazakhstan",
        },
        Object {
          "code": "KE",
          "currency": "KES",
          "dial": "+254",
          "name": "Kenya",
          "referralAmount": 0,
        },
        Object {
          "code": "KI",
          "dial": "+686",
          "name": "Kiribati",
        },
        Object {
          "code": "KP",
          "dial": "+850",
          "name": "Korea, Democratic People's Republic of Korea",
        },
        Object {
          "code": "KR",
          "currency": "KRW",
          "dial": "+82",
          "name": "Korea, Republic of South Korea",
          "referralAmount": 0,
        },
        Object {
          "code": "XK",
          "dial": "+383",
          "name": "Kosovo",
        },
        Object {
          "code": "KW",
          "dial": "+965",
          "name": "Kuwait",
        },
        Object {
          "code": "KG",
          "dial": "+996",
          "name": "Kyrgyzstan",
        },
        Object {
          "code": "LA",
          "dial": "+856",
          "name": "Laos",
        },
        Object {
          "code": "LV",
          "dial": "+371",
          "name": "Latvia",
        },
        Object {
          "code": "LB",
          "dial": "+961",
          "name": "Lebanon",
        },
        Object {
          "code": "LS",
          "dial": "+266",
          "name": "Lesotho",
        },
        Object {
          "code": "LR",
          "dial": "+231",
          "name": "Liberia",
        },
        Object {
          "code": "LY",
          "dial": "+218",
          "name": "Libyan Arab Jamahiriya",
        },
        Object {
          "code": "LI",
          "dial": "+423",
          "name": "Liechtenstein",
        },
        Object {
          "code": "LT",
          "dial": "+370",
          "name": "Lithuania",
        },
        Object {
          "code": "LU",
          "dial": "+352",
          "name": "Luxembourg",
        },
        Object {
          "code": "MO",
          "dial": "+853",
          "name": "Macao",
        },
        Object {
          "code": "MK",
          "dial": "+389",
          "name": "Macedonia",
        },
        Object {
          "code": "MG",
          "dial": "+261",
          "name": "Madagascar",
        },
        Object {
          "code": "MW",
          "dial": "+265",
          "name": "Malawi",
        },
        Object {
          "code": "MY",
          "currency": "MYR",
          "dial": "+60",
          "name": "Malaysia",
          "referralAmount": 0,
        },
        Object {
          "code": "MV",
          "dial": "+960",
          "name": "Maldives",
        },
        Object {
          "code": "ML",
          "dial": "+223",
          "name": "Mali",
        },
        Object {
          "code": "MT",
          "dial": "+356",
          "name": "Malta",
        },
        Object {
          "code": "MH",
          "dial": "+692",
          "name": "Marshall Islands",
        },
        Object {
          "code": "MQ",
          "dial": "+596",
          "name": "Martinique",
        },
        Object {
          "code": "MR",
          "dial": "+222",
          "name": "Mauritania",
        },
        Object {
          "code": "MU",
          "dial": "+230",
          "name": "Mauritius",
        },
        Object {
          "code": "YT",
          "dial": "+262",
          "name": "Mayotte",
        },
        Object {
          "code": "MX",
          "currency": "MXN",
          "dial": "+52",
          "name": "Mexico",
          "referralAmount": 0,
        },
        Object {
          "code": "FM",
          "dial": "+691",
          "name": "Micronesia, Federated States of Micronesia",
        },
        Object {
          "code": "MD",
          "dial": "+373",
          "name": "Moldova",
        },
        Object {
          "code": "MC",
          "dial": "+377",
          "name": "Monaco",
        },
        Object {
          "code": "MN",
          "dial": "+976",
          "name": "Mongolia",
        },
        Object {
          "code": "ME",
          "dial": "+382",
          "name": "Montenegro",
        },
        Object {
          "code": "MS",
          "dial": "+1664",
          "name": "Montserrat",
        },
        Object {
          "code": "MA",
          "currency": "MAD",
          "dial": "+212",
          "name": "Morocco",
          "referralAmount": 0,
        },
        Object {
          "code": "MZ",
          "dial": "+258",
          "name": "Mozambique",
        },
        Object {
          "code": "MM",
          "dial": "+95",
          "name": "Myanmar",
        },
        Object {
          "code": "NA",
          "dial": "+264",
          "name": "Namibia",
        },
        Object {
          "code": "NR",
          "dial": "+674",
          "name": "Nauru",
        },
        Object {
          "code": "NP",
          "dial": "+977",
          "name": "Nepal",
        },
        Object {
          "code": "NL",
          "dial": "+31",
          "name": "Netherlands",
        },
        Object {
          "code": "AN",
          "dial": "+599",
          "name": "Netherlands Antilles",
        },
        Object {
          "code": "NC",
          "dial": "+687",
          "name": "New Caledonia",
        },
        Object {
          "code": "NZ",
          "currency": "NZD",
          "dial": "+64",
          "name": "New Zealand",
          "referralAmount": 0,
        },
        Object {
          "code": "NI",
          "dial": "+505",
          "name": "Nicaragua",
        },
        Object {
          "code": "NE",
          "dial": "+227",
          "name": "Niger",
        },
        Object {
          "code": "NG",
          "currency": "NGN",
          "dial": "+234",
          "name": "Nigeria",
          "referralAmount": 0,
        },
        Object {
          "code": "NU",
          "dial": "+683",
          "name": "Niue",
        },
        Object {
          "code": "NF",
          "dial": "+672",
          "name": "Norfolk Island",
        },
        Object {
          "code": "MP",
          "dial": "+1670",
          "name": "Northern Mariana Islands",
        },
        Object {
          "code": "NO",
          "currency": "NOK",
          "dial": "+47",
          "name": "Norway",
          "referralAmount": 0,
        },
        Object {
          "code": "OM",
          "dial": "+968",
          "name": "Oman",
        },
        Object {
          "code": "PK",
          "currency": "PKR",
          "dial": "+92",
          "name": "Pakistan",
          "referralAmount": 0,
        },
        Object {
          "code": "PW",
          "dial": "+680",
          "name": "Palau",
        },
        Object {
          "code": "PS",
          "dial": "+970",
          "name": "Palestinian Territory, Occupied",
        },
        Object {
          "code": "PA",
          "dial": "+507",
          "name": "Panama",
        },
        Object {
          "code": "PG",
          "dial": "+675",
          "name": "Papua New Guinea",
        },
        Object {
          "code": "PY",
          "dial": "+595",
          "name": "Paraguay",
        },
        Object {
          "code": "PE",
          "currency": "PEN",
          "dial": "+51",
          "name": "Peru",
          "referralAmount": 0,
        },
        Object {
          "code": "PH",
          "currency": "PHP",
          "dial": "+63",
          "name": "Philippines",
          "referralAmount": 0,
        },
        Object {
          "code": "PN",
          "dial": "+64",
          "name": "Pitcairn",
        },
        Object {
          "code": "PL",
          "currency": "PLN",
          "dial": "+48",
          "name": "Poland",
          "referralAmount": 0,
        },
        Object {
          "code": "PT",
          "dial": "+351",
          "name": "Portugal",
        },
        Object {
          "code": "PR",
          "dial": "+1939",
          "name": "Puerto Rico",
        },
        Object {
          "code": "QA",
          "dial": "+974",
          "name": "Qatar",
        },
        Object {
          "code": "RO",
          "currency": "RON",
          "dial": "+40",
          "name": "Romania",
          "referralAmount": 0,
        },
        Object {
          "code": "RU",
          "currency": "RUB",
          "dial": "+7",
          "name": "Russia",
          "referralAmount": 0,
        },
        Object {
          "code": "RW",
          "dial": "+250",
          "name": "Rwanda",
        },
        Object {
          "code": "RE",
          "dial": "+262",
          "name": "Reunion",
        },
        Object {
          "code": "BL",
          "dial": "+590",
          "name": "Saint Barthelemy",
        },
        Object {
          "code": "SH",
          "dial": "+290",
          "name": "Saint Helena, Ascension and Tristan Da Cunha",
        },
        Object {
          "code": "KN",
          "dial": "+1869",
          "name": "Saint Kitts and Nevis",
        },
        Object {
          "code": "LC",
          "dial": "+1758",
          "name": "Saint Lucia",
        },
        Object {
          "code": "MF",
          "dial": "+590",
          "name": "Saint Martin",
        },
        Object {
          "code": "PM",
          "dial": "+508",
          "name": "Saint Pierre and Miquelon",
        },
        Object {
          "code": "VC",
          "dial": "+1784",
          "name": "Saint Vincent and the Grenadines",
        },
        Object {
          "code": "WS",
          "dial": "+685",
          "name": "Samoa",
        },
        Object {
          "code": "SM",
          "dial": "+378",
          "name": "San Marino",
        },
        Object {
          "code": "ST",
          "dial": "+239",
          "name": "Sao Tome and Principe",
        },
        Object {
          "code": "SA",
          "dial": "+966",
          "name": "Saudi Arabia",
        },
        Object {
          "code": "SN",
          "dial": "+221",
          "name": "Senegal",
        },
        Object {
          "code": "RS",
          "dial": "+381",
          "name": "Serbia",
        },
        Object {
          "code": "SC",
          "dial": "+248",
          "name": "Seychelles",
        },
        Object {
          "code": "SL",
          "dial": "+232",
          "name": "Sierra Leone",
        },
        Object {
          "code": "SG",
          "currency": "SGD",
          "dial": "+65",
          "name": "Singapore",
          "referralAmount": 0,
        },
        Object {
          "code": "SK",
          "dial": "+421",
          "name": "Slovakia",
        },
        Object {
          "code": "SI",
          "dial": "+386",
          "name": "Slovenia",
        },
        Object {
          "code": "SB",
          "dial": "+677",
          "name": "Solomon Islands",
        },
        Object {
          "code": "SO",
          "dial": "+252",
          "name": "Somalia",
        },
        Object {
          "code": "ZA",
          "currency": "ZAR",
          "dial": "+27",
          "name": "South Africa",
          "referralAmount": 0,
        },
        Object {
          "code": "SS",
          "dial": "+211",
          "name": "South Sudan",
        },
        Object {
          "code": "GS",
          "dial": "+500",
          "name": "South Georgia and the South Sandwich Islands",
        },
        Object {
          "code": "ES",
          "dial": "+34",
          "name": "Spain",
        },
        Object {
          "code": "LK",
          "currency": "LKR",
          "dial": "+94",
          "name": "Sri Lanka",
          "referralAmount": 0,
        },
        Object {
          "code": "SD",
          "dial": "+249",
          "name": "Sudan",
        },
        Object {
          "code": "SR",
          "dial": "+597",
          "name": "Suriname",
        },
        Object {
          "code": "SJ",
          "dial": "+47",
          "name": "Svalbard and Jan Mayen",
        },
        Object {
          "code": "SZ",
          "dial": "+268",
          "name": "Swaziland",
        },
        Object {
          "code": "SE",
          "currency": "SEK",
          "dial": "+46",
          "name": "Sweden",
          "referralAmount": 0,
        },
        Object {
          "code": "CH",
          "currency": "CHF",
          "dial": "+41",
          "name": "Switzerland",
          "referralAmount": 0,
        },
        Object {
          "code": "SY",
          "dial": "+963",
          "name": "Syrian Arab Republic",
        },
        Object {
          "code": "TW",
          "dial": "+886",
          "name": "Taiwan",
        },
        Object {
          "code": "TJ",
          "dial": "+992",
          "name": "Tajikistan",
        },
        Object {
          "code": "TZ",
          "dial": "+255",
          "name": "Tanzania, United Republic of Tanzania",
        },
        Object {
          "code": "TH",
          "currency": "THB",
          "dial": "+66",
          "name": "Thailand",
          "referralAmount": 0,
        },
        Object {
          "code": "TL",
          "dial": "+670",
          "name": "Timor-Leste",
        },
        Object {
          "code": "TG",
          "dial": "+228",
          "name": "Togo",
        },
        Object {
          "code": "TK",
          "dial": "+690",
          "name": "Tokelau",
        },
        Object {
          "code": "TO",
          "dial": "+676",
          "name": "Tonga",
        },
        Object {
          "code": "TT",
          "dial": "+1868",
          "name": "Trinidad and Tobago",
        },
        Object {
          "code": "TN",
          "dial": "+216",
          "name": "Tunisia",
        },
        Object {
          "code": "TR",
          "currency": "TRY",
          "dial": "+90",
          "name": "Turkey",
          "referralAmount": 0,
        },
        Object {
          "code": "TM",
          "dial": "+993",
          "name": "Turkmenistan",
        },
        Object {
          "code": "TC",
          "dial": "+1649",
          "name": "Turks and Caicos Islands",
        },
        Object {
          "code": "TV",
          "dial": "+688",
          "name": "Tuvalu",
        },
        Object {
          "code": "UG",
          "dial": "+256",
          "name": "Uganda",
        },
        Object {
          "code": "UA",
          "currency": "UAH",
          "dial": "+380",
          "name": "Ukraine",
          "referralAmount": 0,
        },
        Object {
          "code": "AE",
          "currency": "AED",
          "dial": "+971",
          "name": "United Arab Emirates",
          "referralAmount": 0,
        },
        Object {
          "code": "GB",
          "currency": "GBP",
          "dial": "+44",
          "name": "United Kingdom",
          "referralAmount": 0,
        },
        Object {
          "code": "US",
          "currency": "USD",
          "dial": "+1",
          "name": "United States of America",
          "referralAmount": 0,
        },
        Object {
          "code": "UY",
          "dial": "+598",
          "name": "Uruguay",
        },
        Object {
          "code": "UZ",
          "dial": "+998",
          "name": "Uzbekistan",
        },
        Object {
          "code": "VU",
          "dial": "+678",
          "name": "Vanuatu",
        },
        Object {
          "code": "VE",
          "dial": "+58",
          "name": "Venezuela, Bolivarian Republic of Venezuela",
        },
        Object {
          "code": "VN",
          "currency": "VND",
          "dial": "+84",
          "name": "Vietnam",
          "referralAmount": 0,
        },
        Object {
          "code": "VG",
          "dial": "+1284",
          "name": "Virgin Islands, British",
        },
        Object {
          "code": "VI",
          "dial": "+1340",
          "name": "Virgin Islands, U.S.",
        },
        Object {
          "code": "WF",
          "dial": "+681",
          "name": "Wallis and Futuna",
        },
        Object {
          "code": "YE",
          "dial": "+967",
          "name": "Yemen",
        },
        Object {
          "code": "ZM",
          "dial": "+260",
          "name": "Zambia",
        },
        Object {
          "code": "ZW",
          "dial": "+263",
          "name": "Zimbabwe",
        },
      ]
    }
    placeholder=""
    showSearch={false}
    t={[Function]}
  />
</FormItem>
`;
