// Jest Snapshot v1, https://goo.gl/fbAQLP

exports[`QuestionCreationCardSectionSelect should render QuestionCreationCardSectionSelect 1`] = `
<FormItem
  hasFeedback={false}
>
  <Select
    fieldDecorator={[Function]}
    getOptionName={[Function]}
    getOptionValue={[Function]}
    isDisabledOption={[Function]}
    label="components.questionCreation.questionSectionSelect"
    onChange={[Function]}
    options={
      Array [
        "screening",
        "begin",
        "middle",
        "end",
      ]
    }
    placeholder="placeholders.questionSectionSelect"
    size="default"
    t={[Function]}
    value="Test Display"
  />
</FormItem>
`;
