// Jest Snapshot v1, https://goo.gl/fbAQLP

exports[`SubCategory should render SubCategory 1`] = `
<AuthenticatedLayoutContainer
  withFooter={true}
>
  <styled.div>
    <withRouter(BackNavigation) />
    <SectionTitle
      title="Cate 1"
    />
    <withRouter(SubCategoriesGrid) />
  </styled.div>
</AuthenticatedLayoutContainer>
`;
