// Jest Snapshot v1, https://goo.gl/fbAQLP

exports[`LoadingModal should render LoadingModal 1`] = `
<Pagination
  defaultCurrent={1}
  onChange={[Function]}
  showSizeChanger={true}
  total={50}
/>
`;
