// Jest Snapshot v1, https://goo.gl/fbAQLP

exports[`SurveyCompleted Should set Values for SurveyQuestion component  1`] = `
<ApolloProvider
  client={MockedClient {}}
>
  <Router
    history={
      Object {
        "action": "POP",
        "block": [Function],
        "createHref": [Function],
        "go": [Function],
        "goBack": [Function],
        "goForward": [Function],
        "length": 1,
        "listen": [Function],
        "location": Object {
          "hash": "",
          "pathname": "/",
          "search": "",
          "state": undefined,
        },
        "push": [Function],
        "replace": [Function],
      }
    }
  >
    <withRouter(withI18nextTranslation(SurveyCompleted))
      desktop=""
      match={
        Object {
          "params": Object {
            "surveyId": "survey-1",
          },
        }
      }
      surveyId="survey-1"
    >
      <Route>
        <withI18nextTranslation(SurveyCompleted)
          desktop=""
          history={
            Object {
              "action": "POP",
              "block": [Function],
              "createHref": [Function],
              "go": [Function],
              "goBack": [Function],
              "goForward": [Function],
              "length": 1,
              "listen": [Function],
              "location": Object {
                "hash": "",
                "pathname": "/",
                "search": "",
                "state": undefined,
              },
              "push": [Function],
              "replace": [Function],
            }
          }
          location={
            Object {
              "hash": "",
              "pathname": "/",
              "search": "",
              "state": undefined,
            }
          }
          match={
            Object {
              "isExact": true,
              "params": Object {},
              "path": "/",
              "url": "/",
            }
          }
          surveyId="survey-1"
        >
          <SurveyCompleted
            desktop=""
            history={
              Object {
                "action": "POP",
                "block": [Function],
                "createHref": [Function],
                "go": [Function],
                "goBack": [Function],
                "goForward": [Function],
                "length": 1,
                "listen": [Function],
                "location": Object {
                  "hash": "",
                  "pathname": "/",
                  "search": "",
                  "state": undefined,
                },
                "push": [Function],
                "replace": [Function],
              }
            }
            i18n={I18n {}}
            location={
              Object {
                "hash": "",
                "pathname": "/",
                "search": "",
                "state": undefined,
              }
            }
            match={
              Object {
                "isExact": true,
                "params": Object {},
                "path": "/",
                "url": "/",
              }
            }
            surveyId="survey-1"
            t={[Function]}
            tReady={true}
          >
            Error! Network error: No more mocked responses for the query: query survey($id: ID) {
              survey(id: $id) {
                ...surveyInfo
                screeners {
                  id
                  uniqueName
                }
              }
            }
            
            fragment surveyInfo on Survey {
              ...surveyBasicInfo
              instructionsText
              instructionSteps
              ...surveyQuestionsBasicInfo
              thankYouText
              rejectionText
              screeningText
              customizeSharingMessage
              loginText
              pauseText
            }
            
            fragment surveyBasicInfo on Survey {
              coverPhoto
              id
              name
              uniqueName
              owner
              state
              minimumProducts
              maximumProducts
              surveyLanguage
              instructionSteps
              products {
                id
                name
                photo
                brand
                reward
                isAvailable
                isSurveyCover
                sortingOrderId
              }
              authorizationType
              exclusiveTasters {
                emailAddress
              }
              sharedStatsUsers {
                id
                organization {
                  id
                }
              }
              allowRetakes
              isScreenerOnly
              productDisplayType
              showGeneratePdf
              linkedSurveys {
                id
                name
                uniqueName
              }
              forcedAccount
              forcedAccountLocation
              tastingNotes {
                tastingId
                tastingLeader
                customer
                country
                dateOfTasting
                otherInfo
              }
              autoAdvanceSettings {
                active
                debounce
                hideNextButton
              }
              pdfFooterSettings {
                active
                footerNote
              }
              enabledEmailTypes
              emails {
                surveyWaiting {
                  subject
                  html
                  text
                }
                surveyRejected {
                  subject
                  html
                  text
                }
                surveyCompleted {
                  subject
                  html
                  text
                }
              }
              sharingButtons
              validatedData
              showOnTasterDashboard
              referralAmount
              savedRewards
              settings
              country
              maxProductStatCount
              customizeSharingMessage
              loginText
              pauseText
              allowedDaysToFillTheTasting
              isPaypalSelected
              isGiftCardSelected
              customButtons {
                continue
                start
                next
                skip
              }
              createdAt
              updatedAt
            }
            
            fragment surveyQuestionsBasicInfo on Survey {
              id
              name
              screeningQuestions {
                ...questionNavigationInfo
              }
              setupQuestions {
                ...questionNavigationInfo
              }
              productsQuestions {
                ...questionNavigationInfo
              }
              finishingQuestions {
                ...questionNavigationInfo
              }
              paymentQuestions {
                ...questionNavigationInfo
              }
              authorizationType
              settings
            }
            
            fragment questionNavigationInfo on Question {
              id
              order
              type
              nextQuestion
              displayOn
            }
            , variables: {"id":"survey-1"}
          </SurveyCompleted>
        </withI18nextTranslation(SurveyCompleted)>
      </Route>
    </withRouter(withI18nextTranslation(SurveyCompleted))>
  </Router>
</ApolloProvider>
`;
