<?xml version="1.0" encoding="UTF-8"?>
<svg width="17px" height="23px" viewBox="0 0 17 23" version="1.1" xmlns="http://www.w3.org/2000/svg" xmlns:xlink="http://www.w3.org/1999/xlink">
    <!-- Generator: Sketch 52.2 (67145) - http://www.bohemiancoding.com/sketch -->
    <title>Group</title>
    <desc>Created with Sketch.</desc>
    <g id="Symbols" stroke="none" stroke-width="1" fill="none" fill-rule="evenodd">
        <g id="Placeholder/_Small/Survey" transform="translate(-11.000000, -8.000000)" fill="#FFFFFF">
            <g id="Placeholder">
                <g id="BG">
                    <g id="noun_Survey_580745-(1)" transform="translate(11.000000, 8.000000)">
                        <g id="Group">
                            <path d="M12.491875,3.26420313 C12.4595313,3.15639063 12.4092188,3.05217188 12.3445313,2.95873438 C12.204375,2.75389063 11.9923438,2.60654688 11.7515625,2.54185938 C11.6617188,2.51670313 11.5682813,2.50592188 11.4748438,2.50592188 L10.853125,2.50592188 L10.853125,2.41607813 C10.83875,1.21576563 9.85046875,0.241859375 8.65015625,0.241859375 L8.6178125,0.241859375 C8.006875,0.241859375 7.45703125,0.486234375 7.05453125,0.877953125 C6.655625,1.27326563 6.4040625,1.81592188 6.396875,2.41607813 L6.396875,2.50592188 L5.77515625,2.50592188 C5.68171875,2.50592188 5.58828125,2.51670313 5.4984375,2.54185938 C5.25765625,2.60654688 5.045625,2.75389063 4.90546875,2.95873438 C4.84078125,3.05217188 4.79046875,3.15639063 4.758125,3.26420313 C4.74015625,3.32529688 4.72578125,3.39357813 4.7221875,3.46185938 L4.7221875,4.68373438 C4.72578125,4.75560938 4.74015625,4.82029688 4.758125,4.88139063 C4.88390625,5.32342188 5.27921875,5.62889063 5.735625,5.64685938 L11.5071875,5.64685938 C11.9707813,5.62889063 12.3660938,5.32342188 12.491875,4.88139063 C12.5098438,4.82029688 12.5242188,4.75560938 12.5278125,4.69092188 L12.5278125,3.45467188 C12.5242188,3.39357813 12.5098438,3.32889063 12.491875,3.26420313 Z M9.80734375,2.50592188 L7.44265625,2.50592188 L7.44265625,2.41248438 C7.460625,1.79076563 7.978125,1.28764063 8.59984375,1.28764063 L8.65015625,1.28764063 C9.271875,1.28764063 9.789375,1.79076563 9.80734375,2.41248438 L9.80734375,2.50592188 Z" id="Shape" fill-rule="nonzero"></path>
                            <path d="M16.8927813,17.523125 L16.8917031,17.3200781 C16.8902656,16.8406719 16.8884688,16.3454531 16.8888281,15.8592188 C16.8891875,14.7196406 16.8888281,13.5797031 16.8884688,12.440125 L16.8884688,11.8543438 C16.8881094,10.0858594 16.8873906,8.25735938 16.8902656,6.46335938 C16.8920625,5.12432813 16.3321563,4.14071875 15.226,3.53984375 C14.8454219,3.33428125 14.4163281,3.2415625 13.8345,3.23976563 L13.532625,3.23940625 L13.532625,4.64815625 L13.6001875,4.64851563 C13.791375,4.6503125 13.9548906,4.65534375 14.1000781,4.6646875 C14.8443438,4.71248438 15.4807969,5.34426563 15.51925,6.0734375 C15.5559063,6.78392188 15.5548281,7.529625 15.5533906,8.18764063 C15.5530313,8.33282813 15.5530313,8.478375 15.5530313,8.6235625 C15.5548281,11.0791719 15.5548281,13.5347813 15.5548281,15.9900313 C15.5548281,17.7031719 15.5548281,17.6003906 15.5551875,19.3135313 C15.5551875,19.7034531 15.5551875,20.1066719 15.3690313,20.4545469 C15.0466719,21.0550625 14.5841563,21.3472344 13.9538125,21.3472344 C13.1020938,21.3472344 12.250375,21.3472344 11.3990156,21.346875 L8.84385938,21.3465156 L8.625,21.3465156 L8.40614063,21.3465156 L5.85098438,21.346875 C4.999625,21.3472344 4.14790625,21.3472344 3.2961875,21.3472344 C2.66584375,21.3472344 2.20332812,21.0554219 1.88096875,20.4545469 C1.6948125,20.1066719 1.6948125,19.7034531 1.6948125,19.3135313 C1.69517187,17.6003906 1.69517187,17.7031719 1.69517187,15.9900313 C1.69517187,13.5347813 1.69517187,11.0795313 1.69696875,8.6235625 C1.69696875,8.478375 1.69696875,8.33282813 1.69660937,8.18764063 C1.69517187,7.52926563 1.69373437,6.78392188 1.73075,6.0734375 C1.76920312,5.34426563 2.40601562,4.712125 3.14992187,4.6646875 C3.29510937,4.65498438 3.458625,4.6503125 3.6498125,4.64851563 L3.717375,4.64815625 L3.717375,3.23940625 L3.4155,3.23976562 C2.8333125,3.2415625 2.40457812,3.33428125 2.024,3.53984375 C0.917484375,4.14035938 0.3579375,5.12432812 0.359734375,6.46335938 C0.362609375,8.257 0.361890625,10.0858594 0.36153125,11.8543438 L0.36153125,12.440125 C0.361171875,13.5797031 0.360453125,14.7196406 0.361171875,15.8592188 C0.36153125,16.3454531 0.359734375,16.8406719 0.358296875,17.3200781 L0.35721875,17.523125 C0.3521875,18.8948594 0.34715625,18.4970313 0.377703125,19.9039844 C0.39459375,20.6550781 0.705453125,21.3673594 1.2535,21.9096563 C1.80585938,22.4562656 2.52748438,22.7577813 3.28576563,22.7577813 L3.297625,22.7577813 C4.913375,22.7505938 6.488875,22.7502344 8.09492188,22.7502344 L8.625,22.7502344 L9.1554375,22.7502344 C10.761125,22.7502344 12.336625,22.7505938 13.9527344,22.7577813 L13.9645938,22.7577813 C14.722875,22.7577813 15.4441406,22.4562656 15.9968594,21.9096563 C16.5449063,21.367 16.8557656,20.6547188 16.8726563,19.9039844 C16.9024844,18.4970313 16.8974531,18.8948594 16.8927813,17.523125 Z" id="Path"></path>
                            <path d="M12.8861094,17.4250156 C13.1254531,17.6672344 13.3558125,17.8972344 13.5829375,18.1308281 C13.8506719,18.4064687 13.7658594,18.8129219 13.4154688,18.9387031 C13.2145781,19.0109375 13.0503438,18.9415781 12.9037188,18.8035781 C12.6676094,18.5807656 12.4304219,18.3586719 12.1785,18.1225625 C11.934125,18.3687344 11.7052031,18.5998125 11.4759219,18.8301719 C11.3339688,18.9728437 11.1690156,19.0447187 10.9674063,18.9789531 C10.6216875,18.8661094 10.5185469,18.4672031 10.7701094,18.1890469 C10.9426094,17.9985781 11.1280469,17.81925 11.3138438,17.6417187 C11.3684688,17.5896094 11.4831094,17.4861094 11.4748438,17.4778437 C11.19525,17.2032812 10.9839375,16.9995156 10.7625625,16.775625 C10.5498125,16.5610781 10.5429844,16.2627969 10.7388438,16.0705312 C10.933625,15.8793437 11.2060313,15.8771875 11.4274063,16.0917344 C11.661,16.3181406 11.8748281,16.5650312 12.1134531,16.8205469 C12.4074219,16.5265781 12.6406563,16.281125 12.8871875,16.0500469 C13.1858281,15.7700937 13.5947969,15.8894062 13.6990156,16.2814844 C13.7493281,16.4705156 13.6630781,16.6185781 13.5365781,16.7479531 C13.3277813,16.9617812 13.1168281,17.1738125 12.9073125,17.3869219 C12.8976094,17.396625 12.8936563,17.411 12.8861094,17.4250156 Z" id="Path"></path>
                            <path d="M12.8861094,8.88590625 C13.1254531,9.128125 13.3558125,9.358125 13.5829375,9.59171875 C13.8506719,9.86735938 13.7658594,10.2738125 13.4154688,10.3995938 C13.2145781,10.4718281 13.0503438,10.4024688 12.9037188,10.2644688 C12.6676094,10.0416563 12.4304219,9.8195625 12.1785,9.58345313 C11.934125,9.829625 11.7052031,10.0607031 11.4759219,10.2910625 C11.3339688,10.4337344 11.1690156,10.5056094 10.9674063,10.4398438 C10.6216875,10.327 10.5185469,9.92809375 10.7701094,9.6499375 C10.9426094,9.45946875 11.1280469,9.28014063 11.3138438,9.10260938 C11.3684688,9.0505 11.4831094,8.947 11.4748438,8.93873438 C11.19525,8.66417188 10.9839375,8.46040625 10.7625625,8.23651563 C10.5498125,8.02196875 10.5429844,7.7236875 10.7388438,7.53142188 C10.933625,7.34023438 11.2060313,7.33807813 11.4274063,7.552625 C11.661,7.77903125 11.8748281,8.02592188 12.1134531,8.2814375 C12.4074219,7.98746875 12.6406563,7.74201563 12.8871875,7.5109375 C13.1858281,7.23098438 13.5947969,7.35029688 13.6990156,7.742375 C13.7493281,7.93140625 13.6630781,8.07946875 13.5365781,8.20884375 C13.3277813,8.42267188 13.1168281,8.63470313 12.9073125,8.8478125 C12.8976094,8.85751563 12.8936563,8.87189063 12.8861094,8.88590625 Z" id="Path"></path>
                            <path d="M13.8851719,11.6613594 C13.8751094,11.6613594 13.8650469,11.6620781 13.8575,11.6631563 C13.8129375,11.6681875 13.777,11.6854375 13.7507656,11.6990938 L13.6400781,11.7576719 C13.5732344,11.7939687 13.4941719,11.8378125 13.41475,11.8899219 C12.8875469,12.2399531 12.3869375,12.6363437 11.9025,13.0197969 L11.8730313,13.0431562 C11.7562344,13.1355156 11.6383594,13.2303906 11.5240781,13.3231094 L11.4554375,13.3784531 L11.3300156,13.273875 C11.1902188,13.1567188 11.0320938,13.0241094 10.8710938,12.8979688 C10.7737031,12.8217813 10.6637344,12.7703906 10.5688594,12.7297813 C10.467875,12.6877344 10.3622188,12.7085781 10.3032813,12.7818906 C10.2590781,12.8361563 10.2447031,12.911625 10.2626719,12.9942813 C10.2759688,13.0542969 10.2928594,13.1250938 10.3208906,13.1937344 C10.473625,13.5660469 10.6867344,13.9412344 10.991125,14.375 C11.0953438,14.5230625 11.2541875,14.6082344 11.4270469,14.6082344 C11.5697188,14.6082344 11.7080781,14.5496563 11.81625,14.4432813 C11.9114844,14.3502031 12.0092344,14.2517344 12.1073438,14.15075 C12.4271875,13.820125 12.7984219,13.4341563 13.153125,13.0345313 C13.2573438,12.9177344 13.360125,12.7998594 13.4632656,12.6819844 C13.5398125,12.5946562 13.616,12.5073281 13.6929063,12.4203594 L13.7105156,12.4005938 C13.9725,12.1116562 14.090375,11.9204688 14.0813906,11.7982813 C14.0774375,11.7468906 14.0468906,11.6613594 13.8851719,11.6613594 Z" id="Path"></path>
                            <rect id="Rectangle" x="3.39142188" y="8.372" width="5.91171875" height="1.078125"></rect>
                            <rect id="Rectangle" x="3.39142188" y="12.5957344" width="5.91171875" height="1.078125"></rect>
                            <rect id="Rectangle" x="3.39142188" y="16.9111094" width="5.91171875" height="1.078125"></rect>
                        </g>
                    </g>
                </g>
            </g>
        </g>
    </g>
</svg>