// Jest Snapshot v1, https://goo.gl/fbAQLP

exports[`CascadeDropdown should render CascadeDropdown 1`] = `
<CascadeDropdown
  handleChange={[Function]}
  handleLoadData={[Function]}
  options={
    Array [
      Object {
        "isLeaf": false,
        "label": "Dairy & Cheese",
        "value": "dairyAndCheese",
      },
      Object {
        "isLeaf": false,
        "label": "Baked Goods",
        "value": "bakedGoods",
      },
      Object {
        "isLeaf": false,
        "label": "Soft Drinks",
        "value": "softDrinks",
      },
      Object {
        "isLeaf": false,
        "label": "Snacks",
        "value": "snacks",
      },
    ]
  }
>
  <Styled(Cascader)
    displayRender={[Function]}
    loadData={[Function]}
    onChange={[Function]}
    options={
      Array [
        Object {
          "isLeaf": false,
          "label": "Dairy & Cheese",
          "value": "dairyAndCheese",
        },
        Object {
          "isLeaf": false,
          "label": "Baked Goods",
          "value": "bakedGoods",
        },
        Object {
          "isLeaf": false,
          "label": "Soft Drinks",
          "value": "softDrinks",
        },
        Object {
          "isLeaf": false,
          "label": "Snacks",
          "value": "snacks",
        },
      ]
    }
  >
    <Cascader
      allowClear={true}
      className="sc-bdVaJa UoSJW"
      disabled={false}
      displayRender={[Function]}
      loadData={[Function]}
      onChange={[Function]}
      options={
        Array [
          Object {
            "isLeaf": false,
            "label": "Dairy & Cheese",
            "value": "dairyAndCheese",
          },
          Object {
            "isLeaf": false,
            "label": "Baked Goods",
            "value": "bakedGoods",
          },
          Object {
            "isLeaf": false,
            "label": "Soft Drinks",
            "value": "softDrinks",
          },
          Object {
            "isLeaf": false,
            "label": "Snacks",
            "value": "snacks",
          },
        ]
      }
      popupPlacement="bottomLeft"
      transitionName="slide-up"
    >
      <LocaleReceiver
        componentName="global"
      >
        <Cascader
          allowClear={true}
          builtinPlacements={
            Object {
              "bottomLeft": Object {
                "offset": Array [
                  0,
                  4,
                ],
                "overflow": Object {
                  "adjustX": 1,
                  "adjustY": 1,
                },
                "points": Array [
                  "tl",
                  "bl",
                ],
              },
              "bottomRight": Object {
                "offset": Array [
                  0,
                  4,
                ],
                "overflow": Object {
                  "adjustX": 1,
                  "adjustY": 1,
                },
                "points": Array [
                  "tr",
                  "br",
                ],
              },
              "topLeft": Object {
                "offset": Array [
                  0,
                  -4,
                ],
                "overflow": Object {
                  "adjustX": 1,
                  "adjustY": 1,
                },
                "points": Array [
                  "bl",
                  "tl",
                ],
              },
              "topRight": Object {
                "offset": Array [
                  0,
                  -4,
                ],
                "overflow": Object {
                  "adjustX": 1,
                  "adjustY": 1,
                },
                "points": Array [
                  "br",
                  "tr",
                ],
              },
            }
          }
          className="sc-bdVaJa UoSJW"
          disabled={false}
          displayRender={[Function]}
          dropdownMenuColumnStyle={Object {}}
          expandIcon={
            <Icon
              type="right"
            />
          }
          expandTrigger="click"
          fieldNames={
            Object {
              "children": "children",
              "label": "label",
              "value": "value",
            }
          }
          loadData={[Function]}
          loadingIcon={
            <span
              className="ant-cascader-menu-item-loading-icon"
            >
              <Icon
                spin={true}
                type="redo"
              />
            </span>
          }
          onChange={[Function]}
          onPopupVisibleChange={[Function]}
          options={Array []}
          popupClassName=""
          popupPlacement="bottomLeft"
          prefixCls="ant-cascader"
          transitionName="slide-up"
          value={Array []}
        >
          <Trigger
            action={
              Array [
                "click",
              ]
            }
            afterPopupVisibleChange={[Function]}
            allowClear={true}
            blurDelay={0.15}
            builtinPlacements={
              Object {
                "bottomLeft": Object {
                  "offset": Array [
                    0,
                    4,
                  ],
                  "overflow": Object {
                    "adjustX": 1,
                    "adjustY": 1,
                  },
                  "points": Array [
                    "tl",
                    "bl",
                  ],
                },
                "bottomRight": Object {
                  "offset": Array [
                    0,
                    4,
                  ],
                  "overflow": Object {
                    "adjustX": 1,
                    "adjustY": 1,
                  },
                  "points": Array [
                    "tr",
                    "br",
                  ],
                },
                "topLeft": Object {
                  "offset": Array [
                    0,
                    -4,
                  ],
                  "overflow": Object {
                    "adjustX": 1,
                    "adjustY": 1,
                  },
                  "points": Array [
                    "bl",
                    "tl",
                  ],
                },
                "topRight": Object {
                  "offset": Array [
                    0,
                    -4,
                  ],
                  "overflow": Object {
                    "adjustX": 1,
                    "adjustY": 1,
                  },
                  "points": Array [
                    "br",
                    "tr",
                  ],
                },
              }
            }
            className="sc-bdVaJa UoSJW"
            defaultPopupVisible={false}
            destroyPopupOnHide={false}
            disabled={false}
            displayRender={[Function]}
            dropdownMenuColumnStyle={Object {}}
            expandIcon={
              <Icon
                type="right"
              />
            }
            expandTrigger="click"
            fieldNames={
              Object {
                "children": "children",
                "label": "label",
                "value": "value",
              }
            }
            focusDelay={0}
            getDocument={[Function]}
            getPopupClassNameFromAlign={[Function]}
            hideAction={Array []}
            loadData={[Function]}
            loadingIcon={
              <span
                className="ant-cascader-menu-item-loading-icon"
              >
                <Icon
                  spin={true}
                  type="redo"
                />
              </span>
            }
            mask={false}
            maskClosable={true}
            mouseEnterDelay={0}
            mouseLeaveDelay={0.1}
            onChange={[Function]}
            onPopupAlign={[Function]}
            onPopupVisibleChange={[Function]}
            options={Array []}
            popup={<div />}
            popupAlign={Object {}}
            popupClassName=" ant-cascader-menus-empty"
            popupPlacement="bottomLeft"
            popupStyle={Object {}}
            popupTransitionName="slide-up"
            prefixCls="ant-cascader-menus"
            showAction={Array []}
            value={Array []}
          >
            <span
              className="sc-bdVaJa UoSJW ant-cascader-picker sc-bdVaJa UoSJW"
              onClick={[Function]}
              onKeyDown={[Function]}
              onMouseDown={[Function]}
              onTouchStart={[Function]}
              tabIndex={0}
            >
              <span
                className="ant-cascader-picker-label"
              />
              <Input
                autoComplete="off"
                className="ant-cascader-input "
                disabled={false}
                onKeyDown={[Function]}
                placeholder="Please select"
                prefixCls="ant-input"
                readOnly={true}
                tabIndex="-1"
                type="text"
                value=""
              >
                <ClearableLabeledInput
                  autoComplete="off"
                  className="ant-cascader-input "
                  disabled={false}
                  element={
                    <input
                      autoComplete="off"
                      className="ant-input ant-cascader-input "
                      disabled={false}
                      onBlur={undefined}
                      onChange={[Function]}
                      onClick={undefined}
                      onKeyDown={[Function]}
                      placeholder="Please select"
                      readOnly={true}
                      tabIndex="-1"
                      type="text"
                      value=""
                    />
                  }
                  handleReset={[Function]}
                  inputType="input"
                  onKeyDown={[Function]}
                  placeholder="Please select"
                  prefixCls="ant-input"
                  readOnly={true}
                  tabIndex="-1"
                  type="text"
                  value=""
                >
                  <input
                    autoComplete="off"
                    className="ant-input ant-cascader-input "
                    disabled={false}
                    onChange={[Function]}
                    onKeyDown={[Function]}
                    placeholder="Please select"
                    readOnly={true}
                    tabIndex="-1"
                    type="text"
                    value=""
                  />
                </ClearableLabeledInput>
              </Input>
              <Icon
                className="ant-cascader-picker-arrow"
                type="down"
              >
                <LocaleReceiver
                  componentName="Icon"
                >
                  <i
                    aria-label="icon: down"
                    className="anticon anticon-down ant-cascader-picker-arrow"
                  >
                    <IconReact
                      className=""
                      type="down-o"
                    >
                      <svg
                        aria-hidden="true"
                        className=""
                        data-icon="down"
                        fill="currentColor"
                        focusable="false"
                        height="1em"
                        viewBox="64 64 896 896"
                        width="1em"
                      >
                        <path
                          d="M884 256h-75c-5.1 0-9.9 2.5-12.9 6.6L512 654.2 227.9 262.6c-3-4.1-7.8-6.6-12.9-6.6h-75c-6.5 0-10.3 7.4-6.5 12.7l352.6 486.1c12.8 17.6 39 17.6 51.7 0l352.6-486.1c3.9-5.3.1-12.7-6.4-12.7z"
                        />
                      </svg>
                    </IconReact>
                  </i>
                </LocaleReceiver>
              </Icon>
            </span>
          </Trigger>
        </Cascader>
      </LocaleReceiver>
    </Cascader>
  </Styled(Cascader)>
</CascadeDropdown>
`;
