{
    "hub": {
      "name": "Kaizen Hub",
      "latest_version": 1,
      "accepted": true
    },
    "srb": {
      "name": "Single Rulebook",
      "latest_version": 1,
      "accepted": true
    }
}