Date,Value,product_id
2021-01-01 15:00:55,184791,624
2021-01-01 18:20:21,141293,334
2021-01-01 18:38:15,180246,154
2021-01-01 22:04:54,261589,835
2021-01-02 19:23:08,203725,374
2021-01-03 04:50:56,222110,782
2021-01-03 07:33:34,123130,429
2021-01-03 19:44:01,246587,374
2021-01-03 21:43:19,280275,27
2021-01-04 00:50:38,208304,299
2021-01-04 04:56:04,128176,540
2021-01-04 08:16:51,102893,399
2021-01-04 13:15:58,191379,315
2021-01-06 06:51:34,170471,249
2021-01-06 07:16:38,266005,905
2021-01-06 13:26:41,244425,568
2021-01-07 01:55:52,181501,223
2021-01-07 09:46:22,154377,33
2021-01-07 18:27:47,280003,318
2021-01-08 04:51:22,255515,181
2021-01-08 10:14:10,210551,195
2021-01-08 11:54:49,113324,825
2021-01-08 16:03:37,127349,637
2021-01-08 20:22:58,133919,219
2021-01-08 20:32:26,252081,57
2021-01-09 13:28:30,255010,392
2021-01-09 18:17:12,165456,73
2021-01-10 06:34:05,249557,512
2021-01-10 14:58:49,130671,939
2021-01-11 07:35:34,241597,109
2021-01-11 11:52:40,177833,94
2021-01-11 14:06:29,293731,101
2021-01-11 16:44:38,101771,941
2021-01-11 22:07:53,234334,692
2021-01-12 00:17:59,107240,231
2021-01-12 07:24:31,258881,942
2021-01-12 20:04:40,203202,170
2021-01-12 22:30:31,134032,592
2021-01-15 03:23:47,257026,239
2021-01-15 09:55:35,236994,492
2021-01-15 13:51:35,154779,889
2021-01-15 16:13:42,124240,272
2021-01-15 16:39:42,136793,343
2021-01-17 06:24:09,120697,706
2021-01-17 12:27:53,205849,199
2021-01-17 20:47:03,149611,286
2021-01-19 14:49:38,134763,1032
2021-01-19 18:22:57,225565,417
2021-01-19 18:31:08,179154,47
2021-01-20 14:32:43,252455,444
2021-01-20 17:23:38,115461,378
2021-01-21 15:08:59,157872,97
2021-01-21 19:38:57,231339,100
2021-01-22 06:07:47,248952,557
2021-01-22 08:39:01,172112,179
2021-01-22 20:18:34,120213,1028
2021-01-22 21:41:31,144230,141
2021-01-23 09:20:43,239205,1024
2021-01-23 14:53:40,149144,136
2021-01-24 00:42:03,144782,891
2021-01-24 02:14:05,131753,398
2021-01-24 04:44:51,290134,425
2021-01-24 19:48:21,259449,963
2021-01-24 22:22:15,240676,395
2021-01-25 13:47:26,135316,81
2021-01-25 16:37:08,243239,40
2021-01-25 17:52:36,211054,354
2021-01-25 23:56:43,169687,647
2021-01-26 04:42:09,153732,617
2021-01-26 07:59:36,160104,405
2021-01-26 12:47:57,206517,704
2021-01-26 16:03:42,211998,553
2021-01-27 02:41:35,106477,57
2021-01-27 06:20:46,144506,793
2021-01-27 07:14:30,270588,380
2021-01-27 16:56:34,203442,633
2021-01-28 04:42:19,212364,781
2021-01-28 07:41:06,254172,568
2021-01-28 16:02:10,131850,378
2021-01-29 01:59:25,264845,443
2021-01-29 04:35:28,292447,967
2021-01-30 08:43:48,161056,585
2021-01-30 09:20:15,247250,124
2021-01-30 19:22:04,248401,434
2021-01-31 00:38:16,227004,146
2021-02-01 05:25:46,157402,56
2021-02-01 15:05:51,206859,299
2021-02-03 04:54:11,244616,739
2021-02-03 21:26:22,220812,369
2021-02-04 06:49:09,109433,540
2021-02-05 12:30:23,112370,1042
2021-02-05 14:04:45,152844,527
2021-02-05 14:29:56,290125,766
2021-02-05 18:26:15,270553,372
2021-02-06 11:21:53,193723,808
2021-02-07 05:49:23,171547,384
2021-02-07 06:56:10,104175,902
2021-02-07 09:53:13,225058,822
2021-02-07 11:36:34,293588,128
2021-02-09 03:31:06,220983,213
2021-02-09 05:37:39,222907,167
2021-02-10 09:42:39,178229,208
2021-02-10 10:46:50,251555,157
2021-02-10 13:28:17,104300,495
2021-02-10 23:47:19,257329,804
2021-02-11 08:36:00,211998,707
2021-02-12 01:38:53,170216,413
2021-02-12 14:05:19,204605,426
2021-02-12 19:14:48,134725,754
2021-02-12 22:01:08,229747,996
2021-02-13 07:49:51,256850,154
2021-02-13 16:21:40,199093,95
2021-02-13 23:00:40,244436,55
2021-02-14 04:56:27,122843,50
2021-02-14 17:26:45,246696,801
2021-02-14 20:53:53,192949,931
2021-02-15 10:58:17,273661,315
2021-02-15 12:42:59,266382,596
2021-02-15 17:10:19,118321,212
2021-02-16 14:01:00,102538,722
2021-02-16 14:12:36,103887,640
2021-02-16 18:41:24,172907,330
2021-02-16 20:59:47,201871,483
2021-02-16 22:31:25,114571,896
2021-02-16 23:36:40,171523,593
2021-02-17 00:29:33,183382,1009
2021-02-17 03:41:04,116881,792
2021-02-17 09:23:34,161532,375
2021-02-18 01:50:12,282026,166
2021-02-18 02:36:35,190147,595
2021-02-18 05:05:55,236640,109
2021-02-18 06:25:24,244522,302
2021-02-18 13:17:20,224663,259
2021-02-19 06:34:11,200771,330
2021-02-19 23:42:59,153305,337
2021-02-20 04:18:30,138002,644
2021-02-20 04:27:37,245574,971
2021-02-20 18:59:33,281206,797
2021-02-21 01:24:50,232863,674
2021-02-21 10:04:06,191456,29
2021-02-21 22:42:06,146004,596
2021-02-22 11:27:26,279054,607
2021-02-23 16:54:22,118062,774
2021-02-24 08:20:52,289665,164
2021-02-25 07:00:06,161466,1002
2021-02-25 08:17:08,151549,191
2021-02-26 10:24:10,212501,479
2021-02-26 14:31:09,191391,562
2021-02-27 07:07:27,143289,908
2021-02-27 07:29:47,115667,691
2021-02-27 10:43:57,105478,460
2021-02-27 14:30:03,208016,901
2021-02-27 21:38:26,253116,872
2021-02-28 00:10:09,153314,58
2021-02-28 07:23:59,256175,820
2021-02-28 18:06:36,166303,967
2021-03-01 00:23:19,291417,684
2021-03-01 23:50:33,248771,663
2021-03-03 14:55:07,292004,619
2021-03-03 16:16:23,225873,810
2021-03-03 20:29:31,117100,232
2021-03-03 23:44:59,211705,118
2021-03-05 09:07:54,281723,642
2021-03-06 01:13:58,196765,34
2021-03-06 11:13:53,219154,374
2021-03-06 16:03:51,211595,987
2021-03-07 07:00:26,207686,765
2021-03-07 09:11:04,293031,381
2021-03-07 16:25:34,207003,475
2021-03-07 17:27:29,220100,30
2021-03-07 21:16:59,145817,801
2021-03-08 01:19:14,131970,734
2021-03-08 06:55:18,175729,250
2021-03-08 15:45:18,232306,221
2021-03-08 18:03:42,233052,535
2021-03-09 04:46:45,104536,945
2021-03-09 17:56:29,126270,14
2021-03-09 23:50:53,116411,27
2021-03-10 02:22:31,162544,900
2021-03-10 05:51:56,262008,503
2021-03-10 06:51:10,180122,422
2021-03-10 07:48:29,277331,674
2021-03-11 00:57:35,146131,779
2021-03-11 11:45:10,111817,506
2021-03-11 14:44:57,219390,278
2021-03-12 12:37:32,104591,1011
2021-03-13 02:58:47,130060,152
2021-03-13 08:40:20,192753,335
2021-03-14 07:55:09,192148,308
2021-03-14 16:39:21,184174,263
2021-03-14 16:43:51,267657,598
2021-03-14 18:58:31,126858,64
2021-03-15 00:50:17,233467,202
2021-03-15 01:12:12,138859,202
2021-03-15 03:58:12,146769,914
2021-03-15 22:47:24,140803,769
2021-03-16 00:46:44,291025,273
2021-03-16 04:02:51,211652,1012
2021-03-16 18:54:45,234834,121
2021-03-17 02:47:06,132414,121
2021-03-17 03:56:17,206748,674
2021-03-18 02:33:41,295514,237
2021-03-18 16:52:09,261377,245
2021-03-19 07:14:14,146631,33
2021-03-19 11:43:04,124557,211
2021-03-19 12:44:01,107087,422
2021-03-19 14:25:17,244828,762
2021-03-19 23:26:53,200811,398
2021-03-20 01:24:13,227371,158
2021-03-20 08:49:38,248842,372
2021-03-20 10:47:50,143572,206
2021-03-20 13:26:39,241295,325
2021-03-20 19:31:09,107401,325
2021-03-20 22:32:41,284051,446
2021-03-21 04:07:59,102738,28
2021-03-21 04:14:33,127677,877
2021-03-22 03:37:05,241614,193
2021-03-22 08:01:28,191754,532
2021-03-22 15:58:03,295451,626
2021-03-23 05:07:43,101816,174
2021-03-23 15:20:51,183370,507
2021-03-23 21:19:00,151717,928
2021-03-23 21:34:22,148775,855
2021-03-24 08:52:10,295354,411
2021-03-24 09:08:26,105540,417
2021-03-24 15:14:22,248408,459
2021-03-24 15:57:32,232759,679
2021-03-24 21:52:06,147802,725
2021-03-24 21:57:14,157924,237
2021-03-25 21:56:17,218284,584
2021-03-26 17:57:23,116009,155
2021-03-27 06:37:02,184168,996
2021-03-27 09:54:12,108285,364
2021-03-27 12:53:53,290929,591
2021-03-28 22:20:14,277050,518
2021-03-29 10:27:36,110105,795
2021-03-29 15:30:45,181355,542
2021-03-29 15:40:50,147898,57
2021-03-30 01:03:08,135077,1013
2021-03-31 06:57:42,284994,619
2021-04-01 04:40:30,136085,31
2021-04-01 17:18:42,120824,711
2021-04-02 01:01:56,136695,966
2021-04-02 08:28:54,285920,312
2021-04-02 11:03:12,111444,497
2021-04-02 22:37:12,178085,999
2021-04-03 17:24:05,163595,603
2021-04-03 20:18:11,211811,860
2021-04-04 05:04:02,246841,737
2021-04-05 08:27:11,114474,438
2021-04-07 03:58:28,156061,86
2021-04-07 06:39:45,145748,273
2021-04-07 13:03:58,186156,66
2021-04-08 03:50:21,156261,82
2021-04-08 07:59:02,122207,29
2021-04-09 12:08:47,237010,583
2021-04-09 15:15:43,283730,255
2021-04-09 15:54:13,262059,86
2021-04-09 17:46:56,193949,209
2021-04-09 22:35:57,178393,286
2021-04-10 00:04:53,150134,72
2021-04-10 06:43:36,170476,626
2021-04-12 05:08:43,226645,910
2021-04-12 06:14:27,250041,834
2021-04-12 12:59:40,115406,662
2021-04-13 01:16:07,207282,517
2021-04-13 05:30:46,190442,1032
2021-04-14 00:01:29,162247,906
2021-04-14 18:15:36,261414,387
2021-04-14 20:02:21,215841,805
2021-04-15 02:24:27,158489,451
2021-04-15 08:32:48,206304,244
2021-04-15 14:05:02,151332,74
2021-04-15 17:56:09,204491,329
2021-04-15 19:12:16,231687,184
2021-04-16 13:32:03,117454,996
2021-04-16 14:16:54,281227,227
2021-04-16 19:13:26,254026,166
2021-04-19 04:41:37,269352,265
2021-04-19 12:14:59,115827,227
2021-04-19 12:31:21,199894,753
2021-04-19 19:28:18,227516,293
2021-04-19 22:25:49,271256,604
2021-04-22 00:11:10,204583,358
2021-04-22 06:17:01,167764,1041
2021-04-22 09:24:30,161532,748
2021-04-22 17:14:26,239807,601
2021-04-22 21:50:33,189639,837
2021-04-24 00:46:17,175152,382
2021-04-24 09:43:39,126791,974
2021-04-24 21:18:20,136356,693
2021-04-25 08:49:20,156466,248
2021-04-25 14:14:52,121910,335
2021-04-25 16:30:21,188375,997
2021-04-26 17:23:35,294677,835
2021-04-27 00:13:07,228572,40
2021-04-27 02:08:57,127893,209
2021-04-27 06:06:43,105836,1027
2021-04-27 14:41:20,108472,583
2021-04-28 04:10:09,239786,242
2021-04-28 05:03:34,278321,856
2021-04-29 18:06:19,285786,779
2021-04-30 09:18:27,119589,197
2021-04-30 10:56:48,164177,12
2021-04-30 13:50:28,157420,748
2021-04-30 23:18:37,121393,463
2021-05-01 16:44:56,116171,710
2021-05-02 01:39:10,238626,307
2021-05-02 17:28:08,161613,78
2021-05-02 19:18:37,222405,36
2021-05-02 21:58:44,136939,252
2021-05-04 01:41:00,234191,344
2021-05-04 05:23:00,232990,719
2021-05-05 00:55:06,270000,699
2021-05-07 01:49:56,199751,143
2021-05-07 19:46:06,225666,679
2021-05-07 20:59:16,169983,653
2021-05-08 03:39:23,259236,437
2021-05-08 05:41:43,238659,890
2021-05-09 01:21:16,294252,277
2021-05-09 05:26:48,161441,648
2021-05-10 07:32:56,295062,374
2021-05-10 09:21:26,217991,815
2021-05-10 13:42:24,135852,686
2021-05-10 21:19:39,240120,866
2021-05-11 04:54:33,283264,636
2021-05-11 13:11:38,144088,64
2021-05-11 23:15:11,265278,182
2021-05-12 02:21:46,239695,186
2021-05-12 13:46:09,270738,454
2021-05-12 19:22:18,209874,470
2021-05-13 20:43:57,269906,961
2021-05-14 17:23:41,115815,739
2021-05-14 17:39:46,102213,51
2021-05-15 01:23:40,190383,781
2021-05-15 06:48:48,105786,383
2021-05-15 20:13:58,262808,307
2021-05-15 23:36:08,131253,264
2021-05-16 00:20:53,258297,577
2021-05-16 01:22:52,273280,661
2021-05-16 04:59:48,104199,777
2021-05-16 21:47:54,191305,701
2021-05-17 09:59:35,205588,439
2021-05-17 10:58:22,223122,319
2021-05-17 16:56:16,283541,678
2021-05-17 19:51:36,148134,509
2021-05-18 18:22:51,218095,746
2021-05-18 22:23:11,271910,845
2021-05-19 11:06:05,247562,465
2021-05-19 15:31:06,244759,480
2021-05-19 15:33:27,102496,275
2021-05-19 17:11:32,216218,1044
2021-05-19 19:51:41,271103,257
2021-05-19 21:19:48,234942,956
2021-05-20 08:34:39,109808,445
2021-05-20 09:02:47,104757,440
2021-05-20 12:30:52,193681,443
2021-05-20 18:45:53,231622,201
2021-05-21 12:04:40,225453,861
2021-05-21 17:42:18,232089,593
2021-05-22 08:47:11,185135,690
2021-05-22 16:03:36,274461,296
2021-05-22 22:36:49,161775,356
2021-05-23 01:02:13,278075,263
2021-05-23 06:35:22,246457,473
2021-05-23 08:57:45,165861,1009
2021-05-23 13:54:23,158691,593
2021-05-23 14:44:28,183954,610
2021-05-23 17:07:22,136621,293
2021-05-24 01:20:19,232627,956
2021-05-24 04:33:56,151809,526
2021-05-24 09:14:02,191830,443
2021-05-24 14:26:09,143916,531
2021-05-25 17:05:49,210242,670
2021-05-26 04:15:09,201003,1002
2021-05-26 05:30:53,251260,508
2021-05-26 15:24:26,274629,609
2021-05-26 19:04:57,248475,703
2021-05-27 00:33:57,260538,51
2021-05-27 16:26:23,257600,634
2021-05-28 00:10:53,265304,217
2021-05-28 09:54:09,197183,224
2021-05-28 14:40:05,275215,215
2021-05-28 18:03:16,292267,361
2021-05-28 21:20:23,213019,238
2021-05-29 04:28:30,292610,608
2021-05-29 15:32:52,188391,390
2021-05-29 20:05:12,281188,327
2021-05-30 01:04:44,258919,353
2021-05-30 06:04:04,252552,640
2021-05-30 08:01:50,157753,273
2021-05-30 14:20:32,197514,609
2021-05-30 16:58:25,249571,385
2021-05-31 07:28:30,225964,850
2021-05-31 13:06:23,264726,180
2021-06-01 18:08:53,195335,862
2021-06-02 00:51:02,192801,1015
2021-06-03 01:49:12,283950,237
2021-06-03 18:51:52,173443,980
2021-06-03 21:02:12,204225,821
2021-06-04 02:11:52,255307,1030
2021-06-04 16:05:26,250079,612
2021-06-05 02:10:42,283473,118
2021-06-05 03:54:38,105374,458
2021-06-05 05:55:04,138306,739
2021-06-06 21:59:53,171342,316
2021-06-07 08:33:05,293439,393
2021-06-07 11:25:14,194040,82
2021-06-07 11:49:22,122948,358
2021-06-07 22:53:55,102570,686
2021-06-08 00:08:07,186703,184
2021-06-08 16:41:32,109979,825
2021-06-08 18:58:03,181666,188
2021-06-08 20:19:04,154883,772
2021-06-08 23:09:42,197636,974
2021-06-08 23:24:13,103459,397
2021-06-09 08:19:03,279179,173
2021-06-09 09:26:33,235486,453
2021-06-09 09:33:37,243259,1030
2021-06-09 14:11:37,251096,871
2021-06-09 19:09:15,165259,40
2021-06-10 02:55:49,108046,386
2021-06-10 03:03:00,267972,304
2021-06-10 04:28:10,186072,981
2021-06-10 14:48:32,291472,673
2021-06-10 18:08:25,188409,635
2021-06-11 23:02:12,249219,766
2021-06-12 18:36:37,268689,933
2021-06-13 13:18:41,105117,859
2021-06-13 14:03:45,272683,934
2021-06-13 21:38:41,215567,168
2021-06-14 00:27:50,228909,133
2021-06-14 01:50:53,289621,866
2021-06-14 09:35:46,175920,361
2021-06-14 09:55:38,213974,804
2021-06-14 16:37:40,124069,279
2021-06-14 19:09:04,206836,12
2021-06-14 20:37:32,249455,391
2021-06-15 00:51:39,134130,172
2021-06-15 15:35:24,192489,439
2021-06-15 16:26:56,265211,520
2021-06-16 03:13:35,274508,14
2021-06-16 12:56:15,262928,704
2021-06-16 22:50:15,151632,241
2021-06-17 08:39:16,166406,670
2021-06-17 12:03:49,151717,778
2021-06-18 01:38:35,168896,47
2021-06-18 12:01:13,214948,379
2021-06-18 15:05:48,216113,358
2021-06-18 17:20:46,134636,765
2021-06-19 09:07:06,134029,615
2021-06-19 09:38:01,198933,632
2021-06-19 16:27:33,110245,367
2021-06-19 19:17:07,222047,806
2021-06-19 20:49:25,203880,899
2021-06-19 23:03:10,244743,392
2021-06-19 23:45:54,135784,1017
2021-06-20 11:54:08,293884,857
2021-06-21 04:36:17,286151,978
2021-06-21 05:05:03,195896,858
2021-06-21 05:44:58,130396,614
2021-06-21 17:15:04,219921,590
2021-06-21 19:09:46,207816,384
2021-06-22 01:45:44,135094,382
2021-06-22 11:27:14,177021,133
2021-06-22 17:14:10,216423,82
2021-06-22 18:39:08,112939,591
2021-06-22 19:32:11,293300,527
2021-06-22 21:09:54,123726,30
2021-06-22 23:16:38,192357,572
2021-06-23 10:28:00,273457,766
2021-06-24 00:49:47,186085,962
2021-06-24 14:21:12,142714,635
2021-06-24 14:44:55,167226,989
2021-06-24 16:13:09,115951,352
2021-06-25 04:01:03,262636,132
2021-06-25 04:24:07,229659,1035
2021-06-25 10:14:08,124293,408
2021-06-25 12:27:37,245529,941
2021-06-25 17:17:33,135626,221
2021-06-25 20:24:34,168599,272
2021-06-26 02:09:24,292780,727
2021-06-26 07:13:54,200070,861
2021-06-26 08:58:53,115240,813
2021-06-27 13:55:16,226573,832
2021-06-27 14:39:47,110750,268
2021-06-27 16:49:31,151494,106
2021-06-28 15:19:36,150142,640
2021-06-28 23:44:59,134169,197
2021-06-29 05:00:41,238280,1015
2021-06-29 19:27:51,122011,217
2021-06-30 02:14:36,214730,122
2021-06-30 14:25:01,183639,847
2021-06-30 22:35:18,123550,574
2021-07-01 03:04:55,265484,156
2021-07-01 04:01:26,134085,927
2021-07-01 06:58:54,158796,516
2021-07-01 15:21:07,202528,408
2021-07-02 07:03:02,155741,245
2021-07-02 07:59:20,173495,124
2021-07-03 03:30:28,292787,220
2021-07-03 05:29:50,260458,575
2021-07-03 11:20:24,180534,162
2021-07-04 00:08:05,170129,596
2021-07-04 02:22:10,217200,180
2021-07-04 14:11:36,223556,100
2021-07-04 15:45:19,182889,105
2021-07-04 19:05:40,229635,443
2021-07-05 06:51:50,144074,647
2021-07-05 07:34:45,263092,565
2021-07-05 08:18:44,215888,273
2021-07-05 11:40:09,270627,24
2021-07-05 11:57:14,122592,964
2021-07-06 01:43:53,162462,613
2021-07-06 04:05:15,198156,428
2021-07-06 11:46:18,147265,504
2021-07-07 05:32:49,119747,348
2021-07-07 09:11:34,292222,1019
2021-07-07 13:31:06,159077,814
2021-07-08 02:14:54,222334,180
2021-07-08 09:03:56,214977,952
2021-07-09 19:18:57,136386,548
2021-07-10 13:21:25,209341,681
2021-07-10 14:34:04,268840,793
2021-07-10 14:51:44,184389,465
2021-07-10 18:32:21,132862,85
2021-07-10 22:18:07,276455,995
2021-07-11 02:05:54,197394,49
2021-07-11 08:18:16,250415,641
2021-07-12 10:33:36,102598,860
2021-07-12 12:01:28,114651,236
2021-07-12 12:28:56,136206,171
2021-07-12 12:48:10,148316,939
2021-07-12 13:16:10,234318,183
2021-07-12 16:23:12,211993,856
2021-07-12 22:20:29,136245,913
2021-07-13 07:20:25,122544,616
2021-07-13 08:42:35,113962,465
2021-07-13 20:31:40,246844,52
2021-07-14 03:29:47,112532,583
2021-07-14 07:07:00,187486,986
2021-07-14 10:00:11,153532,306
2021-07-14 20:46:19,292227,958
2021-07-15 05:49:36,282791,880
2021-07-15 06:49:25,132765,387
2021-07-15 07:39:07,166837,278
2021-07-15 11:15:17,248676,126
2021-07-15 13:25:12,281612,766
2021-07-15 16:43:01,117869,544
2021-07-15 23:44:01,271885,119
2021-07-16 10:35:02,282105,217
2021-07-16 11:26:35,199896,326
2021-07-16 14:01:10,287919,429
2021-07-16 17:19:27,292407,308
2021-07-16 18:08:51,162702,736
2021-07-17 17:45:50,260482,668
2021-07-18 00:45:30,244764,219
2021-07-18 03:51:59,278174,283
2021-07-18 04:27:58,126193,164
2021-07-18 22:31:41,102162,669
2021-07-19 03:32:39,256414,830
2021-07-19 11:38:40,108844,87
2021-07-19 14:32:09,119358,419
2021-07-20 10:26:25,202535,19
2021-07-20 17:18:49,186959,58
2021-07-21 00:19:58,207857,462
2021-07-22 08:05:20,294469,938
2021-07-22 09:45:22,202979,48
2021-07-22 13:58:58,202777,909
2021-07-22 20:54:05,250534,81
2021-07-23 02:18:10,276726,116
2021-07-24 08:08:37,226685,958
2021-07-24 13:06:11,273760,374
2021-07-24 19:19:43,148488,366
2021-07-25 07:26:09,135885,354
2021-07-25 13:05:24,219415,461
2021-07-25 21:10:39,222672,199
2021-07-25 21:18:55,208546,542
2021-07-26 21:59:53,198458,763
2021-07-27 03:15:06,268233,558
2021-07-27 07:34:09,161617,225
2021-07-27 18:59:37,114169,197
2021-07-28 00:29:15,108687,726
2021-07-28 11:47:34,228438,466
2021-07-28 13:56:57,160346,383
2021-07-28 14:23:11,114701,374
2021-07-29 20:21:40,291855,1027
2021-07-30 04:07:54,173094,906
2021-07-30 22:51:01,141797,671
2021-07-31 03:09:56,252471,385
2021-07-31 09:00:18,147142,179
2021-07-31 17:53:09,282755,387
2021-08-01 11:16:24,148546,553
2021-08-01 11:50:49,195289,183
2021-08-01 12:56:17,288908,97
2021-08-01 17:26:35,177245,780
2021-08-02 01:46:33,140104,616
2021-08-02 14:04:35,266874,356
2021-08-02 15:07:39,131968,846
2021-08-03 04:32:59,232190,318
2021-08-03 19:45:20,200538,174
2021-08-04 12:47:10,218596,679
2021-08-04 13:40:25,241891,464
2021-08-05 06:41:20,173461,583
2021-08-05 13:24:34,214076,478
2021-08-05 20:05:08,259853,929
2021-08-06 00:11:45,129922,401
2021-08-06 15:06:18,242650,145
2021-08-07 06:17:42,152726,1032
2021-08-07 18:36:15,288761,24
2021-08-07 20:59:57,251523,111
2021-08-08 14:57:59,145937,797
2021-08-09 04:36:43,175819,897
2021-08-09 08:34:04,233814,364
2021-08-10 11:57:27,285770,179
2021-08-10 12:55:26,242759,183
2021-08-11 00:17:52,103288,755
2021-08-11 07:59:12,242710,920
2021-08-11 16:29:48,201352,891
2021-08-11 18:23:50,231887,657
2021-08-11 21:03:04,119938,396
2021-08-11 23:09:14,141376,25
2021-08-13 08:25:46,231257,898
2021-08-13 19:18:53,203946,283
2021-08-14 05:31:33,112285,749
2021-08-14 12:48:39,188337,254
2021-08-14 20:31:20,167965,464
2021-08-15 04:22:07,285604,936
2021-08-15 05:40:09,129687,1035
2021-08-16 08:00:16,280725,820
2021-08-16 09:54:37,223436,724
2021-08-16 10:17:53,273268,267
2021-08-16 14:57:11,110000,813
2021-08-17 00:10:52,186917,460
2021-08-17 04:06:08,106080,45
2021-08-17 05:03:31,294082,864
2021-08-17 20:11:21,225341,94
2021-08-18 19:18:50,240341,264
2021-08-18 19:20:15,295219,875
2021-08-19 21:26:06,146545,239
2021-08-20 01:15:59,243025,824
2021-08-20 03:58:15,286021,341
2021-08-20 07:35:11,113207,1023
2021-08-21 17:01:04,238000,312
2021-08-21 18:16:55,105603,204
2021-08-22 01:50:02,285112,85
2021-08-22 21:29:51,187845,848
2021-08-23 08:56:59,246786,495
2021-08-23 21:47:30,274210,168
2021-08-23 22:39:23,277319,769
2021-08-25 03:50:16,287629,243
2021-08-25 11:11:43,208023,720
2021-08-25 22:39:20,179023,947
2021-08-26 03:51:36,293964,792
2021-08-26 06:38:36,147282,182
2021-08-26 10:07:02,260512,126
2021-08-26 15:20:48,214982,743
2021-08-26 15:29:12,212743,292
2021-08-26 21:30:27,190118,313
2021-08-27 16:09:50,277563,854
2021-08-28 13:03:04,205118,223
2021-08-28 14:25:40,262482,924
2021-08-28 19:53:07,262804,240
2021-08-28 21:50:48,142643,608
2021-08-29 00:34:28,200560,490
2021-08-29 07:00:19,196149,105
2021-08-30 04:03:28,108147,827
2021-08-30 14:10:56,157981,583
2021-08-31 00:57:04,100945,278
2021-08-31 08:46:53,158558,69
2021-08-31 19:04:07,108665,552
2021-09-01 01:18:22,252314,42
2021-09-01 01:56:20,148052,403
2021-09-01 02:09:07,184612,862
2021-09-01 05:05:24,293973,1045
2021-09-01 17:04:05,269104,375
2021-09-01 21:19:42,266821,758
2021-09-01 23:08:11,231075,625
2021-09-02 01:22:29,251280,1008
2021-09-02 09:32:19,193413,835
2021-09-02 11:19:47,254372,266
2021-09-02 21:17:50,291870,814
2021-09-03 02:27:31,224893,453
2021-09-03 08:58:04,202986,614
2021-09-03 10:39:02,209444,943
2021-09-03 11:12:57,254002,152
2021-09-03 13:25:35,284617,750
2021-09-03 18:02:13,177171,624
2021-09-04 01:02:49,214193,793
2021-09-04 20:16:03,259001,83
2021-09-05 03:43:19,286743,232
2021-09-06 00:43:06,151439,226
2021-09-06 03:35:58,275867,237
2021-09-06 10:22:39,188410,891
2021-09-06 12:23:09,132891,354
2021-09-06 21:11:10,138622,266
2021-09-07 00:54:33,131346,112
2021-09-07 16:08:58,170537,966
2021-09-08 22:27:49,150218,816
2021-09-09 01:39:54,265464,964
2021-09-10 04:48:41,211675,38
2021-09-10 11:55:15,242567,1009
2021-09-10 13:18:56,111660,312
2021-09-10 18:47:33,266175,84
2021-09-10 20:34:05,269158,642
2021-09-11 13:01:09,227093,250
2021-09-12 03:46:03,289963,173
2021-09-12 09:09:43,281516,412
2021-09-12 11:50:46,207713,1038
2021-09-12 14:37:36,253936,574
2021-09-12 22:54:46,164031,540
2021-09-12 23:00:06,148898,537
2021-09-13 14:32:46,130374,19
2021-09-13 18:46:55,123342,200
2021-09-13 19:46:19,286085,353
2021-09-14 09:10:58,155720,944
2021-09-14 13:16:12,235881,796
2021-09-14 22:57:21,278199,1044
2021-09-16 00:39:27,130524,174
2021-09-16 04:09:02,266575,269
2021-09-16 13:00:03,185341,202
2021-09-16 20:32:14,260675,158
2021-09-17 04:03:34,145879,554
2021-09-17 05:59:07,273420,554
2021-09-17 09:50:41,109076,974
2021-09-17 12:51:10,194598,13
2021-09-17 13:43:43,186747,930
2021-09-18 03:12:51,152970,334
2021-09-18 03:53:07,279930,691
2021-09-18 05:38:55,281226,959
2021-09-18 11:52:46,164107,138
2021-09-18 16:37:59,292888,510
2021-09-20 04:06:25,177870,148
2021-09-20 09:04:58,132616,74
2021-09-20 10:31:20,165876,457
2021-09-20 13:46:26,111459,610
2021-09-20 17:27:19,291230,348
2021-09-20 20:07:36,213908,376
2021-09-21 00:08:28,125132,175
2021-09-21 01:26:27,140749,777
2021-09-21 14:14:15,244086,1013
2021-09-21 18:27:27,290096,593
2021-09-22 03:46:38,249581,305
2021-09-22 08:34:05,206030,564
2021-09-22 12:24:52,277050,629
2021-09-22 17:11:13,150932,1035
2021-09-23 07:44:57,214787,712
2021-09-23 08:51:38,260502,826
2021-09-23 15:58:19,118713,682
2021-09-23 22:19:05,106549,136
2021-09-24 06:16:09,221629,140
2021-09-24 09:53:09,168599,761
2021-09-24 16:54:37,183706,371
2021-09-24 22:49:13,279147,673
2021-09-25 00:22:33,208490,371
2021-09-25 09:15:04,179125,312
2021-09-25 18:50:00,199183,731
2021-09-26 09:31:29,167923,850
2021-09-26 10:20:51,122899,412
2021-09-26 21:06:57,115741,437
2021-09-27 01:04:29,124421,102
2021-09-27 08:51:28,217702,1006
2021-09-27 14:25:39,184252,66
2021-09-28 02:38:51,215233,179
2021-09-28 16:00:01,136030,1004
2021-09-28 17:45:08,214152,416
2021-09-28 22:36:51,268918,805
2021-09-29 03:35:39,111233,983
2021-09-29 04:16:18,114777,647
2021-09-29 04:18:00,293815,66
2021-09-29 11:57:17,282078,13
2021-09-29 15:49:47,144261,759
2021-09-30 01:30:29,143449,389
2021-09-30 10:10:24,161513,302
2021-09-30 11:26:53,240503,877
2021-10-01 11:06:56,164532,951
2021-10-01 12:43:19,123498,874
2021-10-02 01:47:39,256066,1006
2021-10-02 17:38:45,154662,270
2021-10-02 23:11:52,129929,596
2021-10-03 21:30:51,213490,125
2021-10-04 08:36:33,139413,686
2021-10-05 19:50:46,198355,153
2021-10-05 21:37:34,157129,591
2021-10-06 10:56:07,170484,136
2021-10-06 13:32:30,236249,142
2021-10-07 08:33:38,282356,855
2021-10-07 17:24:36,148106,239
2021-10-08 05:32:42,258781,813
2021-10-08 07:07:11,224617,477
2021-10-08 10:34:36,143540,41
2021-10-09 11:03:57,253173,449
2021-10-09 14:35:48,250321,777
2021-10-10 10:53:21,198308,693
2021-10-10 11:13:52,287134,761
2021-10-11 03:40:09,144386,101
2021-10-11 04:24:02,251194,910
2021-10-11 06:47:42,223677,488
2021-10-11 21:41:52,258480,851
2021-10-12 10:26:06,227306,703
2021-10-12 13:10:03,179010,148
2021-10-12 20:53:49,153882,747
2021-10-12 22:35:52,273218,810
2021-10-13 01:17:46,220583,408
2021-10-13 05:11:11,179128,408
2021-10-13 09:45:03,175117,132
2021-10-13 17:22:13,139294,400
2021-10-13 18:13:24,146927,686
2021-10-14 00:23:04,249285,849
2021-10-14 06:21:01,236946,831
2021-10-14 13:22:45,180369,567
2021-10-15 13:53:58,285495,619
2021-10-17 00:57:15,192418,946
2021-10-17 13:33:50,136544,237
2021-10-18 06:45:17,167485,817
2021-10-18 17:07:55,282041,708
2021-10-18 19:20:36,295508,370
2021-10-19 06:54:16,141155,180
2021-10-19 12:17:17,142755,43
2021-10-19 19:03:29,198581,578
2021-10-20 06:03:48,202957,293
2021-10-20 14:48:10,209324,821
2021-10-20 19:04:07,184668,313
2021-10-21 10:24:18,265345,388
2021-10-21 16:54:39,245032,525
2021-10-21 23:40:19,128709,730
2021-10-22 02:00:29,291732,589
2021-10-22 19:46:10,106997,773
2021-10-23 00:08:49,144182,680
2021-10-23 04:01:49,254096,669
2021-10-23 05:44:39,204754,531
2021-10-23 10:51:40,139131,283
2021-10-24 06:13:27,110674,852
2021-10-24 07:25:16,176493,393
2021-10-24 07:45:15,192896,890
2021-10-24 07:58:50,133039,424
2021-10-24 10:39:56,171653,940
2021-10-24 10:45:14,133519,310
2021-10-24 14:56:20,230163,272
2021-10-25 14:40:07,260658,322
2021-10-26 21:30:00,229312,722
2021-10-26 23:25:23,212462,683
2021-10-27 07:42:09,294653,959
2021-10-28 06:41:45,137139,662
2021-10-28 09:08:40,240461,551
2021-10-28 09:53:36,249482,62
2021-10-28 18:03:33,192314,993
2021-10-29 09:20:24,227959,235
2021-10-29 21:21:27,184397,870
2021-10-30 02:49:13,269759,411
2021-10-30 10:19:06,251311,339
2021-11-01 18:16:06,131002,1039
2021-11-01 20:33:39,269500,312
2021-11-01 23:49:49,205349,455
2021-11-02 12:57:18,276923,728
2021-11-02 18:35:27,155380,281
2021-11-03 10:04:08,160621,203
2021-11-03 12:43:09,144251,913
2021-11-03 15:55:23,129876,467
2021-11-04 03:17:07,113458,552
2021-11-04 09:32:10,196196,1034
2021-11-04 12:34:37,127614,873
2021-11-04 13:38:13,188049,249
2021-11-04 21:30:41,267748,372
2021-11-05 00:48:36,233231,774
2021-11-06 11:40:51,271355,396
2021-11-06 20:21:02,117862,309
2021-11-07 08:16:25,200524,924
2021-11-07 18:52:13,102275,569
2021-11-08 01:22:12,186086,646
2021-11-08 02:49:59,126797,539
2021-11-08 10:06:00,238813,802
2021-11-08 22:28:20,162521,375
2021-11-09 01:33:30,254917,699
2021-11-09 21:16:42,106660,166
2021-11-10 11:10:21,111314,341
2021-11-10 17:59:23,181804,545
2021-11-10 18:34:20,175561,574
2021-11-11 06:28:22,143877,975
2021-11-11 10:44:38,187323,592
2021-11-11 23:29:45,251534,260
2021-11-13 11:32:39,144823,414
2021-11-13 14:26:35,128478,882
2021-11-13 15:12:56,288014,915
2021-11-13 17:15:41,262787,515
2021-11-14 01:33:59,134023,414
2021-11-14 01:54:43,110400,274
2021-11-14 15:04:41,155605,190
2021-11-14 15:05:07,266476,55
2021-11-14 22:55:33,160238,234
2021-11-15 01:27:37,141501,339
2021-11-15 04:05:33,125929,926
2021-11-15 13:27:15,204914,37
2021-11-17 03:49:53,203804,209
2021-11-17 07:34:07,115951,130
2021-11-17 22:48:23,263760,965
2021-11-19 08:34:56,104505,327
2021-11-20 01:39:47,276074,1039
2021-11-20 10:33:42,111692,401
2021-11-20 10:57:50,226951,570
2021-11-20 13:58:32,121813,422
2021-11-20 15:46:17,245506,325
2021-11-21 00:13:18,267931,789
2021-11-21 05:03:12,239216,972
2021-11-22 01:44:14,196224,817
2021-11-22 04:37:54,108022,454
2021-11-22 07:32:57,152424,681
2021-11-23 09:27:24,286515,791
2021-11-24 01:52:01,291278,522
2021-11-24 08:15:06,289202,111
2021-11-25 00:49:13,261458,200
2021-11-25 19:43:32,102169,115
2021-11-25 20:04:51,280946,819
2021-11-25 21:15:11,146582,1011
2021-11-25 23:27:16,199978,316
2021-11-26 02:26:24,173573,615
2021-11-26 07:21:35,144762,249
2021-11-26 17:36:04,200781,975
2021-11-27 05:40:07,172865,532
2021-11-27 06:09:24,192840,455
2021-11-27 17:07:43,254303,764
2021-11-28 05:26:46,295743,504
2021-11-28 08:41:34,162374,1003
2021-11-28 12:22:19,174728,733
2021-11-29 09:15:40,111244,411
2021-11-30 09:19:03,243537,566
2021-11-30 11:34:29,148139,787
2021-11-30 13:27:43,185995,894
2021-11-30 13:51:57,153545,970
2021-12-01 17:36:36,115307,690
2021-12-01 21:27:45,114929,476
2021-12-02 01:16:25,120368,797
2021-12-02 08:14:07,191145,303
2021-12-02 14:08:11,292478,977
2021-12-02 16:19:31,179332,622
2021-12-02 19:54:23,268702,627
2021-12-03 19:27:25,188074,231
2021-12-04 15:34:41,244689,402
2021-12-04 20:49:07,186460,638
2021-12-05 00:04:41,217735,700
2021-12-05 06:16:35,121651,995
2021-12-05 06:39:24,169163,618
2021-12-07 09:40:07,244486,634
2021-12-08 10:29:07,102580,414
2021-12-08 10:47:07,199582,94
2021-12-08 19:35:12,141718,702
2021-12-08 19:59:31,291682,582
2021-12-08 20:39:40,288183,575
2021-12-09 00:01:13,139490,683
2021-12-09 02:04:29,179826,1026
2021-12-09 05:24:03,263994,109
2021-12-10 03:47:12,123595,755
2021-12-10 07:21:45,200303,464
2021-12-10 19:26:47,178183,761
2021-12-11 05:15:21,162014,551
2021-12-11 09:43:52,247176,584
2021-12-11 15:51:18,205091,866
2021-12-11 17:56:13,171573,1010
2021-12-12 03:42:57,156454,596
2021-12-12 15:04:07,205117,604
2021-12-12 21:47:18,257397,250
2021-12-13 18:36:59,103039,181
2021-12-14 10:12:21,128901,701
2021-12-14 11:14:07,213123,162
2021-12-15 02:33:50,101424,552
2021-12-15 23:40:51,246786,158
2021-12-16 04:38:22,203315,613
2021-12-17 11:47:33,202798,230
2021-12-18 01:34:02,273349,982
2021-12-18 13:41:41,137034,379
2021-12-18 14:55:53,220357,591
2021-12-18 15:13:51,144104,753
2021-12-19 02:19:09,201173,625
2021-12-19 08:49:26,230699,772
2021-12-20 01:50:12,134873,548
2021-12-20 23:33:41,108647,716
2021-12-20 23:39:48,249645,399
2021-12-22 06:14:05,159151,793
2021-12-22 08:11:22,125203,495
2021-12-22 11:10:49,109473,485
2021-12-22 23:50:48,135835,920
2021-12-23 04:19:23,195113,586
2021-12-23 21:33:32,239206,914
2021-12-24 16:14:47,214697,558
2021-12-24 18:21:37,257268,888
2021-12-24 19:00:04,160234,1032
2021-12-24 22:14:24,214229,893
2021-12-25 01:14:40,139758,493
2021-12-25 09:10:16,202010,974
2021-12-25 18:01:29,204501,279
2021-12-25 21:21:51,166050,154
2021-12-26 18:01:54,286674,696
2021-12-27 03:59:07,134372,104
2021-12-27 21:51:23,225869,771
2021-12-28 10:04:19,290833,472
2021-12-28 17:45:45,126122,950
2021-12-29 08:49:08,243592,811
2021-12-29 18:05:53,172789,288
2021-12-30 03:05:36,187813,783
2021-12-30 17:13:49,187395,47
