<svg xmlns="http://www.w3.org/2000/svg" fill="none" viewBox="0 0 64 64">
  <path fill="#F5F5F5" d="M0 32a32 32 0 0164 0 32 32 0 01-64 0z"/>
  <path fill="#343433" d="M48.13 16h-33A4.12 4.12 0 0011 20.13v24.75A4.12 4.12 0 0015.13 49h33a4.12 4.12 0 004.12-4.13V20.14A4.12 4.12 0 0048.12 16zm0 8.25l-16.5 10.31-16.5-10.31v-4.13l16.5 10.32 16.5-10.32v4.13z"/>
</svg>
