<svg viewBox="0 0 256 256" xmlns="http://www.w3.org/2000/svg" preserveAspectRatio="xMinYMin meet">
    <circle fill="#F5BB60" cx="127.949" cy="128.603" r="127.397"/>
    <circle fill="#E86F32" cx="114.961" cy="115.615" r="114.685"/>
    <circle fill="#E53D42" cx="130.16" cy="100.416" r="99.485"/>
    <circle fill="#BFD141" cx="138.174" cy="108.43" r="91.471"/>
    <circle fill="#6DB64C" cx="131.542" cy="115.062" r="84.839"/>
    <circle fill="#AFDBE7" cx="118.001" cy="101.798" r="71.298"/>
    <circle fill="#57BADF" cx="129.607" cy="89.915" r="59.691"/>
    <circle fill="#02B2D6" cx="137.069" cy="97.376" r="52.506"/>
    <circle fill="#231F20" cx="129.331" cy="104.837" r="44.768"/>
    <path d="M141.088 98.971c4.439 1.992 10.56-2.016 13.672-8.951 3.112-6.936 2.036-14.173-2.402-16.164-4.44-1.992-10.56 2.016-13.672 8.951-3.112 6.936-2.037 14.173 2.402 16.164z" fill="#FFF"/>
</svg>
