<?xml version="1.0" encoding="utf-8"?>
<!-- Generator: Adobe Illustrator 23.0.0, SVG Export Plug-In . SVG Version: 6.00 Build 0)  -->
<!DOCTYPE svg PUBLIC "-//W3C//DTD SVG 1.1//EN" "http://www.w3.org/Graphics/SVG/1.1/DTD/svg11.dtd" [
	<!ENTITY ns_extend "http://ns.adobe.com/Extensibility/1.0/">
	<!ENTITY ns_ai "http://ns.adobe.com/AdobeIllustrator/10.0/">
	<!ENTITY ns_graphs "http://ns.adobe.com/Graphs/1.0/">
	<!ENTITY ns_vars "http://ns.adobe.com/Variables/1.0/">
	<!ENTITY ns_imrep "http://ns.adobe.com/ImageReplacement/1.0/">
	<!ENTITY ns_sfw "http://ns.adobe.com/SaveForWeb/1.0/">
	<!ENTITY ns_custom "http://ns.adobe.com/GenericCustomNamespace/1.0/">
	<!ENTITY ns_adobe_xpath "http://ns.adobe.com/XPath/1.0/">
]>
<svg version="1.1" id="ZDIN" xmlns:x="&ns_extend;" xmlns:i="&ns_ai;" xmlns:graph="&ns_graphs;"
	 xmlns="http://www.w3.org/2000/svg" xmlns:xlink="http://www.w3.org/1999/xlink" x="0px" y="0px" viewBox="0 0 340.2 283.5"
	 style="enable-background:new 0 0 340.2 283.5;" xml:space="preserve">
<style type="text/css">
	.st0{fill:#97D700;}
</style>
<metadata>
	<sfw  xmlns="&ns_sfw;">
		<slices></slices>
		<sliceSourceBounds  bottomLeftOrigin="true" height="209.9" width="196.5" x="888.8" y="-790.6"></sliceSourceBounds>
	</sfw>
</metadata>
<g>
	<g>
		<path class="st0" d="M72.1,228.6h10.1c0.1,0.5,0.1,1,0.1,1.5c0,0.5,0,1.1-0.1,1.6h-6.5v3.9h5.1c0.1,0.5,0.1,1,0.1,1.5
			c0,0.5,0,1-0.1,1.6h-5.1v4.7h6.7c0.1,0.5,0.1,1,0.1,1.5c0,0.5,0,1.1-0.1,1.6H72.1V228.6z"/>
		<path class="st0" d="M85.7,228.6c0.5-0.1,1-0.1,1.5-0.1c0.5,0,1,0,1.5,0.1l6.9,11.3v-11.3c0.6-0.1,1.2-0.1,1.7-0.1
			c0.5,0,1,0,1.5,0.1v17.8c-0.5,0.1-1,0.1-1.4,0.1c-0.5,0-1-0.1-1.5-0.1l-6.9-11.3v11.3c-0.5,0.1-1.1,0.1-1.6,0.1
			c-0.5,0-1.1-0.1-1.6-0.1V228.6z"/>
		<path class="st0" d="M102.7,228.6h10.1c0.1,0.5,0.1,1,0.1,1.5c0,0.5,0,1.1-0.1,1.6h-6.5v3.9h5.1c0.1,0.5,0.1,1,0.1,1.5
			c0,0.5,0,1-0.1,1.6h-5.1v4.7h6.7c0.1,0.5,0.1,1,0.1,1.5c0,0.5,0,1.1-0.1,1.6h-10.3V228.6z"/>
		<path class="st0" d="M116.2,228.6c0.7-0.1,1.4-0.2,2-0.2s1.3-0.1,2.1-0.1c0.9,0,1.8,0.1,2.7,0.2c0.9,0.2,1.7,0.5,2.4,0.9
			c0.7,0.4,1.3,1,1.7,1.7c0.4,0.7,0.7,1.6,0.7,2.7c0,0.7-0.1,1.2-0.2,1.7c-0.2,0.5-0.4,0.9-0.6,1.3c-0.3,0.4-0.5,0.7-0.8,1
			c-0.3,0.3-0.6,0.5-0.8,0.7l-0.4,0.3l4.3,7.5c-0.3,0-0.7,0.1-1,0.1c-0.4,0-0.7,0-1.1,0c-0.6,0-1.2,0-1.9-0.1l-4.7-8.3l0.6-0.3
			c0.2-0.1,0.5-0.3,0.8-0.4s0.6-0.4,1-0.7c0.3-0.3,0.6-0.6,0.8-1c0.2-0.4,0.3-0.8,0.3-1.4c0-1-0.3-1.8-0.9-2.3
			c-0.6-0.5-1.4-0.7-2.3-0.7c-0.4,0-0.7,0-1,0.1v15c-0.3,0-0.6,0.1-0.9,0.1c-0.3,0-0.6,0-0.9,0s-0.6,0-0.9,0c-0.3,0-0.6,0-1-0.1
			V228.6z"/>
		<path class="st0" d="M140.7,237.1c0.6-0.1,1.2-0.1,1.8-0.1c0.6,0,1.2,0.1,1.8,0.1v8.7c-0.9,0.3-1.8,0.5-2.7,0.6s-1.7,0.2-2.4,0.2
			c-1.5,0-2.7-0.2-3.8-0.7c-1.1-0.5-2-1.1-2.7-1.9s-1.3-1.8-1.6-2.9c-0.4-1.1-0.5-2.3-0.5-3.7c0-1.3,0.2-2.5,0.6-3.7
			c0.4-1.1,0.9-2.1,1.6-2.9c0.7-0.8,1.6-1.5,2.6-1.9c1-0.5,2.2-0.7,3.6-0.7c0.8,0,1.5,0,2.2,0.1c0.7,0.1,1.4,0.3,2.1,0.6
			c0,0.5-0.1,1-0.3,1.4c-0.2,0.5-0.3,0.9-0.5,1.4c-0.6-0.2-1.1-0.3-1.5-0.4s-1-0.1-1.6-0.1c-1.6,0-2.8,0.5-3.6,1.5
			c-0.8,1-1.3,2.6-1.3,4.6c0,2,0.4,3.5,1.3,4.5s2.1,1.5,3.7,1.5c0.3,0,0.5,0,0.8,0s0.4-0.1,0.6-0.1V237.1z"/>
		<path class="st0" d="M147.9,228.6c0.6-0.1,1.2-0.1,1.8-0.1s1.2,0,1.8,0.1v17.8c-0.6,0.1-1.2,0.1-1.8,0.1c-0.6,0-1.2-0.1-1.8-0.1
			V228.6z"/>
		<path class="st0" d="M155.5,228.6h10.1c0.1,0.5,0.1,1,0.1,1.5c0,0.5,0,1.1-0.1,1.6h-6.5v3.9h5.1c0.1,0.5,0.1,1,0.1,1.5
			c0,0.5,0,1-0.1,1.6h-5.1v4.7h6.7c0.1,0.5,0.1,1,0.1,1.5c0,0.5,0,1.1-0.1,1.6h-10.3V228.6z"/>
	</g>
	<g>
		<path class="st0" d="M71.9,221.4l7.5-14.5h-6.8c-0.1-0.5-0.1-1-0.1-1.5c0-0.5,0-1.1,0.1-1.6h11.9l0.2,0.3l-7.4,14.4h7
			c0.1,0.5,0.1,1,0.1,1.5c0,0.5,0,1.1-0.1,1.6H72L71.9,221.4z"/>
		<path class="st0" d="M87.2,203.8c0.3,0,0.6-0.1,0.9-0.1c0.3,0,0.6,0,0.9,0c0.3,0,0.6,0,0.9,0c0.3,0,0.6,0,0.9,0.1v9.2
			c0,1,0,1.9,0.1,2.6c0.1,0.7,0.2,1.3,0.4,1.8s0.5,0.8,0.9,1s0.9,0.3,1.6,0.3c0.6,0,1.2-0.1,1.6-0.3c0.4-0.2,0.7-0.6,0.9-1
			s0.4-1.1,0.4-1.8c0.1-0.7,0.1-1.6,0.1-2.6v-9.2c0.3,0,0.6-0.1,0.9-0.1c0.3,0,0.6,0,0.9,0c0.3,0,0.6,0,0.9,0c0.3,0,0.6,0,0.9,0.1
			v10c0,1.2-0.1,2.3-0.3,3.3c-0.2,1-0.6,1.9-1.1,2.6c-0.5,0.7-1.2,1.3-2.1,1.6c-0.9,0.4-1.9,0.6-3.3,0.6c-1.3,0-2.4-0.2-3.3-0.6
			c-0.9-0.4-1.5-0.9-2.1-1.6c-0.5-0.7-0.9-1.6-1.1-2.6c-0.2-1-0.3-2.1-0.3-3.3V203.8z"/>
		<path class="st0" d="M104.2,203.8c0.3,0,0.6-0.1,0.9-0.1s0.6,0,0.9,0c0.3,0,0.6,0,0.9,0s0.6,0,0.9,0.1v17.8
			c-0.3,0-0.6,0.1-0.9,0.1c-0.3,0-0.6,0-0.9,0s-0.6,0-0.9,0c-0.3,0-0.6,0-0.9-0.1V203.8z M108.3,212.7l4.8-8.8
			c0.4-0.1,0.7-0.1,1.1-0.1s0.6,0,0.9,0c0.3,0,0.6,0,0.9,0c0.3,0,0.7,0.1,1.1,0.1l-4.9,8.6l5.3,9.2c-0.4,0-0.7,0.1-1.1,0.1
			c-0.4,0-0.7,0-1,0c-0.3,0-0.6,0-0.9,0c-0.3,0-0.7-0.1-1.1-0.1L108.3,212.7z"/>
		<path class="st0" d="M119.7,203.8c0.3,0,0.6-0.1,0.9-0.1c0.3,0,0.6,0,0.9,0c0.3,0,0.6,0,0.9,0c0.3,0,0.6,0,0.9,0.1v9.2
			c0,1,0,1.9,0.1,2.6c0.1,0.7,0.2,1.3,0.4,1.8s0.5,0.8,0.9,1s0.9,0.3,1.6,0.3c0.6,0,1.2-0.1,1.6-0.3c0.4-0.2,0.7-0.6,0.9-1
			s0.4-1.1,0.4-1.8c0.1-0.7,0.1-1.6,0.1-2.6v-9.2c0.3,0,0.6-0.1,0.9-0.1c0.3,0,0.6,0,0.9,0c0.3,0,0.6,0,0.9,0c0.3,0,0.6,0,0.9,0.1
			v10c0,1.2-0.1,2.3-0.3,3.3c-0.2,1-0.6,1.9-1.1,2.6c-0.5,0.7-1.2,1.3-2.1,1.6c-0.9,0.4-1.9,0.6-3.3,0.6c-1.3,0-2.4-0.2-3.3-0.6
			c-0.9-0.4-1.5-0.9-2.1-1.6c-0.5-0.7-0.9-1.6-1.1-2.6c-0.2-1-0.3-2.1-0.3-3.3V203.8z"/>
		<path class="st0" d="M136.7,203.8c0.5-0.1,1-0.1,1.5-0.1c0.5,0,1,0,1.5,0.1l6.9,11.3v-11.3c0.6-0.1,1.2-0.1,1.7-0.1
			c0.5,0,1,0,1.5,0.1v17.8c-0.5,0.1-1,0.1-1.4,0.1c-0.5,0-1,0-1.5-0.1l-6.9-11.3v11.3c-0.5,0.1-1.1,0.1-1.6,0.1s-1.1,0-1.6-0.1
			V203.8z"/>
		<path class="st0" d="M153.5,203.8h10.1c0.1,0.5,0.1,1,0.1,1.5c0,0.5,0,1.1-0.1,1.6h-6.5v4.2h5.1c0.1,0.5,0.1,1,0.1,1.5
			c0,0.5,0,1-0.1,1.6h-5.1v7.4c-0.6,0.1-1.2,0.1-1.8,0.1c-0.6,0-1.2,0-1.8-0.1V203.8z"/>
		<path class="st0" d="M169.7,206.9h-4.4c-0.1-0.5-0.1-1-0.1-1.6c0-0.5,0-1,0.1-1.5h12.5c0.1,0.5,0.1,1,0.1,1.5c0,0.5,0,1.1-0.1,1.6
			h-4.4v14.7c-0.3,0-0.6,0.1-0.9,0.1c-0.3,0-0.6,0-0.9,0s-0.6,0-0.9,0s-0.6,0-1-0.1V206.9z"/>
		<path class="st0" d="M183.4,213.4c-0.6-0.2-1.1-0.4-1.5-0.7c-0.4-0.3-0.8-0.6-1.1-0.9c-0.3-0.4-0.6-0.8-0.7-1.3
			c-0.2-0.5-0.3-1.1-0.3-1.8c0-0.8,0.1-1.6,0.4-2.2c0.3-0.6,0.7-1.2,1.2-1.6c0.5-0.4,1.2-0.8,1.9-1c0.7-0.2,1.6-0.3,2.5-0.3
			c0.8,0,1.6,0.1,2.4,0.2s1.5,0.4,2.3,0.6c-0.1,1-0.4,1.9-0.8,2.8c-0.2-0.1-0.5-0.2-0.8-0.3c-0.3-0.1-0.5-0.2-0.8-0.2
			c-0.3-0.1-0.6-0.1-1-0.2s-0.8-0.1-1.2-0.1c-0.3,0-0.6,0-0.9,0.1c-0.3,0-0.5,0.1-0.8,0.3c-0.2,0.1-0.4,0.3-0.6,0.6
			c-0.1,0.3-0.2,0.6-0.2,1c0,0.3,0.1,0.6,0.2,0.8s0.3,0.4,0.5,0.6c0.2,0.2,0.4,0.3,0.7,0.4s0.5,0.2,0.7,0.3l1.5,0.6
			c0.6,0.2,1.2,0.5,1.7,0.8c0.5,0.3,0.9,0.6,1.3,1s0.6,0.9,0.8,1.4c0.2,0.6,0.3,1.2,0.3,2c0,0.8-0.2,1.6-0.5,2.3
			c-0.3,0.7-0.7,1.3-1.3,1.8s-1.3,0.9-2.1,1.2c-0.8,0.3-1.8,0.4-2.9,0.4c-0.5,0-1,0-1.5,0s-0.8-0.1-1.2-0.2
			c-0.4-0.1-0.8-0.2-1.2-0.3c-0.4-0.1-0.8-0.3-1.2-0.4c0-0.5,0.1-1,0.3-1.5c0.1-0.5,0.3-1,0.5-1.6c0.7,0.3,1.3,0.5,2,0.6
			c0.6,0.1,1.3,0.2,2,0.2c1,0,1.9-0.2,2.4-0.6c0.6-0.4,0.9-1,0.9-1.8c0-0.4-0.1-0.7-0.2-1c-0.1-0.3-0.3-0.5-0.5-0.7
			c-0.2-0.2-0.5-0.3-0.8-0.5c-0.3-0.1-0.6-0.2-0.9-0.4L183.4,213.4z"/>
		<path class="st0" d="M193.9,203.8c0.6-0.1,1.2-0.1,1.8-0.1c0.6,0,1.2,0,1.8,0.1v14.7h6.2c0,0.3,0.1,0.5,0.1,0.8c0,0.3,0,0.5,0,0.7
			c0,0.3,0,0.5,0,0.8c0,0.3,0,0.5-0.1,0.8h-9.7V203.8z"/>
		<path class="st0" d="M210.5,203.8c0.3,0,0.7-0.1,1-0.1c0.3,0,0.7,0,1,0c0.3,0,0.7,0,1,0c0.3,0,0.7,0.1,1,0.1l5.6,17.8
			c-0.7,0.1-1.3,0.1-2,0.1c-0.6,0-1.2,0-1.8-0.1l-1-3.6h-5.9l-1,3.6c-0.6,0.1-1.2,0.1-1.7,0.1c-0.6,0-1.2,0-1.8-0.1L210.5,203.8z
			 M214.5,215.1l-2.1-7.5l-2.2,7.5H214.5z"/>
		<path class="st0" d="M222.2,203.8c0.5-0.1,1.1-0.1,1.8-0.2c0.7,0,1.6-0.1,2.6-0.1c0.9,0,1.8,0.1,2.6,0.2c0.8,0.1,1.5,0.4,2.1,0.8
			c0.6,0.4,1.1,0.8,1.4,1.4c0.3,0.6,0.5,1.3,0.5,2.2c0,0.5-0.1,1-0.2,1.5c-0.2,0.5-0.4,0.8-0.6,1.2s-0.6,0.6-0.9,0.8s-0.7,0.4-1,0.4
			c0.4,0,0.8,0.2,1.3,0.3c0.5,0.2,0.9,0.4,1.3,0.8c0.4,0.4,0.7,0.8,1,1.4c0.3,0.6,0.4,1.2,0.4,2c0,1.1-0.2,2-0.6,2.6
			c-0.4,0.7-0.9,1.2-1.6,1.6c-0.7,0.4-1.5,0.7-2.4,0.8c-0.9,0.1-1.8,0.2-2.8,0.2c-0.8,0-1.5,0-2.2-0.1c-0.7,0-1.6-0.1-2.5-0.2V203.8
			z M226.9,211c0.4,0,0.8,0,1.2-0.1s0.7-0.2,0.9-0.4c0.3-0.2,0.5-0.4,0.6-0.8c0.1-0.3,0.2-0.7,0.2-1.2c0-0.5-0.1-0.9-0.3-1.2
			s-0.4-0.5-0.7-0.7c-0.3-0.2-0.6-0.3-0.9-0.3s-0.7-0.1-1-0.1c-0.5,0-0.8,0-1.2,0.1v4.7H226.9z M225.8,218.9c0.2,0,0.5,0.1,0.8,0.1
			c0.3,0,0.6,0,0.8,0c0.3,0,0.7,0,1.1-0.1c0.4-0.1,0.7-0.2,1.1-0.4c0.3-0.2,0.6-0.5,0.8-0.8c0.2-0.3,0.3-0.8,0.3-1.3
			c0-0.5-0.1-0.9-0.2-1.3c-0.2-0.3-0.4-0.6-0.7-0.8c-0.3-0.2-0.7-0.4-1.1-0.4c-0.4-0.1-0.9-0.1-1.4-0.1h-1.5V218.9z"/>
		<path class="st0" d="M244.5,221.9c-1.3,0-2.5-0.2-3.5-0.7c-1-0.5-1.8-1.1-2.4-1.9c-0.6-0.8-1.1-1.8-1.4-2.9
			c-0.3-1.1-0.5-2.3-0.5-3.6s0.2-2.5,0.5-3.7c0.3-1.1,0.8-2.1,1.4-2.9c0.6-0.8,1.4-1.5,2.4-1.9s2.1-0.7,3.5-0.7s2.5,0.2,3.5,0.7
			c1,0.5,1.8,1.1,2.4,1.9c0.6,0.8,1.1,1.8,1.4,2.9c0.3,1.1,0.5,2.4,0.5,3.7s-0.2,2.5-0.5,3.6c-0.3,1.1-0.8,2.1-1.4,2.9
			c-0.6,0.8-1.4,1.5-2.4,1.9C247,221.7,245.8,221.9,244.5,221.9z M244.5,218.9c2.6,0,3.8-2,3.8-6.1c0-2-0.3-3.6-0.9-4.6
			s-1.6-1.5-2.9-1.5c-2.6,0-3.9,2-3.9,6.1C240.6,216.9,241.9,218.9,244.5,218.9z"/>
		<path class="st0" d="M255.3,203.8c0.7-0.1,1.4-0.2,2-0.2c0.6-0.1,1.3-0.1,2.1-0.1c0.9,0,1.8,0.1,2.7,0.2c0.9,0.2,1.7,0.5,2.4,0.9
			c0.7,0.4,1.3,1,1.7,1.7c0.4,0.7,0.7,1.6,0.7,2.7c0,0.7-0.1,1.2-0.2,1.7c-0.2,0.5-0.4,0.9-0.6,1.3c-0.3,0.4-0.5,0.7-0.8,1
			c-0.3,0.3-0.6,0.5-0.8,0.7l-0.4,0.3l4.3,7.5c-0.3,0-0.7,0.1-1,0.1s-0.7,0-1.1,0c-0.6,0-1.2,0-1.9-0.1l-4.7-8.3l0.6-0.3
			c0.2-0.1,0.5-0.3,0.8-0.4s0.6-0.4,1-0.7c0.3-0.3,0.6-0.6,0.8-1c0.2-0.4,0.3-0.8,0.3-1.4c0-1-0.3-1.8-0.9-2.3
			c-0.6-0.5-1.4-0.7-2.3-0.7c-0.4,0-0.7,0-1,0.1v15c-0.3,0-0.6,0.1-0.9,0.1c-0.3,0-0.6,0-0.9,0s-0.6,0-0.9,0s-0.6,0-1-0.1V203.8z"/>
	</g>
	<path class="st0" d="M125.1,172.8c-23.4,0-42.4-19-42.4-42.4H72c0,29.4,23.8,53.2,53.2,53.2s53.2-23.8,53.2-53.2h-10.7
		C167.6,153.7,148.5,172.8,125.1,172.8z"/>
	<path class="st0" d="M165.3,90.4l-2.7-0.9c-7.2-2.3-25.9-8.4-33.9-11c-0.2-0.6-0.5-1.3-1-1.8l0,0c-0.2-0.2-0.4-0.4-0.6-0.5
		c0-0.1,0.1-0.2,0.1-0.3c1-2.3,2.3-5.4,1.8-7.9c-0.8-3.8-9.9-23.7-12.7-29.8c-0.5-1.2-1.4-1.4-2-1.2c-0.8,0.3-1.2,1.1-1,2.1l0.8,3.5
		c1.7,7.7,5.6,26.1,7.3,34.1c-0.4,0.4-0.8,0.9-1,1.5c-4.2,0.7-7.1,1.7-8.5,3.1c-2.8,2.6-15.6,20.4-19.4,25.8l-0.1,0.1
		c-0.8,1.1-0.5,1.9,0,2.4c0.3,0.2,0.6,0.4,0.9,0.4c0.4,0,0.9-0.2,1.3-0.6c0.1-0.1,1.1-1,2.6-2.4c5.6-5.2,18.2-16.7,24.7-22.6
		l-2.3,73.4h9.7l-2.6-73.1c1.5,1.9,3.4,4.3,5.6,5c3.5,1.1,23.5,3.1,31.9,3.9l0.3,0c0.1,0,0.2,0,0.3,0c1.1,0,1.6-0.6,1.7-1.2
		C166.8,91.4,166.2,90.7,165.3,90.4z"/>
</g>
</svg>
