<?xml version="1.0" encoding="UTF-8" standalone="no"?>
<!-- Created with Inkscape (http://www.inkscape.org/) -->

<svg
   width="600"
   height="600"
   version="1.1"
   viewBox="0 0 600 600"
   id="svg53"
   sodipodi:docname="simulation-icon3.svg"
   inkscape:version="1.1 (c68e22c387, 2021-05-23)"
   xmlns:inkscape="http://www.inkscape.org/namespaces/inkscape"
   xmlns:sodipodi="http://sodipodi.sourceforge.net/DTD/sodipodi-0.dtd"
   xmlns="http://www.w3.org/2000/svg"
   xmlns:svg="http://www.w3.org/2000/svg">
  <g
     id="g2782"
     transform="rotate(180,300.3556,326.11953)">
    <g
       id="g3792">
      <g
         id="g3829"
         transform="translate(1.604278,19.251336)">
        <g
           id="g5190"
           transform="translate(-1185.1441,-15.18007)">
          <rect
             style="fill:#6c6c6c;fill-opacity:1;stroke:none;stroke-width:43.1863;stroke-linejoin:round;stroke-opacity:1;paint-order:markers fill stroke"
             id="rect1453"
             width="17.441978"
             height="150.46046"
             x="1477.4354"
             y="383.75055"
             ry="0"
             transform="matrix(0.99999996,2.6697043e-4,-7.6341248e-5,1,0,0)" />
          <rect
             style="fill:#6c6c6c;fill-opacity:1;stroke:none;stroke-width:24.0012;stroke-linejoin:round;stroke-opacity:1;paint-order:markers fill stroke"
             id="rect1455"
             width="20.124712"
             height="169.60175"
             x="-1048.6"
             y="-1349.2926"
             ry="0"
             transform="matrix(-0.49546275,-0.86862919,-0.86491176,0.50192395,0,0)" />
          <rect
             style="fill:#6c6c6c;fill-opacity:1;stroke:none;stroke-width:24.0012;stroke-linejoin:round;stroke-opacity:1;paint-order:markers fill stroke"
             id="rect1457"
             width="20.124712"
             height="169.60175"
             x="444.20282"
             y="1234.1509"
             ry="0"
             transform="matrix(0.49546275,-0.86862919,0.86491176,0.50192395,0,0)" />
          <circle
             style="fill:none;fill-opacity:1;stroke:#000000;stroke-width:24.7887;stroke-linejoin:round;stroke-opacity:1;paint-order:markers fill stroke"
             id="circle1465"
             cx="1487.4805"
             cy="333.84372"
             r="61.282627" />
          <rect
             style="fill:#000000;fill-opacity:1;stroke:none;stroke-width:24.0012;stroke-linejoin:round;stroke-opacity:1;paint-order:markers fill stroke"
             id="rect1467"
             width="19.278481"
             height="76.664444"
             x="1048.5896"
             y="962.38373"
             ry="0"
             transform="matrix(0.5165691,0.8562455,0.85237108,-0.52293741,0,0)" />
          <rect
             style="fill:#000000;fill-opacity:1;stroke:none;stroke-width:30.4215;stroke-linejoin:round;stroke-opacity:1;paint-order:markers fill stroke"
             id="rect1469"
             width="17.441978"
             height="74.660667"
             x="-1497.1818"
             y="-283.58087"
             ry="0"
             transform="matrix(-0.99999999,-1.3247461e-4,1.5384726e-4,-0.99999999,0,0)" />
          <circle
             style="fill:#6c6c6c;fill-opacity:1;stroke:none;stroke-width:26.8189;stroke-linejoin:round;paint-order:markers fill stroke"
             id="circle1475"
             cx="1693.2242"
             cy="-162.60361"
             r="66.301331"
             transform="matrix(0.99928695,0.03775699,0.03775699,-0.99928695,0,0)" />
          <circle
             style="fill:#6c6c6c;fill-opacity:1;stroke:none;stroke-width:26.8189;stroke-linejoin:round;paint-order:markers fill stroke"
             id="circle1477"
             cx="1485.9189"
             cy="-556.96246"
             r="66.301331"
             transform="scale(1,-1)" />
          <circle
             style="fill:#6c6c6c;fill-opacity:1;stroke:none;stroke-width:26.8189;stroke-linejoin:round;paint-order:markers fill stroke"
             id="circle1479"
             cx="-1278.7338"
             cy="-274.89557"
             r="66.301331"
             transform="rotate(177.83617)" />
          <path
             sodipodi:type="star"
             style="fill:#000000;fill-opacity:1;stroke:none;stroke-width:20.225;stroke-linejoin:round;stroke-opacity:1;paint-order:markers fill stroke"
             id="path2142"
             inkscape:flatsided="false"
             sodipodi:sides="6"
             sodipodi:cx="-410.65131"
             sodipodi:cy="-83.945297"
             sodipodi:r1="113.86902"
             sodipodi:r2="130.88393"
             sodipodi:arg1="0.98279372"
             sodipodi:arg2="1.5063925"
             inkscape:rounded="0"
             inkscape:randomized="0"
             transform="matrix(0.5118573,0.3407542,-0.3407542,0.5118573,1489.7324,619.89916)"
             inkscape:transform-center-x="4.4774016"
             inkscape:transform-center-y="6.2931925"
             d="m -347.48814,10.799453 -54.73957,35.867826 -58.89337,-28.539294 -58.43224,-29.471943 -4.73093,-65.272807 -3.69267,-65.339765 54.16245,-36.73352 54.73956,-35.86782 58.89338,28.53929 58.43223,29.47194 4.73094,65.27281 3.69266,65.33977 z" />
          <rect
             style="fill:#000000;fill-opacity:1;stroke:none;stroke-width:24.0012;stroke-linejoin:round;stroke-opacity:1;paint-order:markers fill stroke"
             id="rect3866"
             width="19.278481"
             height="76.664444"
             x="-507.6843"
             y="-1585.8215"
             ry="0"
             transform="matrix(-0.5165691,0.8562455,-0.85237108,-0.52293741,0,0)" />
          <path
             sodipodi:type="star"
             style="fill:#000000;fill-opacity:1;stroke:none;stroke-width:20.225;stroke-linejoin:round;stroke-opacity:1;paint-order:markers fill stroke"
             id="path3868"
             inkscape:flatsided="false"
             sodipodi:sides="6"
             sodipodi:cx="-410.65131"
             sodipodi:cy="-83.945297"
             sodipodi:r1="113.86902"
             sodipodi:r2="130.88393"
             sodipodi:arg1="0.98279372"
             sodipodi:arg2="1.5063925"
             inkscape:rounded="0"
             inkscape:randomized="0"
             transform="matrix(-0.5118573,0.3407542,0.3407542,0.5118573,1486.2103,619.89916)"
             inkscape:transform-center-x="-4.4774111"
             inkscape:transform-center-y="6.2931925"
             d="m -347.48814,10.799453 -54.73957,35.867826 -58.89337,-28.539294 -58.43224,-29.471943 -4.73093,-65.272807 -3.69267,-65.339765 54.16245,-36.73352 54.73956,-35.86782 58.89338,28.53929 58.43223,29.47194 4.73094,65.27281 3.69266,65.33977 z" />
          <path
             sodipodi:type="star"
             style="fill:#000000;fill-opacity:1;stroke:none;stroke-width:20.225;stroke-linejoin:round;stroke-opacity:1;paint-order:markers fill stroke"
             id="path3870"
             inkscape:flatsided="false"
             sodipodi:sides="6"
             sodipodi:cx="-410.65131"
             sodipodi:cy="-83.945297"
             sodipodi:r1="113.86902"
             sodipodi:r2="130.88393"
             sodipodi:arg1="0.98279372"
             sodipodi:arg2="1.5063925"
             inkscape:rounded="0"
             inkscape:randomized="0"
             transform="matrix(-0.5118573,0.3407542,0.3407542,0.5118573,1306.6863,322.69099)"
             inkscape:transform-center-x="-4.4774111"
             inkscape:transform-center-y="6.2931925"
             d="m -347.48814,10.799453 -54.73957,35.867826 -58.89337,-28.539294 -58.43224,-29.471943 -4.73093,-65.272807 -3.69267,-65.339765 54.16245,-36.73352 54.73956,-35.86782 58.89338,28.53929 58.43223,29.47194 4.73094,65.27281 3.69266,65.33977 z" />
        </g>
      </g>
    </g>
  </g>
  <sodipodi:namedview
     id="namedview55"
     pagecolor="#ffffff"
     bordercolor="#666666"
     borderopacity="1.0"
     inkscape:pageshadow="2"
     inkscape:pageopacity="0.0"
     inkscape:pagecheckerboard="0"
     showgrid="false"
     inkscape:zoom="0.62333335"
     inkscape:cx="207.754"
     inkscape:cy="328.877"
     inkscape:window-width="1920"
     inkscape:window-height="986"
     inkscape:window-x="-11"
     inkscape:window-y="-11"
     inkscape:window-maximized="1"
     inkscape:current-layer="g3829" />
  <defs
     id="defs11">
    <clipPath
       id="clipEmfPath2" />
    <clipPath
       id="clipEmfPath2-9" />
  </defs>
</svg>
