<?xml version="1.0" encoding="UTF-8" standalone="no"?>
<!-- Created with Inkscape (http://www.inkscape.org/) -->

<svg
   width="210mm"
   height="297mm"
   viewBox="0 0 210 297"
   version="1.1"
   id="svg5"
   inkscape:version="1.2 (dc2aedaf03, 2022-05-15)"
   sodipodi:docname="repository_logo.svg"
   xmlns:inkscape="http://www.inkscape.org/namespaces/inkscape"
   xmlns:sodipodi="http://sodipodi.sourceforge.net/DTD/sodipodi-0.dtd"
   xmlns="http://www.w3.org/2000/svg"
   xmlns:svg="http://www.w3.org/2000/svg">
  <sodipodi:namedview
     id="namedview7"
     pagecolor="#ffffff"
     bordercolor="#000000"
     borderopacity="0.25"
     inkscape:showpageshadow="2"
     inkscape:pageopacity="0.0"
     inkscape:pagecheckerboard="0"
     inkscape:deskcolor="#d1d1d1"
     inkscape:document-units="mm"
     showgrid="false"
     inkscape:zoom="0.914906"
     inkscape:cx="-159.57923"
     inkscape:cy="460.15656"
     inkscape:window-width="2560"
     inkscape:window-height="1369"
     inkscape:window-x="2552"
     inkscape:window-y="-8"
     inkscape:window-maximized="1"
     inkscape:current-layer="layer2" />
  <defs
     id="defs2">
    <inkscape:perspective
       sodipodi:type="inkscape:persp3d"
       inkscape:vp_x="0 : 148.5 : 1"
       inkscape:vp_y="0 : 1000 : 0"
       inkscape:vp_z="210 : 148.5 : 1"
       inkscape:persp3d-origin="105 : 99 : 1"
       id="perspective67" />
  </defs>
  <g
     inkscape:label="Ebene 1"
     inkscape:groupmode="layer"
     id="layer1">
    <path
       style="color:#000000;fill:#000000;stroke-width:4.49179;fill-opacity:0;stroke:none;stroke-opacity:1"
       d="M 2.9239474,59.150428 V 61.928354 233.61898 H 207.63464 V 59.150428 Z m 7.7923666,5.555853 H 199.84227 V 228.06316 H 10.716314 Z"
       id="rect353" />
    <circle
       id="path2328"
       style="fill:#ffffff;stroke:#000000;stroke-width:0.264583"
       cx="-47.103184"
       cy="54.144478"
       r="0.082257025" />
    <rect
       style="display:inline;fill:#d6d6d6;fill-opacity:1;stroke:#000000;stroke-width:0.582055;stroke-dasharray:none;stroke-opacity:1"
       id="rect4848"
       width="204.6093"
       height="174.91895"
       x="3.032258"
       y="59.715187" />
    <rect
       style="fill:#000000;fill-opacity:0;stroke:none;stroke-width:0.564999;stroke-dasharray:none;stroke-opacity:1"
       id="rect10140"
       width="29.037508"
       height="18.404055"
       x="15.950181"
       y="215.53194" />
  </g>
  <g
     inkscape:groupmode="layer"
     id="layer2"
     inkscape:label="Ebene 2">
    <g
       id="g9431">
      <g
         id="rect2208-6"
         transform="matrix(5.3195895,0,0,3.7927949,-254.39939,-214.7746)">
        <path
           style="color:#000000;fill:#ffffff;stroke-width:0.665"
           d="M 69.839828,87.480522 H 81.118309 V 102.2293 H 69.839828 Z"
           id="path3234" />
        <path
           style="color:#000000;fill:#000000"
           d="m 69.507812,87.148437 v 0.332032 15.082031 h 11.94336 V 87.148437 Z m 0.664063,0.664063 h 10.613281 v 14.08398 H 70.171875 Z"
           id="path3236" />
      </g>
      <g
         id="path2420"
         transform="matrix(5.3195895,0,0,3.7927949,-254.39939,-214.7746)">
        <path
           style="color:#000000;fill:#ffffff;stroke-width:0.564999"
           d="M 73.454722,102.3739 C 73.743914,87.335928 73.743914,87.335928 73.743914,87.335928"
           id="path3264" />
        <path
           style="color:#000000;fill:#000000"
           d="m 73.460937,87.330078 -0.289062,15.039062 0.564453,0.01 0.289063,-15.037113 z"
           id="path3266" />
      </g>
      <g
         id="path2422"
         transform="matrix(5.3195895,0,0,3.7927949,-254.39939,-214.7746)">
        <path
           style="color:#000000;fill:#ffffff;stroke-width:0.564999"
           d="m 77.503408,87.62512 c 0,14.45959 0,14.45959 0,14.45959"
           id="path3270" />
        <path
           style="color:#000000;fill:#000000"
           d="m 77.220703,87.625 v 14.45898 h 0.564453 V 87.625 Z"
           id="path3272" />
      </g>
      <g
         id="path2426"
         transform="matrix(5.3195895,0,0,3.7927949,-254.39939,-214.7746)">
        <path
           style="color:#000000;fill:#ffffff;stroke-width:0.564999"
           d="m 69.797473,90.762115 c 11.278481,0 11.278481,0 11.278481,0"
           id="path3276" />
        <path
           style="color:#000000;fill:#000000"
           d="m 69.796875,90.480469 v 0.564453 h 11.279297 v -0.564453 z"
           id="path3278" />
      </g>
      <g
         id="path2426-1"
         transform="matrix(5.3195895,0,0,3.7927949,-254.39939,-214.7746)">
        <path
           style="color:#000000;fill:#ffffff;stroke-width:0.564999"
           d="m 69.919629,93.65619 c 11.278481,0 11.278481,0 11.278481,0"
           id="path3282" />
        <path
           style="color:#000000;fill:#000000"
           d="m 69.919922,93.373047 v 0.566406 h 11.277344 v -0.566406 z"
           id="path3284" />
      </g>
      <g
         id="path2426-9"
         transform="matrix(5.3195895,0,0,3.7927949,-254.39939,-214.7746)">
        <path
           style="color:#000000;fill:#ffffff;stroke-width:0.564999"
           d="m 69.817384,96.723532 c 11.278481,0 11.278481,0 11.278481,0"
           id="path3288" />
        <path
           style="color:#000000;fill:#000000"
           d="m 69.818359,96.441406 v 0.564453 h 11.277344 v -0.564453 z"
           id="path3290" />
      </g>
      <g
         id="path2426-2"
         transform="matrix(5.3195895,0,0,3.7927949,-254.39939,-214.7746)">
        <path
           style="color:#000000;fill:#ffffff;stroke-width:0.564999;-inkscape-stroke:none"
           d="m 69.817384,99.790875 c 11.278481,0 11.278481,0 11.278481,0"
           id="path3294" />
        <path
           style="color:#000000;fill:#000000;-inkscape-stroke:none"
           d="m 69.818359,99.507812 v 0.566408 h 11.277344 v -0.566408 z"
           id="path3296" />
      </g>
    </g>
    <g
       id="g9431-4"
       transform="translate(7.0645583,9.3968336)">
      <g
         id="rect2208-6-1"
         transform="matrix(5.3195895,0,0,3.7927949,-254.39939,-214.7746)">
        <path
           style="color:#000000;fill:#ffffff;stroke-width:0.665"
           d="M 69.839828,87.480522 H 81.118309 V 102.2293 H 69.839828 Z"
           id="path3234-7" />
        <path
           style="color:#000000;fill:#000000"
           d="m 69.507812,87.148437 v 0.332032 15.082031 h 11.94336 V 87.148437 Z m 0.664063,0.664063 h 10.613281 v 14.08398 H 70.171875 Z"
           id="path3236-8" />
      </g>
      <g
         id="path2420-1"
         transform="matrix(5.3195895,0,0,3.7927949,-254.39939,-214.7746)">
        <path
           style="color:#000000;fill:#ffffff;stroke-width:0.564999"
           d="M 73.454722,102.3739 C 73.743914,87.335928 73.743914,87.335928 73.743914,87.335928"
           id="path3264-4" />
        <path
           style="color:#000000;fill:#000000"
           d="m 73.460937,87.330078 -0.289062,15.039062 0.564453,0.01 0.289063,-15.037113 z"
           id="path3266-4" />
      </g>
      <g
         id="path2422-7"
         transform="matrix(5.3195895,0,0,3.7927949,-254.39939,-214.7746)">
        <path
           style="color:#000000;fill:#ffffff;stroke-width:0.564999"
           d="m 77.503408,87.62512 c 0,14.45959 0,14.45959 0,14.45959"
           id="path3270-1" />
        <path
           style="color:#000000;fill:#000000"
           d="m 77.220703,87.625 v 14.45898 h 0.564453 V 87.625 Z"
           id="path3272-9" />
      </g>
      <g
         id="path2426-5"
         transform="matrix(5.3195895,0,0,3.7927949,-254.39939,-214.7746)">
        <path
           style="color:#000000;fill:#ffffff;stroke-width:0.564999"
           d="m 69.797473,90.762115 c 11.278481,0 11.278481,0 11.278481,0"
           id="path3276-3" />
        <path
           style="color:#000000;fill:#000000"
           d="m 69.796875,90.480469 v 0.564453 h 11.279297 v -0.564453 z"
           id="path3278-5" />
      </g>
      <g
         id="path2426-1-8"
         transform="matrix(5.3195895,0,0,3.7927949,-254.39939,-214.7746)">
        <path
           style="color:#000000;fill:#ffffff;stroke-width:0.564999"
           d="m 69.919629,93.65619 c 11.278481,0 11.278481,0 11.278481,0"
           id="path3282-1" />
        <path
           style="color:#000000;fill:#000000"
           d="m 69.919922,93.373047 v 0.566406 h 11.277344 v -0.566406 z"
           id="path3284-6" />
      </g>
      <g
         id="path2426-9-1"
         transform="matrix(5.3195895,0,0,3.7927949,-254.39939,-214.7746)">
        <path
           style="color:#000000;fill:#ffffff;stroke-width:0.564999"
           d="m 69.817384,96.723532 c 11.278481,0 11.278481,0 11.278481,0"
           id="path3288-2" />
        <path
           style="color:#000000;fill:#000000"
           d="m 69.818359,96.441406 v 0.564453 h 11.277344 v -0.564453 z"
           id="path3290-0" />
      </g>
      <g
         id="path2426-2-0"
         transform="matrix(5.3195895,0,0,3.7927949,-254.39939,-214.7746)">
        <path
           style="color:#000000;fill:#ffffff;stroke-width:0.564999;-inkscape-stroke:none"
           d="m 69.817384,99.790875 c 11.278481,0 11.278481,0 11.278481,0"
           id="path3294-2" />
        <path
           style="color:#000000;fill:#000000;-inkscape-stroke:none"
           d="m 69.818359,99.507812 v 0.566408 h 11.277344 v -0.566408 z"
           id="path3296-1" />
      </g>
    </g>
    <g
       id="g9431-4-0"
       transform="translate(15.039648,16.758457)">
      <g
         id="rect2208-6-1-9"
         transform="matrix(5.3195895,0,0,3.7927949,-254.39939,-214.7746)">
        <path
           style="color:#000000;fill:#ffffff;stroke-width:0.665"
           d="M 69.839828,87.480522 H 81.118309 V 102.2293 H 69.839828 Z"
           id="path3234-7-9" />
        <path
           style="color:#000000;fill:#000000"
           d="m 69.507812,87.148437 v 0.332032 15.082031 h 11.94336 V 87.148437 Z m 0.664063,0.664063 h 10.613281 v 14.08398 H 70.171875 Z"
           id="path3236-8-4" />
      </g>
      <g
         id="path2420-1-0"
         transform="matrix(5.3195895,0,0,3.7927949,-254.39939,-214.7746)">
        <path
           style="color:#000000;fill:#ffffff;stroke-width:0.564999"
           d="M 73.454722,102.3739 C 73.743914,87.335928 73.743914,87.335928 73.743914,87.335928"
           id="path3264-4-7" />
        <path
           style="color:#000000;fill:#000000"
           d="m 73.460937,87.330078 -0.289062,15.039062 0.564453,0.01 0.289063,-15.037113 z"
           id="path3266-4-2" />
      </g>
      <g
         id="path2422-7-0"
         transform="matrix(5.3195895,0,0,3.7927949,-254.39939,-214.7746)">
        <path
           style="color:#000000;fill:#ffffff;stroke-width:0.564999"
           d="m 77.503408,87.62512 c 0,14.45959 0,14.45959 0,14.45959"
           id="path3270-1-3" />
        <path
           style="color:#000000;fill:#000000"
           d="m 77.220703,87.625 v 14.45898 h 0.564453 V 87.625 Z"
           id="path3272-9-2" />
      </g>
      <g
         id="path2426-5-9"
         transform="matrix(5.3195895,0,0,3.7927949,-254.39939,-214.7746)">
        <path
           style="color:#000000;fill:#ffffff;stroke-width:0.564999"
           d="m 69.797473,90.762115 c 11.278481,0 11.278481,0 11.278481,0"
           id="path3276-3-4" />
        <path
           style="color:#000000;fill:#000000"
           d="m 69.796875,90.480469 v 0.564453 h 11.279297 v -0.564453 z"
           id="path3278-5-3" />
      </g>
      <g
         id="path2426-1-8-3"
         transform="matrix(5.3195895,0,0,3.7927949,-254.39939,-214.7746)">
        <path
           style="color:#000000;fill:#ffffff;stroke-width:0.564999"
           d="m 69.919629,93.65619 c 11.278481,0 11.278481,0 11.278481,0"
           id="path3282-1-0" />
        <path
           style="color:#000000;fill:#000000"
           d="m 69.919922,93.373047 v 0.566406 h 11.277344 v -0.566406 z"
           id="path3284-6-3" />
      </g>
      <g
         id="path2426-9-1-3"
         transform="matrix(5.3195895,0,0,3.7927949,-254.39939,-214.7746)">
        <path
           style="color:#000000;fill:#ffffff;stroke-width:0.564999"
           d="m 69.817384,96.723532 c 11.278481,0 11.278481,0 11.278481,0"
           id="path3288-2-7" />
        <path
           style="color:#000000;fill:#000000"
           d="m 69.818359,96.441406 v 0.564453 h 11.277344 v -0.564453 z"
           id="path3290-0-8" />
      </g>
      <g
         id="path2426-2-0-7"
         transform="matrix(5.3195895,0,0,3.7927949,-254.39939,-214.7746)">
        <path
           style="color:#000000;fill:#ffffff;stroke-width:0.564999;-inkscape-stroke:none"
           d="m 69.817384,99.790875 c 11.278481,0 11.278481,0 11.278481,0"
           id="path3294-2-5" />
        <path
           style="color:#000000;fill:#000000;-inkscape-stroke:none"
           d="m 69.818359,99.507812 v 0.566408 h 11.277344 v -0.566408 z"
           id="path3296-1-3" />
      </g>
    </g>
    <g
       id="g9734">
      <g
         id="rect2208"
         transform="matrix(5.3195895,0,0,3.7927949,-254.39939,-214.7746)">
        <path
           style="color:#000000;fill:#ffffff;stroke-width:0.665"
           d="M 53.211296,86.757545 H 64.489777 V 101.50633 H 53.211296 Z"
           id="path3228" />
        <path
           style="color:#000000;fill:#000000"
           d="m 52.878906,86.425781 v 0.332031 15.080078 h 11.94336 V 86.425781 Z m 0.664063,0.664063 H 64.158203 V 101.17383 H 53.542969 Z"
           id="path3230" />
      </g>
      <g
         id="path2330"
         transform="matrix(5.3195895,0,0,3.7927949,-254.39939,-214.7746)">
        <path
           style="color:#000000;fill:#ffffff;stroke-width:0.564999"
           d="m 57.259979,90.227847 c 0.481988,0 0.966366,-0.04796 1.445961,0 0.647922,0.06479 2.108652,0.550281 2.891917,0.289193 0.751782,-0.250595 1.221174,-0.289193 2.024343,-0.289193"
           id="path3240" />
        <path
           style="color:#000000;fill:#000000"
           d="m 57.259766,89.945312 v 0.564454 c 0.500727,0 0.975668,-0.04423 1.417968,0 0.275361,0.02754 0.814516,0.164264 1.373047,0.263671 0.558531,0.09941 1.145272,0.175535 1.636719,0.01172 0.72657,-0.242191 1.141429,-0.27539 1.935547,-0.27539 v -0.564454 c -0.812219,0 -1.338242,0.04569 -2.115235,0.304688 -0.291816,0.09727 -0.827792,0.06106 -1.357421,-0.0332 -0.52963,-0.09426 -1.043456,-0.232277 -1.416016,-0.269531 -0.516888,-0.05169 -1.011362,-0.002 -1.474609,-0.002 z"
           id="path3242" />
      </g>
      <g
         id="path2332"
         transform="matrix(5.3195895,0,0,3.7927949,-254.39939,-214.7746)">
        <path
           style="color:#000000;fill:#ffffff;stroke-width:0.564999"
           d="m 58.416748,93.698149 c 0.385587,-0.192794 0.725664,-0.578385 1.156766,-0.578385 0.260053,0 1.127442,0.708316 1.445958,0.867577 0.58923,0.294614 0.697482,-0.408289 0.867577,-0.578384 0.112681,-0.112681 0.980289,0 1.156766,0"
           id="path3246" />
        <path
           style="color:#000000;fill:#000000"
           d="m 59.574219,92.837891 c -0.299776,0 -0.546288,0.130526 -0.75,0.261718 -0.203713,0.131192 -0.378077,0.26814 -0.533203,0.345703 l 0.251953,0.50586 c 0.23046,-0.115231 0.417392,-0.267151 0.58789,-0.376953 0.170498,-0.109802 0.312034,-0.171875 0.44336,-0.171875 -0.06323,0 0.04318,0.01496 0.152343,0.07617 0.109164,0.06121 0.246833,0.151423 0.388672,0.248046 0.28368,0.193248 0.559994,0.404995 0.777344,0.513672 0.190592,0.0953 0.390685,0.125441 0.564453,0.07617 0.173769,-0.04927 0.296131,-0.164751 0.378906,-0.273437 0.08278,-0.108687 0.134581,-0.217759 0.177735,-0.302735 0.03078,-0.0606 0.04085,-0.07624 0.05078,-0.09375 0.01426,-0.0017 0.02083,-0.0028 0.04102,-0.0039 0.08098,-0.0043 0.198842,-9.02e-4 0.320312,0.0059 0.242941,0.01352 0.468824,0.04297 0.617188,0.04297 v -0.564453 c -0.02811,0 -0.322786,-0.02832 -0.585938,-0.04297 -0.131576,-0.0073 -0.261959,-0.01019 -0.380859,-0.0039 -0.05945,0.0031 -0.116561,0.0084 -0.175781,0.02148 -0.05922,0.01309 -0.126397,0.02093 -0.212891,0.107422 -0.10072,0.10072 -0.134339,0.18994 -0.177734,0.275391 -0.0434,0.08545 -0.0858,0.165323 -0.125,0.216797 -0.0392,0.05147 -0.06447,0.06728 -0.08203,0.07227 -0.01756,0.005 -0.05223,0.01295 -0.15625,-0.03906 -0.101165,-0.05058 -0.418233,-0.273884 -0.71289,-0.474609 C 60.28627,93.159455 60.138523,93.062955 60.001958,92.98638 59.865393,92.9098 59.767479,92.837943 59.574224,92.837943 Z"
           id="path3248" />
      </g>
      <g
         id="path2334"
         transform="matrix(5.3195895,0,0,3.7927949,-254.39939,-214.7746)">
        <path
           style="color:#000000;fill:#ffffff;stroke-width:0.564999"
           d="m 58.127555,97.16845 c 1.484784,-0.872633 3.236804,-0.578384 4.91626,-0.578384"
           id="path3252" />
        <path
           style="color:#000000;fill:#000000"
           d="m 60.494141,96.265625 c -0.859993,0.03735 -1.71357,0.192218 -2.509766,0.660156 l 0.287109,0.486328 c 1.377174,-0.809388 3.059034,-0.539062 4.771485,-0.539062 v -0.566406 c -0.823229,0 -1.688836,-0.07836 -2.548828,-0.04102 z"
           id="path3254" />
      </g>
      <g
         id="path2336"
         transform="matrix(5.3195895,0,0,3.7927949,-254.39939,-214.7746)">
        <path
           style="color:#000000;fill:#ffffff;stroke-width:0.564999"
           d="m 56.970789,99.192793 c 0.981493,-0.625091 4.131204,0.537125 5.205452,0 0.253259,-0.126629 -0.338958,-0.289192 0.867574,-0.289192"
           id="path3258" />
        <path
           style="color:#000000;fill:#000000"
           d="m 63.042969,98.621094 c -0.307977,0 -0.503409,0.01011 -0.648438,0.03125 -0.145029,0.02114 -0.284092,0.03921 -0.382812,0.201172 -0.02131,0.03495 -0.01424,0.05829 -0.02148,0.0918 -0.191898,0.07989 -0.512783,0.124779 -0.927734,0.103516 -0.441988,-0.02265 -0.961356,-0.09522 -1.484375,-0.167969 -0.523019,-0.07275 -1.050241,-0.144891 -1.523438,-0.158203 -0.473196,-0.01331 -0.899755,0.01807 -1.236328,0.232422 l 0.304688,0.476563 c 0.154173,-0.09819 0.489027,-0.156543 0.916015,-0.144532 0.426989,0.01201 0.939563,0.07982 1.460938,0.152344 0.521375,0.07252 1.051817,0.149161 1.533203,0.173828 0.481386,0.02467 0.915131,0.0092 1.269531,-0.167969 0.06217,-0.03108 0.128063,-0.07751 0.173828,-0.15039 0.01877,-0.02989 0.01285,-0.05492 0.02148,-0.08594 0.09437,-0.01262 0.260857,-0.02344 0.544922,-0.02344 z"
           id="path3260" />
      </g>
    </g>
    <g
       id="g9734-3"
       transform="translate(9.2289443,9.8920407)">
      <g
         id="rect2208-3"
         transform="matrix(5.3195895,0,0,3.7927949,-254.39939,-214.7746)">
        <path
           style="color:#000000;fill:#ffffff;stroke-width:0.665"
           d="M 53.211296,86.757545 H 64.489777 V 101.50633 H 53.211296 Z"
           id="path3228-2" />
        <path
           style="color:#000000;fill:#000000"
           d="m 52.878906,86.425781 v 0.332031 15.080078 h 11.94336 V 86.425781 Z m 0.664063,0.664063 H 64.158203 V 101.17383 H 53.542969 Z"
           id="path3230-9" />
      </g>
      <g
         id="path2330-2"
         transform="matrix(5.3195895,0,0,3.7927949,-254.39939,-214.7746)">
        <path
           style="color:#000000;fill:#ffffff;stroke-width:0.564999"
           d="m 57.259979,90.227847 c 0.481988,0 0.966366,-0.04796 1.445961,0 0.647922,0.06479 2.108652,0.550281 2.891917,0.289193 0.751782,-0.250595 1.221174,-0.289193 2.024343,-0.289193"
           id="path3240-8" />
        <path
           style="color:#000000;fill:#000000"
           d="m 57.259766,89.945312 v 0.564454 c 0.500727,0 0.975668,-0.04423 1.417968,0 0.275361,0.02754 0.814516,0.164264 1.373047,0.263671 0.558531,0.09941 1.145272,0.175535 1.636719,0.01172 0.72657,-0.242191 1.141429,-0.27539 1.935547,-0.27539 v -0.564454 c -0.812219,0 -1.338242,0.04569 -2.115235,0.304688 -0.291816,0.09727 -0.827792,0.06106 -1.357421,-0.0332 -0.52963,-0.09426 -1.043456,-0.232277 -1.416016,-0.269531 -0.516888,-0.05169 -1.011362,-0.002 -1.474609,-0.002 z"
           id="path3242-4" />
      </g>
      <g
         id="path2332-6"
         transform="matrix(5.3195895,0,0,3.7927949,-254.39939,-214.7746)">
        <path
           style="color:#000000;fill:#ffffff;stroke-width:0.564999"
           d="m 58.416748,93.698149 c 0.385587,-0.192794 0.725664,-0.578385 1.156766,-0.578385 0.260053,0 1.127442,0.708316 1.445958,0.867577 0.58923,0.294614 0.697482,-0.408289 0.867577,-0.578384 0.112681,-0.112681 0.980289,0 1.156766,0"
           id="path3246-0" />
        <path
           style="color:#000000;fill:#000000"
           d="m 59.574219,92.837891 c -0.299776,0 -0.546288,0.130526 -0.75,0.261718 -0.203713,0.131192 -0.378077,0.26814 -0.533203,0.345703 l 0.251953,0.50586 c 0.23046,-0.115231 0.417392,-0.267151 0.58789,-0.376953 0.170498,-0.109802 0.312034,-0.171875 0.44336,-0.171875 -0.06323,0 0.04318,0.01496 0.152343,0.07617 0.109164,0.06121 0.246833,0.151423 0.388672,0.248046 0.28368,0.193248 0.559994,0.404995 0.777344,0.513672 0.190592,0.0953 0.390685,0.125441 0.564453,0.07617 0.173769,-0.04927 0.296131,-0.164751 0.378906,-0.273437 0.08278,-0.108687 0.134581,-0.217759 0.177735,-0.302735 0.03078,-0.0606 0.04085,-0.07624 0.05078,-0.09375 0.01426,-0.0017 0.02083,-0.0028 0.04102,-0.0039 0.08098,-0.0043 0.198842,-9.02e-4 0.320312,0.0059 0.242941,0.01352 0.468824,0.04297 0.617188,0.04297 v -0.564453 c -0.02811,0 -0.322786,-0.02832 -0.585938,-0.04297 -0.131576,-0.0073 -0.261959,-0.01019 -0.380859,-0.0039 -0.05945,0.0031 -0.116561,0.0084 -0.175781,0.02148 -0.05922,0.01309 -0.126397,0.02093 -0.212891,0.107422 -0.10072,0.10072 -0.134339,0.18994 -0.177734,0.275391 -0.0434,0.08545 -0.0858,0.165323 -0.125,0.216797 -0.0392,0.05147 -0.06447,0.06728 -0.08203,0.07227 -0.01756,0.005 -0.05223,0.01295 -0.15625,-0.03906 -0.101165,-0.05058 -0.418233,-0.273884 -0.71289,-0.474609 C 60.28627,93.159455 60.138523,93.062955 60.001958,92.98638 59.865393,92.9098 59.767479,92.837943 59.574224,92.837943 Z"
           id="path3248-1" />
      </g>
      <g
         id="path2334-3"
         transform="matrix(5.3195895,0,0,3.7927949,-254.39939,-214.7746)">
        <path
           style="color:#000000;fill:#ffffff;stroke-width:0.564999"
           d="m 58.127555,97.16845 c 1.484784,-0.872633 3.236804,-0.578384 4.91626,-0.578384"
           id="path3252-9" />
        <path
           style="color:#000000;fill:#000000"
           d="m 60.494141,96.265625 c -0.859993,0.03735 -1.71357,0.192218 -2.509766,0.660156 l 0.287109,0.486328 c 1.377174,-0.809388 3.059034,-0.539062 4.771485,-0.539062 v -0.566406 c -0.823229,0 -1.688836,-0.07836 -2.548828,-0.04102 z"
           id="path3254-1" />
      </g>
      <g
         id="path2336-8"
         transform="matrix(5.3195895,0,0,3.7927949,-254.39939,-214.7746)">
        <path
           style="color:#000000;fill:#ffffff;stroke-width:0.564999"
           d="m 56.970789,99.192793 c 0.981493,-0.625091 4.131204,0.537125 5.205452,0 0.253259,-0.126629 -0.338958,-0.289192 0.867574,-0.289192"
           id="path3258-6" />
        <path
           style="color:#000000;fill:#000000"
           d="m 63.042969,98.621094 c -0.307977,0 -0.503409,0.01011 -0.648438,0.03125 -0.145029,0.02114 -0.284092,0.03921 -0.382812,0.201172 -0.02131,0.03495 -0.01424,0.05829 -0.02148,0.0918 -0.191898,0.07989 -0.512783,0.124779 -0.927734,0.103516 -0.441988,-0.02265 -0.961356,-0.09522 -1.484375,-0.167969 -0.523019,-0.07275 -1.050241,-0.144891 -1.523438,-0.158203 -0.473196,-0.01331 -0.899755,0.01807 -1.236328,0.232422 l 0.304688,0.476563 c 0.154173,-0.09819 0.489027,-0.156543 0.916015,-0.144532 0.426989,0.01201 0.939563,0.07982 1.460938,0.152344 0.521375,0.07252 1.051817,0.149161 1.533203,0.173828 0.481386,0.02467 0.915131,0.0092 1.269531,-0.167969 0.06217,-0.03108 0.128063,-0.07751 0.173828,-0.15039 0.01877,-0.02989 0.01285,-0.05492 0.02148,-0.08594 0.09437,-0.01262 0.260857,-0.02344 0.544922,-0.02344 z"
           id="path3260-2" />
      </g>
    </g>
    <g
       id="g9734-9"
       transform="translate(17.817503,21.138963)">
      <g
         id="rect2208-62"
         transform="matrix(5.3195895,0,0,3.7927949,-254.39939,-214.7746)">
        <path
           style="color:#000000;fill:#ffffff;stroke-width:0.665"
           d="M 53.211296,86.757545 H 64.489777 V 101.50633 H 53.211296 Z"
           id="path3228-1" />
        <path
           style="color:#000000;fill:#000000"
           d="m 52.878906,86.425781 v 0.332031 15.080078 h 11.94336 V 86.425781 Z m 0.664063,0.664063 H 64.158203 V 101.17383 H 53.542969 Z"
           id="path3230-7" />
      </g>
      <g
         id="path2330-4"
         transform="matrix(5.3195895,0,0,3.7927949,-254.39939,-214.7746)">
        <path
           style="color:#000000;fill:#ffffff;stroke-width:0.564999"
           d="m 57.259979,90.227847 c 0.481988,0 0.966366,-0.04796 1.445961,0 0.647922,0.06479 2.108652,0.550281 2.891917,0.289193 0.751782,-0.250595 1.221174,-0.289193 2.024343,-0.289193"
           id="path3240-4" />
        <path
           style="color:#000000;fill:#000000"
           d="m 57.259766,89.945312 v 0.564454 c 0.500727,0 0.975668,-0.04423 1.417968,0 0.275361,0.02754 0.814516,0.164264 1.373047,0.263671 0.558531,0.09941 1.145272,0.175535 1.636719,0.01172 0.72657,-0.242191 1.141429,-0.27539 1.935547,-0.27539 v -0.564454 c -0.812219,0 -1.338242,0.04569 -2.115235,0.304688 -0.291816,0.09727 -0.827792,0.06106 -1.357421,-0.0332 -0.52963,-0.09426 -1.043456,-0.232277 -1.416016,-0.269531 -0.516888,-0.05169 -1.011362,-0.002 -1.474609,-0.002 z"
           id="path3242-2" />
      </g>
      <g
         id="path2332-7"
         transform="matrix(5.3195895,0,0,3.7927949,-254.39939,-214.7746)">
        <path
           style="color:#000000;fill:#ffffff;stroke-width:0.564999"
           d="m 58.416748,93.698149 c 0.385587,-0.192794 0.725664,-0.578385 1.156766,-0.578385 0.260053,0 1.127442,0.708316 1.445958,0.867577 0.58923,0.294614 0.697482,-0.408289 0.867577,-0.578384 0.112681,-0.112681 0.980289,0 1.156766,0"
           id="path3246-3" />
        <path
           style="color:#000000;fill:#000000"
           d="m 59.574219,92.837891 c -0.299776,0 -0.546288,0.130526 -0.75,0.261718 -0.203713,0.131192 -0.378077,0.26814 -0.533203,0.345703 l 0.251953,0.50586 c 0.23046,-0.115231 0.417392,-0.267151 0.58789,-0.376953 0.170498,-0.109802 0.312034,-0.171875 0.44336,-0.171875 -0.06323,0 0.04318,0.01496 0.152343,0.07617 0.109164,0.06121 0.246833,0.151423 0.388672,0.248046 0.28368,0.193248 0.559994,0.404995 0.777344,0.513672 0.190592,0.0953 0.390685,0.125441 0.564453,0.07617 0.173769,-0.04927 0.296131,-0.164751 0.378906,-0.273437 0.08278,-0.108687 0.134581,-0.217759 0.177735,-0.302735 0.03078,-0.0606 0.04085,-0.07624 0.05078,-0.09375 0.01426,-0.0017 0.02083,-0.0028 0.04102,-0.0039 0.08098,-0.0043 0.198842,-9.02e-4 0.320312,0.0059 0.242941,0.01352 0.468824,0.04297 0.617188,0.04297 v -0.564453 c -0.02811,0 -0.322786,-0.02832 -0.585938,-0.04297 -0.131576,-0.0073 -0.261959,-0.01019 -0.380859,-0.0039 -0.05945,0.0031 -0.116561,0.0084 -0.175781,0.02148 -0.05922,0.01309 -0.126397,0.02093 -0.212891,0.107422 -0.10072,0.10072 -0.134339,0.18994 -0.177734,0.275391 -0.0434,0.08545 -0.0858,0.165323 -0.125,0.216797 -0.0392,0.05147 -0.06447,0.06728 -0.08203,0.07227 -0.01756,0.005 -0.05223,0.01295 -0.15625,-0.03906 -0.101165,-0.05058 -0.418233,-0.273884 -0.71289,-0.474609 C 60.28627,93.159455 60.138523,93.062955 60.001958,92.98638 59.865393,92.9098 59.767479,92.837943 59.574224,92.837943 Z"
           id="path3248-4" />
      </g>
      <g
         id="path2334-6"
         transform="matrix(5.3195895,0,0,3.7927949,-254.39939,-214.7746)">
        <path
           style="color:#000000;fill:#ffffff;stroke-width:0.564999"
           d="m 58.127555,97.16845 c 1.484784,-0.872633 3.236804,-0.578384 4.91626,-0.578384"
           id="path3252-4" />
        <path
           style="color:#000000;fill:#000000"
           d="m 60.494141,96.265625 c -0.859993,0.03735 -1.71357,0.192218 -2.509766,0.660156 l 0.287109,0.486328 c 1.377174,-0.809388 3.059034,-0.539062 4.771485,-0.539062 v -0.566406 c -0.823229,0 -1.688836,-0.07836 -2.548828,-0.04102 z"
           id="path3254-2" />
      </g>
      <g
         id="path2336-4"
         transform="matrix(5.3195895,0,0,3.7927949,-254.39939,-214.7746)">
        <path
           style="color:#000000;fill:#ffffff;stroke-width:0.564999"
           d="m 56.970789,99.192793 c 0.981493,-0.625091 4.131204,0.537125 5.205452,0 0.253259,-0.126629 -0.338958,-0.289192 0.867574,-0.289192"
           id="path3258-3" />
        <path
           style="color:#000000;fill:#000000"
           d="m 63.042969,98.621094 c -0.307977,0 -0.503409,0.01011 -0.648438,0.03125 -0.145029,0.02114 -0.284092,0.03921 -0.382812,0.201172 -0.02131,0.03495 -0.01424,0.05829 -0.02148,0.0918 -0.191898,0.07989 -0.512783,0.124779 -0.927734,0.103516 -0.441988,-0.02265 -0.961356,-0.09522 -1.484375,-0.167969 -0.523019,-0.07275 -1.050241,-0.144891 -1.523438,-0.158203 -0.473196,-0.01331 -0.899755,0.01807 -1.236328,0.232422 l 0.304688,0.476563 c 0.154173,-0.09819 0.489027,-0.156543 0.916015,-0.144532 0.426989,0.01201 0.939563,0.07982 1.460938,0.152344 0.521375,0.07252 1.051817,0.149161 1.533203,0.173828 0.481386,0.02467 0.915131,0.0092 1.269531,-0.167969 0.06217,-0.03108 0.128063,-0.07751 0.173828,-0.15039 0.01877,-0.02989 0.01285,-0.05492 0.02148,-0.08594 0.09437,-0.01262 0.260857,-0.02344 0.544922,-0.02344 z"
           id="path3260-9" />
      </g>
    </g>
    <ellipse
       style="fill:#d6d6d6;fill-opacity:1;stroke:#000000;stroke-width:0.580806;stroke-dasharray:none;stroke-opacity:1"
       id="path9958"
       ry="26.88434"
       rx="102.27612"
       cy="59.00124"
       cx="105.34097" />
    <ellipse
       style="fill:#d6d6d6;fill-opacity:1;stroke:#000000;stroke-width:0.580977;stroke-dasharray:none;stroke-opacity:1"
       id="path9958-7"
       ry="26.889351"
       rx="102.31727"
       cy="233.87608"
       cx="105.36987" />
    <path
       style="fill:#d6d6d6;fill-opacity:1;stroke:none;stroke-width:0.564999;stroke-dasharray:none;stroke-opacity:1"
       id="path9960"
       sodipodi:type="arc"
       sodipodi:cx="106.0278"
       sodipodi:cy="56.950321"
       sodipodi:rx="3.7830558"
       sodipodi:ry="1.3291817"
       sodipodi:start="0"
       sodipodi:end="0.19759369"
       sodipodi:arc-type="slice"
       d="m 109.81086,56.950321 a 3.7830558,1.3291817 0 0 1 -0.0736,0.260932 l -3.70945,-0.260932 z" />
  </g>
</svg>
