{
    "storage":
    [
        {
            "E_bat_rated": 5000,
            "eta_BAT2AC": [-0.000623, -1.65, 0.9591],
            "eta_AC2BAT": [-0.0006864, -1.641, 0.957],
            "status_curve": true, 
            "status_aging": true
        }
    ]
}
