Date,OutputPower,SolarRadiation
2016-01-01 00:00:00,-33.0,0.0
2016-01-01 00:15:00,-33.0,0.0
2016-01-01 00:30:00,-33.0,0.0
2016-01-01 00:45:00,-33.0,0.0
2016-01-01 01:00:00,-33.0,0.0
2016-01-01 01:15:00,-33.0,0.0
2016-01-01 01:30:00,-33.0,0.0
2016-01-01 01:45:00,-33.0,0.0
2016-01-01 02:00:00,-33.0,0.0
2016-01-01 02:15:00,-33.0,0.0
2016-01-01 02:30:00,-33.0,0.0
2016-01-01 02:45:00,-33.0,0.0
2016-01-01 03:00:00,-33.0,0.0
2016-01-01 03:15:00,-33.0,0.0
2016-01-01 03:30:00,-33.0,0.0
2016-01-01 03:45:00,-33.0,0.0
2016-01-01 04:00:00,-33.0,0.0
2016-01-01 04:15:00,-33.0,0.0
2016-01-01 04:30:00,-33.0,0.0
2016-01-01 04:45:00,-33.0,0.0
2016-01-01 05:00:00,-33.0,0.0
2016-01-01 05:15:00,-33.0,0.0
2016-01-01 05:30:00,-33.0,0.0
2016-01-01 05:45:00,-33.0,0.0
2016-01-01 06:00:00,-33.0,0.0
2016-01-01 06:15:00,-33.0,0.0
2016-01-01 06:30:00,-33.0,0.0
2016-01-01 06:45:00,-33.0,0.0
2016-01-01 07:00:00,-33.0,0.0
2016-01-01 07:15:00,-33.0,0.0
2016-01-01 07:30:00,-33.0,0.0
2016-01-01 07:45:00,-33.0,0.0
2016-01-01 08:00:00,-33.0,0.0
2016-01-01 08:15:00,-33.0,0.0
2016-01-01 08:30:00,-33.0,0.0
2016-01-01 08:45:00,-33.0,0.0
2016-01-01 09:00:00,-33.0,9.0
2016-01-01 09:15:00,-33.0,9.0
2016-01-01 09:30:00,364.4123634768082,39.0
2016-01-01 09:45:00,363.43389835051323,39.0
2016-01-01 10:00:00,1057.108314446882,69.0
2016-01-01 10:15:00,1055.8164810411286,69.0
2016-01-01 10:30:00,3110.6570061071116,105.0
2016-01-01 10:45:00,2934.3877183300106,105.0
2016-01-01 11:00:00,5487.802068851471,129.0
2016-01-01 11:15:00,5466.640484285077,129.0
2016-01-01 11:30:00,7064.667593797004,140.0
2016-01-01 11:45:00,7390.2510450721975,140.0
2016-01-01 12:00:00,9805.046684231746,152.0
2016-01-01 12:15:00,10676.397853728955,152.0
2016-01-01 12:30:00,646.9238341871043,52.0
2016-01-01 12:45:00,648.1793730713024,52.0
2016-01-01 13:00:00,2285.562451235684,78.0
2016-01-01 13:15:00,3251.4428529996126,78.0
2016-01-01 13:30:00,14259.721755803661,124.0
2016-01-01 13:45:00,14217.415939794231,124.0
2016-01-01 14:00:00,13812.077833501144,123.0
2016-01-01 14:15:00,9717.57187258363,123.0
2016-01-01 14:30:00,-33.0,92.0
2016-01-01 14:45:00,-33.0,92.0
2016-01-01 15:00:00,-33.0,69.0
2016-01-01 15:15:00,-33.0,69.0
2016-01-01 15:30:00,-33.0,33.0
2016-01-01 15:45:00,-33.0,33.0
2016-01-01 16:00:00,-33.0,6.0
2016-01-01 16:15:00,-33.0,6.0
2016-01-01 16:30:00,-33.0,0.0
2016-01-01 16:45:00,-33.0,0.0
2016-01-01 17:00:00,-33.0,0.0
2016-01-01 17:15:00,-33.0,0.0
2016-01-01 17:30:00,-33.0,0.0
2016-01-01 17:45:00,-33.0,0.0
2016-01-01 18:00:00,-33.0,0.0
2016-01-01 18:15:00,-33.0,0.0
2016-01-01 18:30:00,-33.0,0.0
2016-01-01 18:45:00,-33.0,0.0
2016-01-01 19:00:00,-33.0,0.0
2016-01-01 19:15:00,-33.0,0.0
2016-01-01 19:30:00,-33.0,0.0
2016-01-01 19:45:00,-33.0,0.0
2016-01-01 20:00:00,-33.0,0.0
2016-01-01 20:15:00,-33.0,0.0
2016-01-01 20:30:00,-33.0,0.0
2016-01-01 20:45:00,-33.0,0.0
2016-01-01 21:00:00,-33.0,0.0
2016-01-01 21:15:00,-33.0,0.0
2016-01-01 21:30:00,-33.0,0.0
2016-01-01 21:45:00,-33.0,0.0
2016-01-01 22:00:00,-33.0,0.0
2016-01-01 22:15:00,-33.0,0.0
2016-01-01 22:30:00,-33.0,0.0
2016-01-01 22:45:00,-33.0,0.0
2016-01-01 23:00:00,-33.0,0.0
2016-01-01 23:15:00,-33.0,0.0
2016-01-01 23:30:00,-33.0,0.0
2016-01-01 23:45:00,-33.0,0.0
2016-01-02 00:00:00,-33.0,0.0
2016-01-02 00:15:00,-33.0,0.0
2016-01-02 00:30:00,-33.0,0.0
2016-01-02 00:45:00,-33.0,0.0
2016-01-02 01:00:00,-33.0,0.0
2016-01-02 01:15:00,-33.0,0.0
2016-01-02 01:30:00,-33.0,0.0
2016-01-02 01:45:00,-33.0,0.0
2016-01-02 02:00:00,-33.0,0.0
2016-01-02 02:15:00,-33.0,0.0
2016-01-02 02:30:00,-33.0,0.0
2016-01-02 02:45:00,-33.0,0.0
2016-01-02 03:00:00,-33.0,0.0
2016-01-02 03:15:00,-33.0,0.0
2016-01-02 03:30:00,-33.0,0.0
2016-01-02 03:45:00,-33.0,0.0
2016-01-02 04:00:00,-33.0,0.0
2016-01-02 04:15:00,-33.0,0.0
2016-01-02 04:30:00,-33.0,0.0
2016-01-02 04:45:00,-33.0,0.0
2016-01-02 05:00:00,-33.0,0.0
2016-01-02 05:15:00,-33.0,0.0
2016-01-02 05:30:00,-33.0,0.0
2016-01-02 05:45:00,-33.0,0.0
2016-01-02 06:00:00,-33.0,0.0
2016-01-02 06:15:00,-33.0,0.0
2016-01-02 06:30:00,-33.0,0.0
2016-01-02 06:45:00,-33.0,0.0
2016-01-02 07:00:00,-33.0,0.0
2016-01-02 07:15:00,-33.0,0.0
2016-01-02 07:30:00,-33.0,0.0
2016-01-02 07:45:00,-33.0,0.0
2016-01-02 08:00:00,-33.0,0.0
2016-01-02 08:15:00,-33.0,0.0
2016-01-02 08:30:00,-33.0,0.0
2016-01-02 08:45:00,-33.0,0.0
2016-01-02 09:00:00,-33.0,7.0
2016-01-02 09:15:00,-33.0,7.0
2016-01-02 09:30:00,24.014294505036094,24.0
2016-01-02 09:45:00,23.420998714309818,24.0
2016-01-02 10:00:00,273.6038281977288,35.0
2016-01-02 10:15:00,272.955594156719,35.0
2016-01-02 10:30:00,551.0321824347013,47.0
2016-01-02 10:45:00,550.5492697039925,47.0
2016-01-02 11:00:00,1344.4677142340304,81.0
2016-01-02 11:15:00,1344.3951878226474,81.0
2016-01-02 11:30:00,1226.732421632407,76.0
2016-01-02 11:45:00,1227.394863226507,76.0
2016-01-02 12:00:00,1550.3707900581214,86.0
2016-01-02 12:15:00,1741.8269968621325,86.0
2016-01-02 12:30:00,2335.0031715259056,89.0
2016-01-02 12:45:00,2866.6293674243725,89.0
2016-01-02 13:00:00,1580.549314156907,72.0
2016-01-02 13:15:00,2324.7442202678003,72.0
2016-01-02 13:30:00,557.5024770310812,47.0
2016-01-02 13:45:00,902.0959774763623,47.0
2016-01-02 14:00:00,12734.72439369385,94.0
2016-01-02 14:15:00,10897.530096221071,94.0
2016-01-02 14:30:00,-33.0,61.0
2016-01-02 14:45:00,-33.0,61.0
2016-01-02 15:00:00,-33.0,41.0
2016-01-02 15:15:00,-33.0,41.0
2016-01-02 15:30:00,-33.0,19.0
2016-01-02 15:45:00,-33.0,19.0
2016-01-02 16:00:00,-33.0,2.0
2016-01-02 16:15:00,-33.0,2.0
2016-01-02 16:30:00,-33.0,0.0
2016-01-02 16:45:00,-33.0,0.0
2016-01-02 17:00:00,-33.0,0.0
2016-01-02 17:15:00,-33.0,0.0
2016-01-02 17:30:00,-33.0,0.0
2016-01-02 17:45:00,-33.0,0.0
2016-01-02 18:00:00,-33.0,0.0
2016-01-02 18:15:00,-33.0,0.0
2016-01-02 18:30:00,-33.0,0.0
2016-01-02 18:45:00,-33.0,0.0
2016-01-02 19:00:00,-33.0,0.0
2016-01-02 19:15:00,-33.0,0.0
2016-01-02 19:30:00,-33.0,0.0
2016-01-02 19:45:00,-33.0,0.0
2016-01-02 20:00:00,-33.0,0.0
2016-01-02 20:15:00,-33.0,0.0
2016-01-02 20:30:00,-33.0,0.0
2016-01-02 20:45:00,-33.0,0.0
2016-01-02 21:00:00,-33.0,0.0
2016-01-02 21:15:00,-33.0,0.0
2016-01-02 21:30:00,-33.0,0.0
2016-01-02 21:45:00,-33.0,0.0
2016-01-02 22:00:00,-33.0,0.0
2016-01-02 22:15:00,-33.0,0.0
2016-01-02 22:30:00,-33.0,0.0
2016-01-02 22:45:00,-33.0,0.0
2016-01-02 23:00:00,-33.0,0.0
2016-01-02 23:15:00,-33.0,0.0
2016-01-02 23:30:00,-33.0,0.0
2016-01-02 23:45:00,-33.0,0.0
2016-01-03 00:00:00,-33.0,0.0
2016-01-03 00:15:00,-33.0,0.0
2016-01-03 00:30:00,-33.0,0.0
2016-01-03 00:45:00,-33.0,0.0
2016-01-03 01:00:00,-33.0,0.0
2016-01-03 01:15:00,-33.0,0.0
2016-01-03 01:30:00,-33.0,0.0
2016-01-03 01:45:00,-33.0,0.0
2016-01-03 02:00:00,-33.0,0.0
2016-01-03 02:15:00,-33.0,0.0
2016-01-03 02:30:00,-33.0,0.0
2016-01-03 02:45:00,-33.0,0.0
2016-01-03 03:00:00,-33.0,0.0
2016-01-03 03:15:00,-33.0,0.0
2016-01-03 03:30:00,-33.0,0.0
2016-01-03 03:45:00,-33.0,0.0
2016-01-03 04:00:00,-33.0,0.0
2016-01-03 04:15:00,-33.0,0.0
2016-01-03 04:30:00,-33.0,0.0
2016-01-03 04:45:00,-33.0,0.0
2016-01-03 05:00:00,-33.0,0.0
2016-01-03 05:15:00,-33.0,0.0
2016-01-03 05:30:00,-33.0,0.0
2016-01-03 05:45:00,-33.0,0.0
2016-01-03 06:00:00,-33.0,0.0
2016-01-03 06:15:00,-33.0,0.0
2016-01-03 06:30:00,-33.0,0.0
2016-01-03 06:45:00,-33.0,0.0
2016-01-03 07:00:00,-33.0,0.0
2016-01-03 07:15:00,-33.0,0.0
2016-01-03 07:30:00,-33.0,0.0
2016-01-03 07:45:00,-33.0,0.0
2016-01-03 08:00:00,-33.0,0.0
2016-01-03 08:15:00,-33.0,0.0
2016-01-03 08:30:00,-33.0,0.0
2016-01-03 08:45:00,-33.0,0.0
2016-01-03 09:00:00,-33.0,1.0
2016-01-03 09:15:00,-33.0,1.0
2016-01-03 09:30:00,-33.0,11.0
2016-01-03 09:45:00,-33.0,11.0
2016-01-03 10:00:00,-33.0,13.0
2016-01-03 10:15:00,-33.0,13.0
2016-01-03 10:30:00,-54.95783508946526,20.0
2016-01-03 10:45:00,-55.164334369422434,20.0
2016-01-03 11:00:00,200.65803444497618,31.0
2016-01-03 11:15:00,200.6255742902141,31.0
2016-01-03 11:30:00,342.6599417423569,37.0
2016-01-03 11:45:00,342.979748789936,37.0
2016-01-03 12:00:00,107.52242105318264,27.0
2016-01-03 12:15:00,107.99084761551777,27.0
2016-01-03 12:30:00,85.69552489977097,26.0
2016-01-03 12:45:00,86.33638023421862,26.0
2016-01-03 13:00:00,86.74194965704787,26.0
2016-01-03 13:15:00,87.48582297420374,26.0
2016-01-03 13:30:00,112.04102490996146,27.0
2016-01-03 13:45:00,111.56620405597239,27.0
2016-01-03 14:00:00,314.9170843004892,36.0
2016-01-03 14:15:00,1830.7682955535047,36.0
2016-01-03 14:30:00,123.9538070231745,27.0
2016-01-03 14:45:00,-33.0,27.0
2016-01-03 15:00:00,-33.0,28.0
2016-01-03 15:15:00,-33.0,28.0
2016-01-03 15:30:00,-33.0,15.0
2016-01-03 15:45:00,-33.0,15.0
2016-01-03 16:00:00,-33.0,1.0
2016-01-03 16:15:00,-33.0,1.0
2016-01-03 16:30:00,-33.0,0.0
2016-01-03 16:45:00,-33.0,0.0
2016-01-03 17:00:00,-33.0,0.0
2016-01-03 17:15:00,-33.0,0.0
2016-01-03 17:30:00,-33.0,0.0
2016-01-03 17:45:00,-33.0,0.0
2016-01-03 18:00:00,-33.0,0.0
2016-01-03 18:15:00,-33.0,0.0
2016-01-03 18:30:00,-33.0,0.0
2016-01-03 18:45:00,-33.0,0.0
2016-01-03 19:00:00,-33.0,0.0
2016-01-03 19:15:00,-33.0,0.0
2016-01-03 19:30:00,-33.0,0.0
2016-01-03 19:45:00,-33.0,0.0
2016-01-03 20:00:00,-33.0,0.0
2016-01-03 20:15:00,-33.0,0.0
2016-01-03 20:30:00,-33.0,0.0
2016-01-03 20:45:00,-33.0,0.0
2016-01-03 21:00:00,-33.0,0.0
2016-01-03 21:15:00,-33.0,0.0
2016-01-03 21:30:00,-33.0,0.0
2016-01-03 21:45:00,-33.0,0.0
2016-01-03 22:00:00,-33.0,0.0
2016-01-03 22:15:00,-33.0,0.0
2016-01-03 22:30:00,-33.0,0.0
2016-01-03 22:45:00,-33.0,0.0
2016-01-03 23:00:00,-33.0,0.0
2016-01-03 23:15:00,-33.0,0.0
2016-01-03 23:30:00,-33.0,0.0
2016-01-03 23:45:00,-33.0,0.0
2016-01-04 00:00:00,-33.0,0.0
2016-01-04 00:15:00,-33.0,0.0
2016-01-04 00:30:00,-33.0,0.0
2016-01-04 00:45:00,-33.0,0.0
2016-01-04 01:00:00,-33.0,0.0
2016-01-04 01:15:00,-33.0,0.0
2016-01-04 01:30:00,-33.0,0.0
2016-01-04 01:45:00,-33.0,0.0
2016-01-04 02:00:00,-33.0,0.0
2016-01-04 02:15:00,-33.0,0.0
2016-01-04 02:30:00,-33.0,0.0
2016-01-04 02:45:00,-33.0,0.0
2016-01-04 03:00:00,-33.0,0.0
2016-01-04 03:15:00,-33.0,0.0
2016-01-04 03:30:00,-33.0,0.0
2016-01-04 03:45:00,-33.0,0.0
2016-01-04 04:00:00,-33.0,0.0
2016-01-04 04:15:00,-33.0,0.0
2016-01-04 04:30:00,-33.0,0.0
2016-01-04 04:45:00,-33.0,0.0
2016-01-04 05:00:00,-33.0,0.0
2016-01-04 05:15:00,-33.0,0.0
2016-01-04 05:30:00,-33.0,0.0
2016-01-04 05:45:00,-33.0,0.0
2016-01-04 06:00:00,-33.0,0.0
2016-01-04 06:15:00,-33.0,0.0
2016-01-04 06:30:00,-33.0,0.0
2016-01-04 06:45:00,-33.0,0.0
2016-01-04 07:00:00,-33.0,0.0
2016-01-04 07:15:00,-33.0,0.0
2016-01-04 07:30:00,-33.0,0.0
2016-01-04 07:45:00,-33.0,0.0
2016-01-04 08:00:00,-33.0,0.0
2016-01-04 08:15:00,-33.0,0.0
2016-01-04 08:30:00,-33.0,0.0
2016-01-04 08:45:00,-33.0,0.0
2016-01-04 09:00:00,-33.0,3.0
2016-01-04 09:15:00,-33.0,3.0
2016-01-04 09:30:00,-33.0,18.0
2016-01-04 09:45:00,-33.0,18.0
2016-01-04 10:00:00,253.580164697223,33.0
2016-01-04 10:15:00,252.9328290150515,33.0
2016-01-04 10:30:00,683.7833343867118,51.0
2016-01-04 10:45:00,683.2189830605572,51.0
2016-01-04 11:00:00,753.7592278838407,54.0
2016-01-04 11:15:00,753.6924026350333,54.0
2016-01-04 11:30:00,922.044885829236,61.0
2016-01-04 11:45:00,922.5772263725925,61.0
2016-01-04 12:00:00,923.7042946203799,61.0
2016-01-04 12:15:00,924.8009200623336,61.0
2016-01-04 12:30:00,659.6854447869694,50.0
2016-01-04 12:45:00,660.9597251973846,50.0
2016-01-04 13:00:00,617.135625018748,48.0
2016-01-04 13:15:00,618.5740643487106,48.0
2016-01-04 13:30:00,1665.4473547148198,61.0
2016-01-04 13:45:00,3039.0128649746152,61.0
2016-01-04 14:00:00,6972.765242803432,67.0
2016-01-04 14:15:00,9977.288702341923,67.0
2016-01-04 14:30:00,4253.533009603186,50.0
2016-01-04 14:45:00,-33.0,50.0
2016-01-04 15:00:00,-33.0,41.0
2016-01-04 15:15:00,-33.0,41.0
2016-01-04 15:30:00,-33.0,22.0
2016-01-04 15:45:00,-33.0,22.0
2016-01-04 16:00:00,-33.0,5.0
2016-01-04 16:15:00,-33.0,5.0
2016-01-04 16:30:00,-33.0,0.0
2016-01-04 16:45:00,-33.0,0.0
2016-01-04 17:00:00,-33.0,0.0
2016-01-04 17:15:00,-33.0,0.0
2016-01-04 17:30:00,-33.0,0.0
2016-01-04 17:45:00,-33.0,0.0
2016-01-04 18:00:00,-33.0,0.0
2016-01-04 18:15:00,-33.0,0.0
2016-01-04 18:30:00,-33.0,0.0
2016-01-04 18:45:00,-33.0,0.0
2016-01-04 19:00:00,-33.0,0.0
2016-01-04 19:15:00,-33.0,0.0
2016-01-04 19:30:00,-33.0,0.0
2016-01-04 19:45:00,-33.0,0.0
2016-01-04 20:00:00,-33.0,0.0
2016-01-04 20:15:00,-33.0,0.0
2016-01-04 20:30:00,-33.0,0.0
2016-01-04 20:45:00,-33.0,0.0
2016-01-04 21:00:00,-33.0,0.0
2016-01-04 21:15:00,-33.0,0.0
2016-01-04 21:30:00,-33.0,0.0
2016-01-04 21:45:00,-33.0,0.0
2016-01-04 22:00:00,-33.0,0.0
2016-01-04 22:15:00,-33.0,0.0
2016-01-04 22:30:00,-33.0,0.0
2016-01-04 22:45:00,-33.0,0.0
2016-01-04 23:00:00,-33.0,0.0
2016-01-04 23:15:00,-33.0,0.0
2016-01-04 23:30:00,-33.0,0.0
2016-01-04 23:45:00,-33.0,0.0
2016-01-05 00:00:00,-33.0,0.0
2016-01-05 00:15:00,-33.0,0.0
2016-01-05 00:30:00,-33.0,0.0
2016-01-05 00:45:00,-33.0,0.0
2016-01-05 01:00:00,-33.0,0.0
2016-01-05 01:15:00,-33.0,0.0
2016-01-05 01:30:00,-33.0,0.0
2016-01-05 01:45:00,-33.0,0.0
2016-01-05 02:00:00,-33.0,0.0
2016-01-05 02:15:00,-33.0,0.0
2016-01-05 02:30:00,-33.0,0.0
2016-01-05 02:45:00,-33.0,0.0
2016-01-05 03:00:00,-33.0,0.0
2016-01-05 03:15:00,-33.0,0.0
2016-01-05 03:30:00,-33.0,0.0
2016-01-05 03:45:00,-33.0,0.0
2016-01-05 04:00:00,-33.0,0.0
2016-01-05 04:15:00,-33.0,0.0
2016-01-05 04:30:00,-33.0,0.0
2016-01-05 04:45:00,-33.0,0.0
2016-01-05 05:00:00,-33.0,0.0
2016-01-05 05:15:00,-33.0,0.0
2016-01-05 05:30:00,-33.0,0.0
2016-01-05 05:45:00,-33.0,0.0
2016-01-05 06:00:00,-33.0,0.0
2016-01-05 06:15:00,-33.0,0.0
2016-01-05 06:30:00,-33.0,0.0
2016-01-05 06:45:00,-33.0,0.0
2016-01-05 07:00:00,-33.0,0.0
2016-01-05 07:15:00,-33.0,0.0
2016-01-05 07:30:00,-33.0,0.0
2016-01-05 07:45:00,-33.0,0.0
2016-01-05 08:00:00,-33.0,0.0
2016-01-05 08:15:00,-33.0,0.0
2016-01-05 08:30:00,-33.0,0.0
2016-01-05 08:45:00,-33.0,0.0
2016-01-05 09:00:00,-33.0,0.0
2016-01-05 09:15:00,-33.0,0.0
2016-01-05 09:30:00,-33.0,4.0
2016-01-05 09:45:00,-33.0,4.0
2016-01-05 10:00:00,-33.0,5.0
2016-01-05 10:15:00,-33.0,5.0
2016-01-05 10:30:00,-33.0,12.0
2016-01-05 10:45:00,-33.0,12.0
2016-01-05 11:00:00,-53.51102561204725,20.0
2016-01-05 11:15:00,-53.53771475630552,20.0
2016-01-05 11:30:00,369.4422171297627,38.0
2016-01-05 11:45:00,369.764123161936,38.0
2016-01-05 12:00:00,110.14014900117324,27.0
2016-01-05 12:15:00,110.60874492463962,27.0
2016-01-05 12:30:00,418.5905869527799,40.0
2016-01-05 12:45:00,419.602048354279,40.0
2016-01-05 13:00:00,396.5045308817777,39.0
2016-01-05 13:15:00,397.67221633296685,39.0
2016-01-05 13:30:00,232.19302970947857,32.0
2016-01-05 13:45:00,232.12544563298897,32.0
2016-01-05 14:00:00,154.77794158214104,29.0
2016-01-05 14:15:00,119.1775800133513,29.0
2016-01-05 14:30:00,602.6080947173411,28.0
2016-01-05 14:45:00,-33.0,28.0
2016-01-05 15:00:00,-33.0,29.0
2016-01-05 15:15:00,-33.0,29.0
2016-01-05 15:30:00,-33.0,14.0
2016-01-05 15:45:00,-33.0,14.0
2016-01-05 16:00:00,-33.0,2.0
2016-01-05 16:15:00,-33.0,2.0
2016-01-05 16:30:00,-33.0,0.0
2016-01-05 16:45:00,-33.0,0.0
2016-01-05 17:00:00,-33.0,0.0
2016-01-05 17:15:00,-33.0,0.0
2016-01-05 17:30:00,-33.0,0.0
2016-01-05 17:45:00,-33.0,0.0
2016-01-05 18:00:00,-33.0,0.0
2016-01-05 18:15:00,-33.0,0.0
2016-01-05 18:30:00,-33.0,0.0
2016-01-05 18:45:00,-33.0,0.0
2016-01-05 19:00:00,-33.0,0.0
2016-01-05 19:15:00,-33.0,0.0
2016-01-05 19:30:00,-33.0,0.0
2016-01-05 19:45:00,-33.0,0.0
2016-01-05 20:00:00,-33.0,0.0
2016-01-05 20:15:00,-33.0,0.0
2016-01-05 20:30:00,-33.0,0.0
2016-01-05 20:45:00,-33.0,0.0
2016-01-05 21:00:00,-33.0,0.0
2016-01-05 21:15:00,-33.0,0.0
2016-01-05 21:30:00,-33.0,0.0
2016-01-05 21:45:00,-33.0,0.0
2016-01-05 22:00:00,-33.0,0.0
2016-01-05 22:15:00,-33.0,0.0
2016-01-05 22:30:00,-33.0,0.0
2016-01-05 22:45:00,-33.0,0.0
2016-01-05 23:00:00,-33.0,0.0
2016-01-05 23:15:00,-33.0,0.0
2016-01-05 23:30:00,-33.0,0.0
2016-01-05 23:45:00,-33.0,0.0
2016-01-06 00:00:00,-33.0,0.0
2016-01-06 00:15:00,-33.0,0.0
2016-01-06 00:30:00,-33.0,0.0
2016-01-06 00:45:00,-33.0,0.0
2016-01-06 01:00:00,-33.0,0.0
2016-01-06 01:15:00,-33.0,0.0
2016-01-06 01:30:00,-33.0,0.0
2016-01-06 01:45:00,-33.0,0.0
2016-01-06 02:00:00,-33.0,0.0
2016-01-06 02:15:00,-33.0,0.0
2016-01-06 02:30:00,-33.0,0.0
2016-01-06 02:45:00,-33.0,0.0
2016-01-06 03:00:00,-33.0,0.0
2016-01-06 03:15:00,-33.0,0.0
2016-01-06 03:30:00,-33.0,0.0
2016-01-06 03:45:00,-33.0,0.0
2016-01-06 04:00:00,-33.0,0.0
2016-01-06 04:15:00,-33.0,0.0
2016-01-06 04:30:00,-33.0,0.0
2016-01-06 04:45:00,-33.0,0.0
2016-01-06 05:00:00,-33.0,0.0
2016-01-06 05:15:00,-33.0,0.0
2016-01-06 05:30:00,-33.0,0.0
2016-01-06 05:45:00,-33.0,0.0
2016-01-06 06:00:00,-33.0,0.0
2016-01-06 06:15:00,-33.0,0.0
2016-01-06 06:30:00,-33.0,0.0
2016-01-06 06:45:00,-33.0,0.0
2016-01-06 07:00:00,-33.0,0.0
2016-01-06 07:15:00,-33.0,0.0
2016-01-06 07:30:00,-33.0,0.0
2016-01-06 07:45:00,-33.0,0.0
2016-01-06 08:00:00,-33.0,0.0
2016-01-06 08:15:00,-33.0,0.0
2016-01-06 08:30:00,-33.0,0.0
2016-01-06 08:45:00,-33.0,0.0
2016-01-06 09:00:00,-33.0,3.0
2016-01-06 09:15:00,-33.0,3.0
2016-01-06 09:30:00,-33.0,10.0
2016-01-06 09:45:00,-33.0,10.0
2016-01-06 10:00:00,-33.0,18.0
2016-01-06 10:15:00,-33.0,18.0
2016-01-06 10:30:00,181.62287062433893,30.0
2016-01-06 10:45:00,181.2861415063569,30.0
2016-01-06 11:00:00,180.8014392472178,30.0
2016-01-06 11:15:00,180.75574633699418,30.0
2016-01-06 11:30:00,441.0344710676051,41.0
2016-01-06 11:45:00,441.37867795226794,41.0
2016-01-06 12:00:00,489.60510153741114,43.0
2016-01-06 12:15:00,490.3654861104534,43.0
2016-01-06 12:30:00,536.7495759161756,45.0
2016-01-06 12:45:00,537.8933430152623,45.0
2016-01-06 13:00:00,537.3526159091275,45.0
2016-01-06 13:15:00,538.7176419713558,45.0
2016-01-06 13:30:00,685.6075943189069,51.0
2016-01-06 13:45:00,1072.8225438031227,51.0
2016-01-06 14:00:00,225.334738312007,32.0
2016-01-06 14:15:00,470.7895132267928,32.0
2016-01-06 14:30:00,-33.0,23.0
2016-01-06 14:45:00,-33.0,23.0
2016-01-06 15:00:00,-33.0,16.0
2016-01-06 15:15:00,-33.0,16.0
2016-01-06 15:30:00,-33.0,10.0
2016-01-06 15:45:00,-33.0,10.0
2016-01-06 16:00:00,-33.0,2.0
2016-01-06 16:15:00,-33.0,2.0
2016-01-06 16:30:00,-33.0,0.0
2016-01-06 16:45:00,-33.0,0.0
2016-01-06 17:00:00,-33.0,0.0
2016-01-06 17:15:00,-33.0,0.0
2016-01-06 17:30:00,-33.0,0.0
2016-01-06 17:45:00,-33.0,0.0
2016-01-06 18:00:00,-33.0,0.0
2016-01-06 18:15:00,-33.0,0.0
2016-01-06 18:30:00,-33.0,0.0
2016-01-06 18:45:00,-33.0,0.0
2016-01-06 19:00:00,-33.0,0.0
2016-01-06 19:15:00,-33.0,0.0
2016-01-06 19:30:00,-33.0,0.0
2016-01-06 19:45:00,-33.0,0.0
2016-01-06 20:00:00,-33.0,0.0
2016-01-06 20:15:00,-33.0,0.0
2016-01-06 20:30:00,-33.0,0.0
2016-01-06 20:45:00,-33.0,0.0
2016-01-06 21:00:00,-33.0,0.0
2016-01-06 21:15:00,-33.0,0.0
2016-01-06 21:30:00,-33.0,0.0
2016-01-06 21:45:00,-33.0,0.0
2016-01-06 22:00:00,-33.0,0.0
2016-01-06 22:15:00,-33.0,0.0
2016-01-06 22:30:00,-33.0,0.0
2016-01-06 22:45:00,-33.0,0.0
2016-01-06 23:00:00,-33.0,0.0
2016-01-06 23:15:00,-33.0,0.0
2016-01-06 23:30:00,-33.0,0.0
2016-01-06 23:45:00,-33.0,0.0
2016-01-07 00:00:00,-33.0,0.0
2016-01-07 00:15:00,-33.0,0.0
2016-01-07 00:30:00,-33.0,0.0
2016-01-07 00:45:00,-33.0,0.0
2016-01-07 01:00:00,-33.0,0.0
2016-01-07 01:15:00,-33.0,0.0
2016-01-07 01:30:00,-33.0,0.0
2016-01-07 01:45:00,-33.0,0.0
2016-01-07 02:00:00,-33.0,0.0
2016-01-07 02:15:00,-33.0,0.0
2016-01-07 02:30:00,-33.0,0.0
2016-01-07 02:45:00,-33.0,0.0
2016-01-07 03:00:00,-33.0,0.0
2016-01-07 03:15:00,-33.0,0.0
2016-01-07 03:30:00,-33.0,0.0
2016-01-07 03:45:00,-33.0,0.0
2016-01-07 04:00:00,-33.0,0.0
2016-01-07 04:15:00,-33.0,0.0
2016-01-07 04:30:00,-33.0,0.0
2016-01-07 04:45:00,-33.0,0.0
2016-01-07 05:00:00,-33.0,0.0
2016-01-07 05:15:00,-33.0,0.0
2016-01-07 05:30:00,-33.0,0.0
2016-01-07 05:45:00,-33.0,0.0
2016-01-07 06:00:00,-33.0,0.0
2016-01-07 06:15:00,-33.0,0.0
2016-01-07 06:30:00,-33.0,0.0
2016-01-07 06:45:00,-33.0,0.0
2016-01-07 07:00:00,-33.0,0.0
2016-01-07 07:15:00,-33.0,0.0
2016-01-07 07:30:00,-33.0,0.0
2016-01-07 07:45:00,-33.0,0.0
2016-01-07 08:00:00,-33.0,0.0
2016-01-07 08:15:00,-33.0,0.0
2016-01-07 08:30:00,-33.0,2.0
2016-01-07 08:45:00,-33.0,2.0
2016-01-07 09:00:00,-33.0,5.0
2016-01-07 09:15:00,-33.0,5.0
2016-01-07 09:30:00,-33.0,17.0
2016-01-07 09:45:00,-33.0,17.0
2016-01-07 10:00:00,297.99279946100796,35.0
2016-01-07 10:15:00,297.2826589494114,35.0
2016-01-07 10:30:00,2299.052286540654,98.0
2016-01-07 10:45:00,2172.0518654234593,98.0
2016-01-07 11:00:00,603.7539436507076,48.0
2016-01-07 11:15:00,603.6722092367615,48.0
2016-01-07 11:30:00,3027.2176315758247,109.0
2016-01-07 11:45:00,3151.1144821013677,109.0
2016-01-07 12:00:00,1342.5377891887476,79.0
2016-01-07 12:15:00,1343.9469777354836,79.0
2016-01-07 12:30:00,794.1203780908301,56.0
2016-01-07 12:45:00,795.5503719116944,56.0
2016-01-07 13:00:00,577.8798919319873,47.0
2016-01-07 13:15:00,579.3115040148499,47.0
2016-01-07 13:30:00,463.7842408941023,42.0
2016-01-07 13:45:00,464.2066936832947,42.0
2016-01-07 14:00:00,245.62900704551765,33.0
2016-01-07 14:15:00,510.45086802710125,33.0
2016-01-07 14:30:00,638.0963057813603,27.0
2016-01-07 14:45:00,-33.0,27.0
2016-01-07 15:00:00,-33.0,23.0
2016-01-07 15:15:00,-33.0,23.0
2016-01-07 15:30:00,-33.0,9.0
2016-01-07 15:45:00,-33.0,9.0
2016-01-07 16:00:00,-33.0,2.0
2016-01-07 16:15:00,-33.0,2.0
2016-01-07 16:30:00,-33.0,0.0
2016-01-07 16:45:00,-33.0,0.0
2016-01-07 17:00:00,-33.0,0.0
2016-01-07 17:15:00,-33.0,0.0
2016-01-07 17:30:00,-33.0,0.0
2016-01-07 17:45:00,-33.0,0.0
2016-01-07 18:00:00,-33.0,0.0
2016-01-07 18:15:00,-33.0,0.0
2016-01-07 18:30:00,-33.0,0.0
2016-01-07 18:45:00,-33.0,0.0
2016-01-07 19:00:00,-33.0,0.0
2016-01-07 19:15:00,-33.0,0.0
2016-01-07 19:30:00,-33.0,0.0
2016-01-07 19:45:00,-33.0,0.0
2016-01-07 20:00:00,-33.0,0.0
2016-01-07 20:15:00,-33.0,0.0
2016-01-07 20:30:00,-33.0,0.0
2016-01-07 20:45:00,-33.0,0.0
2016-01-07 21:00:00,-33.0,0.0
2016-01-07 21:15:00,-33.0,0.0
2016-01-07 21:30:00,-33.0,0.0
2016-01-07 21:45:00,-33.0,0.0
2016-01-07 22:00:00,-33.0,0.0
2016-01-07 22:15:00,-33.0,0.0
2016-01-07 22:30:00,-33.0,0.0
2016-01-07 22:45:00,-33.0,0.0
2016-01-07 23:00:00,-33.0,0.0
2016-01-07 23:15:00,-33.0,0.0
2016-01-07 23:30:00,-33.0,0.0
2016-01-07 23:45:00,-33.0,0.0
