/** Format: date;user;IP;action;id match;id_competition;id_home;id_away;result */
"2012-07-19 13:55:03";"Zdenda";"127.0.0.1";"Create Prediction";"30";"2";"5";"6";"Successful"
"2012-07-19 14:02:30";"Zdenda";"127.0.0.1";"Update Prediction";"30";"2";"5";"6";"Successful"
"2012-07-19 14:03:13";"Zdenda";"127.0.0.1";"Create Prediction";"32";"2";"6";"1";"Successful"
"2012-08-25 13:17:52";"Zdenda";"127.0.0.1";"Create Prediction";"66";"2";"2";"5";"Successful"
"2012-08-25 13:18:55";"Zdenda";"127.0.0.1";"Create Prediction";"90";"12";"15";"14";"Successful"
"2013-01-24 13:46:15";"Zdenda";"127.0.0.1";"Create Prediction";"1";"3";"2";"3";"Successful"
"2013-07-03 19:37:20";"Zdenda";"127.0.0.1";"Create Prediction";"44";"8";"6";"1";"Successful"
"2013-07-06 17:11:27";"Zdenda";"127.0.0.1";"Update Prediction";"44";"8";"6";"1";"Successful"
"2013-07-09 15:11:46";"tiper";"127.0.0.1";"Create Prediction";"44";"8";"6";"1";"Successful"
"2013-07-12 13:36:21";"Zdenda";"127.0.0.1";"Create Prediction";"965";"12";"20";"8";"Successful"
"2013-07-12 13:36:27";"Zdenda";"127.0.0.1";"Update Prediction";"965";"12";"20";"8";"Successful"
"2013-07-15 10:10:36";"Zdenda";"127.0.0.1";"Create Prediction";"6";"8";"1";"5";"Successful"
