"2011-08-30 14:01:26";"User";"127.0.0.1";"Create Match";"Pardubice:Makov (29)";"1";"Successful"
"2011-08-30 14:01:30";"User";"127.0.0.1";"Create Match";"Olomouc:Morašice (30)";"1";"Successful"
"2011-08-30 14:01:49";"User";"127.0.0.1";"Create Period";"0:0";"29";"Successful"
"2011-08-30 14:01:52";"User";"127.0.0.1";"Create Period";"1:1";"29";"Successful"
"2011-08-30 14:01:59";"User";"127.0.0.1";"Create Period";"0:2";"29";"Successful"
"2011-08-30 14:02:01";"User";"127.0.0.1";"Delete Period";"0:2";"29";"Successful"
"2011-08-30 14:02:08";"User";"127.0.0.1";"Update Period";"1:1 changed to 1:2";"29";"Successful"
"2011-08-30 14:02:11";"User";"127.0.0.1";"Delete Result";"1:2";"29";"Successful"
"2011-08-30 14:02:35";"User";"127.0.0.1";"Create Period";"1:3";"29";"Successful"
"2011-08-30 14:02:40";"User";"127.0.0.1";"Delete Match";"Olomouc:Morašice (30)";"1";"Successful"
"2011-08-30 14:11:57";"User";"127.0.0.1";"Period Note";"Delete note period n.1";"20";"Fail"
"2011-08-30 14:26:10";"User";"127.0.0.1";"Period Note";"Add note period n.2";"20";"Successful"
"2011-08-30 14:27:05";"User";"127.0.0.1";"Period Note";"Delete note period n.2";"20";"Successful"
"2011-08-30 14:27:06";"User";"127.0.0.1";"Period Note";"Delete note period n.2";"20";"Fail"
"2011-08-31 17:37:14";"User";"127.0.0.1";"Update Match";"Changed home team to Olomouc (29)";"1";"Successful"
"2011-08-31 17:37:44";"User";"127.0.0.1";"Update Match";"Changed home team to Pardubice (29)";"1";"Successful"
"2011-08-31 17:41:10";"User";"127.0.0.1";"Update Match";"Changed away team to Olomouc (29)";"1";"Successful"
"2011-08-31 17:41:15";"User";"127.0.0.1";"Update Match";"Changed away team to Makov (29)";"1";"Successful"
"2011-08-31 17:43:27";"User";"127.0.0.1";"Update Match";"Datetime (29)";"1";"Successful"
"2012-04-05 13:49:05";"Zdenda";"127.0.0.1";"Create Period";"1:2 (1)";"Successful"
"2012-04-05 15:05:38";"Zdenda";"127.0.0.1";"Period Note";"Add note period n.1 (1)";"Successful"
"2012-04-05 15:51:58";"Zdenda";"127.0.0.1";"Update Match";"Datetime (1)";"Successful"
"2012-04-05 15:52:50";"Zdenda";"127.0.0.1";"Update Match";"Datetime (1)";"Successful"
"2012-04-05 15:59:17";"Zdenda";"127.0.0.1";"Create Match";"Morašice A:Pardubice C (2)";"Successful"
"2012-04-05 16:00:32";"Zdenda";"127.0.0.1";"Update Match";"Datetime (2)";"Successful"
"2012-04-08 10:21:45";"Zdenda";"127.0.0.1";"Update Match";"Datetime (2)";"Successful"
"2012-04-10 16:12:53";"Zdenda";"127.0.0.1";"Create Match";"Morašice A:Pardubice C (3)";"Successful"
"2012-04-10 16:13:18";"Zdenda";"127.0.0.1";"Create Period";"2:2 (3)";"Successful"
"2012-04-10 16:15:22";"Zdenda";"127.0.0.1";"Update Match";"Datetime (3)";"Successful"
"2012-04-10 16:16:03";"Zdenda";"127.0.0.1";"Update Period";"2:2 changed to 1:2 (3)";"Successful"
"2012-04-10 16:16:15";"Zdenda";"127.0.0.1";"Period Note";"Add note period n.1 (3)";"Successful"
"2012-04-10 16:16:33";"Zdenda";"127.0.0.1";"Update Period";"1:2 changed to 0:1 (3)";"Successful"
"2012-04-10 16:16:58";"Zdenda";"127.0.0.1";"Period Note";"Delete note period n.1 (3)";"Successful"
"2012-04-10 16:17:01";"Zdenda";"127.0.0.1";"Delete Period";"0:1 (3)";"Successful"
"2012-04-10 16:17:17";"Zdenda";"127.0.0.1";"Create Period";"1:1 (3)";"Successful"
"2012-04-10 16:17:23";"Zdenda";"127.0.0.1";"Delete Result";"1:1 (3)";"Successful"
"2012-04-10 16:17:26";"Zdenda";"127.0.0.1";"Delete Match";"Morašice A:Pardubice C (3)";"Successful"
"2012-04-10 16:49:04";"Zdenda";"127.0.0.1";"Create Match";"Makov:Morašice A (4)";"Successful"
"2012-04-10 16:53:12";"Zdenda";"127.0.0.1";"Update Match";"Datetime (1)";"Successful"
"2012-04-11 10:18:52";"Zdenda";"127.0.0.1";"Create Period";"1:2 (5)";"Successful"
"2012-04-11 10:21:06";"Zdenda";"127.0.0.1";"Create Period";"1:1 (6)";"Successful"
"2012-04-11 10:40:55";"Zdenda";"127.0.0.1";"Create Match";"Morašice A:Pardubice C (7)";"Successful"
"2012-04-11 10:41:03";"Zdenda";"127.0.0.1";"Create Match";"Morašice B:Makov (8)";"Successful"
"2012-04-11 10:41:13";"Zdenda";"127.0.0.1";"Create Period";"1:0 (7)";"Successful"
"2012-04-11 10:41:20";"Zdenda";"127.0.0.1";"Create Period";"2:4 (8)";"Successful"
"2012-04-12 14:43:38";"Zdenda";"127.0.0.1";"Create Match";"Makov:Praha (9)";"Successful"
"2012-04-12 14:43:47";"Zdenda";"127.0.0.1";"Create Period";"2:0 (9)";"Successful"
"2012-04-12 14:43:58";"Zdenda";"127.0.0.1";"Create Match";"Plzeň:Hradec Králové (10)";"Successful"
"2012-04-12 14:44:11";"Zdenda";"127.0.0.1";"Create Period";"4:1 (10)";"Successful"
"2012-04-12 14:44:29";"Zdenda";"127.0.0.1";"Create Match";"Pardubice:Ostrava (11)";"Successful"
"2012-04-12 14:44:44";"Zdenda";"127.0.0.1";"Create Period";"2:3 (11)";"Successful"
"2012-04-12 14:45:39";"Zdenda";"127.0.0.1";"Create Match";"Brno:Liberec (12)";"Successful"
"2012-04-12 14:45:48";"Zdenda";"127.0.0.1";"Create Period";"0:5 (12)";"Successful"
"2012-04-12 14:46:18";"Zdenda";"127.0.0.1";"Create Match";"Makov:Liberec (13)";"Successful"
"2012-04-12 14:46:26";"Zdenda";"127.0.0.1";"Create Period";"4:3 (13)";"Successful"
"2012-04-12 14:59:06";"Zdenda";"127.0.0.1";"Create Match";"Makov:Žilina (14)";"Successful"
"2012-04-12 14:59:13";"Zdenda";"127.0.0.1";"Create Period";"2:0 (14)";"Successful"
"2012-04-12 14:59:22";"Zdenda";"127.0.0.1";"Create Match";"Bratislava:Praha (15)";"Successful"
"2012-04-12 14:59:32";"Zdenda";"127.0.0.1";"Create Period";"0:1 (15)";"Successful"
"2012-04-12 14:59:39";"Zdenda";"127.0.0.1";"Create Match";"Česká Třebová:Brno (16)";"Successful"
"2012-04-12 14:59:48";"Zdenda";"127.0.0.1";"Create Period";"3:2 (16)";"Successful"
"2012-04-12 14:59:51";"Zdenda";"127.0.0.1";"Create Match";"Olomouc:Plzeň (17)";"Successful"
"2012-04-12 14:59:58";"Zdenda";"127.0.0.1";"Create Period";"0:4 (17)";"Successful"
"2012-04-12 15:00:06";"Zdenda";"127.0.0.1";"Create Match";"Chomutov:Pardubice (18)";"Successful"
"2012-04-12 15:00:10";"Zdenda";"127.0.0.1";"Create Match";"Chomutov:Pardubice (19)";"Successful"
"2012-04-12 15:00:18";"Zdenda";"127.0.0.1";"Create Period";"0:2 (18)";"Successful"
"2012-04-12 15:00:29";"Zdenda";"127.0.0.1";"Create Match";"Mladá Boleslav:Liberec (20)";"Successful"
"2012-04-12 15:00:38";"Zdenda";"127.0.0.1";"Create Period";"0:1 (20)";"Successful"
"2012-04-12 15:00:44";"Zdenda";"127.0.0.1";"Create Match";"České Budejovice:Hradec Králové (21)";"Successful"
"2012-04-12 15:00:53";"Zdenda";"127.0.0.1";"Create Period";"2:4 (21)";"Successful"
"2012-04-12 15:00:57";"Zdenda";"127.0.0.1";"Create Match";"Jihlava:Ostrava (22)";"Successful"
"2012-04-12 15:01:03";"Zdenda";"127.0.0.1";"Create Period";"0:1 (22)";"Successful"
"2012-04-12 15:02:08";"Zdenda";"127.0.0.1";"Create Match";"Makov:Ostrava (23)";"Successful"
"2012-04-12 15:02:21";"Zdenda";"127.0.0.1";"Create Period";"1:0 (23)";"Successful"
"2012-04-12 15:02:24";"Zdenda";"127.0.0.1";"Create Match";"Plzeň:Pardubice (24)";"Successful"
"2012-04-12 15:02:33";"Zdenda";"127.0.0.1";"Create Match";"Pardubice:Plzeň (25)";"Successful"
"2012-04-12 15:02:38";"Zdenda";"127.0.0.1";"Create Match";"Plzeň:Pardubice (26)";"Successful"
"2012-04-12 15:02:46";"Zdenda";"127.0.0.1";"Create Period";"1:2 (26)";"Successful"
"2012-07-09 13:17:28";"Admin";"127.0.0.1";"Create Match";"morasice:makov (1)";"Successful"
"2012-07-09 13:18:07";"Admin";"127.0.0.1";"Create Period";"1:1 (1)";"Successful"
"2012-07-09 13:19:45";"Admin";"127.0.0.1";"Update Period";"1:1 changed to 2:5 (1)";"Successful"
"2012-07-09 13:29:02";"Zdenda";"127.0.0.1";"Create Period";"2:5 (1)";"Successful"
"2012-07-09 13:43:01";"Admin";"127.0.0.1";"Create Match";"makov:morasic (1)";"Successful"
"2012-07-09 13:43:15";"Admin";"127.0.0.1";"Create Period";"2:2 (1)";"Successful"
"2012-07-09 13:43:26";"Admin";"127.0.0.1";"Update Period";"2:2 changed to 2:0 (1)";"Successful"
"2012-07-09 13:43:43";"Admin";"127.0.0.1";"Period Note";"Add note period n.1 (1)";"Successful"
"2012-07-10 10:29:53";"Zdenda";"127.0.0.1";"Delete Detail";"Morašice A:Morašice B (5)";"Successful"
"2012-07-10 11:01:01";"Zdenda";"127.0.0.1";"Update Detail";"Morašice A:Morašice B (5)";"Fail"
"2012-07-10 11:09:07";"Zdenda";"127.0.0.1";"Update Detail";"Morašice A:Morašice B (5)";"Successful"
"2012-07-10 14:07:54";"Zdenda";"127.0.0.1";"Referees";"Update Position of Zdeněk Drahoš in Morašice A:Morašice B (5)";"Successful"
"2012-07-10 14:08:00";"Zdenda";"127.0.0.1";"Referees";"Update Position of Zdeněk Drahoš in Morašice A:Morašice B (5)";"Successful"
"2012-07-10 14:08:25";"Zdenda";"127.0.0.1";"Referees";"Delete member Zdeněk Drahoš [Hlavní rozhodčí] in Morašice A:Morašice B (5)";"Successful"
"2012-07-10 14:08:31";"Zdenda";"127.0.0.1";"Referees";"Add referee Zdeněk Drahoš [Hlavní rozhodčí] to Morašice A:Morašice B (5)";"Successful"
"2012-07-10 14:08:41";"Zdenda";"127.0.0.1";"Referees";"Add referee Jaromír Jágr [Asistent] to Morašice A:Morašice B (5)";"Successful"
"2012-07-10 14:35:18";"Zdenda";"127.0.0.1";"Referees";"Delete member Jaromír Jágr [Asistent] in Morašice A:Morašice B (5)";"Successful"
"2012-07-10 14:37:31";"Zdenda";"127.0.0.1";"Referees";"Update Position of Zdeněk Drahoš in Morašice A:Morašice B (5)";"Successful"
"2012-07-10 14:37:35";"Zdenda";"127.0.0.1";"Referees";"Update Position of Zdeněk Drahoš in Morašice A:Morašice B (5)";"Successful"
"2012-07-10 14:37:55";"Zdenda";"127.0.0.1";"Referees";"Add referee Jaromír Jágr [Asistent] to Morašice A:Morašice B (5)";"Successful"
"2012-07-10 14:51:09";"Zdenda";"127.0.0.1";"Referees";"Add referee Testovací Králik [Asistent] to Morašice A:Morašice B (5)";"Successful"
"2012-07-10 14:53:12";"Zdenda";"127.0.0.1";"Referees";"Delete member Testovací Králik [Asistent] in Morašice A:Morašice B (5)";"Successful"
"2012-07-10 20:38:09";"Zdenda";"127.0.0.1";"Players";"Delete player Jaromír Jágr (Boss) in Morašice A:Morašice B (5)";"Fail"
"2012-07-10 20:41:51";"Zdenda";"127.0.0.1";"Players";"Delete player Jaromír Jágr (Boss) in Morašice A:Morašice B (5)";"Successful"
"2012-07-11 09:54:41";"Zdenda";"127.0.0.1";"Players";"Update player Zdeněk Drahoš (Goalkeeper) in Morašice A:Morašice B (5)";"Successful"
"2012-07-11 09:54:46";"Zdenda";"127.0.0.1";"Players";"Update player Zdeněk Drahoš (Goalkeeper) in Morašice A:Morašice B (5)";"Successful"
"2012-07-11 09:54:53";"Zdenda";"127.0.0.1";"Players";"Update player Zdeněk Drahoš (Goalkeeper) in Morašice A:Morašice B (5)";"Successful"
"2012-07-11 09:54:57";"Zdenda";"127.0.0.1";"Players";"Update player Zdeněk Drahoš (Goalkeeper) in Morašice A:Morašice B (5)";"Successful"
"2012-07-11 09:56:52";"Zdenda";"127.0.0.1";"Players";"Update player Zdeněk Drahoš (Goalkeeper) in Morašice A:Morašice B (5)";"Successful"
"2012-07-11 09:56:58";"Zdenda";"127.0.0.1";"Players";"Update player Zdeněk Drahoš (Goalkeeper) in Morašice A:Morašice B (5)";"Successful"
"2012-07-11 10:46:45";"Zdenda";"127.0.0.1";"Players";"Update player Jaromír Jágr (Boss) in Morašice A:Morašice B (5)";"Successful"
"2012-07-11 10:46:49";"Zdenda";"127.0.0.1";"Players";"Update player Jaromír Jágr (Boss) in Morašice A:Morašice B (5)";"Successful"
"2012-07-11 11:20:19";"Zdenda";"127.0.0.1";"Players";"Create players 0/0 in Morašice A:Morašice B (5)";"Successful"
"2012-07-11 11:21:49";"Zdenda";"127.0.0.1";"Players";"Create players 0/1 in Morašice A:Morašice B (5)";"Successful"
"2012-07-11 11:36:12";"Zdenda";"127.0.0.1";"Players";"Create players 1/1 in Morašice A:Morašice B (5)";"Successful"
"2012-07-11 11:45:45";"Zdenda";"127.0.0.1";"Players";"Create players 0/0 in Morašice A:Morašice B (5)";"Successful"
"2012-07-11 11:47:10";"Zdenda";"127.0.0.1";"Players";"Delete player Martin Štancl (Goalkeeper) in Morašice A:Morašice B (5)";"Successful"
"2012-07-11 11:47:15";"Zdenda";"127.0.0.1";"Players";"Create players 0/0 in Morašice A:Morašice B (5)";"Successful"
"2012-07-11 11:50:26";"Zdenda";"127.0.0.1";"Players";"Create players 1/1 in Morašice A:Morašice B (5)";"Successful"
"2012-07-11 11:54:33";"Zdenda";"127.0.0.1";"Players";"Delete player Martin Štancl (Goalkeeper) in Morašice A:Morašice B (5)";"Successful"
"2012-07-11 12:28:07";"Zdenda";"127.0.0.1";"Players";"Create players 1/1 in Morašice A:Morašice B (5)";"Successful"
"2012-07-11 12:28:59";"Zdenda";"127.0.0.1";"Players";"Update player Martin Štancl (Goalkeeper) in Morašice A:Morašice B (5)";"Successful"
"2012-07-11 14:18:27";"Zdenda";"127.0.0.1";"Match Actions";"New Match Action: Yellow Card";"Successful"
"2012-07-11 14:23:51";"Zdenda";"127.0.0.1";"Match Actions";"Update Match Action Yellow Card to Žlutá karta";"Successful"
"2012-07-11 14:24:01";"Zdenda";"127.0.0.1";"Match Actions";"Delete Match Action: Žlutá karta";"Successful"
"2012-07-11 14:43:40";"Zdenda";"127.0.0.1";"Match Actions";"New Match Action: Nevynucené chyby";"Successful"
"2012-07-11 14:43:45";"Zdenda";"127.0.0.1";"Match Actions";"Update Match Action Nevynucené chyby to Nevynucené chybyy";"Successful"
"2012-07-11 14:43:48";"Zdenda";"127.0.0.1";"Match Actions";"Update Match Action Nevynucené chybyy to Nevynucené chyby";"Successful"
"2012-07-11 15:39:03";"Zdenda";"127.0.0.1";"Match Actions";"Update Match Action Goal to Rohy";"Successful"
"2012-07-11 16:41:50";"Zdenda";"127.0.0.1";"Match Team Actions";"Update action Rohy = 5:6 in Morašice A:Morašice B (5)";"Fail"
"2012-07-11 16:47:09";"Zdenda";"127.0.0.1";"Match Team Actions";"Update action Rohy = 5:6 in Morašice A:Morašice B (5)";"Successful"
"2012-07-11 17:07:11";"Zdenda";"127.0.0.1";"Match Actions";"New Match Action: Penalty";"Successful"
"2012-07-11 17:09:49";"Zdenda";"127.0.0.1";"Match Team Actions";"Create action Penalty in Morašice A:Morašice B (5)";"Successful"
"2012-07-11 17:27:20";"Zdenda";"127.0.0.1";"Match Team Actions";"Update action Rohy = 4:6 in Morašice A:Morašice B (5)";"Successful"
"2012-07-11 17:28:20";"Zdenda";"127.0.0.1";"Match Team Actions";"Create action Penalty in Morašice A:Morašice B (5)";"Successful"
"2012-07-12 10:14:09";"Zdenda";"127.0.0.1";"Match Actions";"New Match Action: Žlutá karta";"Successful"
"2012-07-12 10:39:39";"Zdenda";"127.0.0.1";"Match Player Actions";"Create action Zdeněk Drahoš (Goalkeeper, Morašice B) (Žlutá karta, 20) in Morašice A:Morašice B (5)";"Successful"
"2012-07-12 10:40:05";"Zdenda";"127.0.0.1";"Match Player Actions";"Create action Martin Štancl (Goalkeeper, Morašice B) (Žlutá karta, 88) in Morašice A:Morašice B (5)";"Successful"
"2012-07-12 10:45:09";"Zdenda";"127.0.0.1";"Match Player Actions";"Create action Martin Štancl (Goalkeeper, Morašice B) (Penalty, 90) in Morašice A:Morašice B (5)";"Successful"
"2012-07-12 11:21:03";"Zdenda";"127.0.0.1";"Match Player Actions";"Create action Zdeněk Drahoš (Goalkeeper, Morašice B) (Rohy, 0) in Morašice A:Morašice B (5)";"Successful"
"2012-07-12 11:21:22";"Zdenda";"127.0.0.1";"Match Player Actions";"Update action Zdeněk Drahoš (Rohy, 0) in Morašice A:Morašice B (5)";"Successful"
"2012-07-12 11:21:25";"Zdenda";"127.0.0.1";"Match Player Actions";"Delete action Zdeněk Drahoš (Rohy, 0) in Morašice A:Morašice B (5)";"Successful"
"2012-07-12 13:19:57";"Zdenda";"127.0.0.1";"Match Actions";"New Match Action: sadsa";"Successful"
"2012-07-12 13:20:05";"Zdenda";"127.0.0.1";"Match Actions";"Delete Match Action: sadsa";"Successful"
"2012-07-12 14:03:55";"Zdenda";"127.0.0.1";"Match Actions";"Delete Match Action From Teams: Penalty";"Successful"
"2012-07-12 14:04:02";"Zdenda";"127.0.0.1";"Match Actions";"Delete Match Action From Players: Penalty";"Successful"
"2012-07-12 14:04:21";"Zdenda";"127.0.0.1";"Match Player Actions";"Update action Martin Štancl (Žlutá karta, 90) in Morašice A:Morašice B (5)";"Successful"
"2012-07-12 14:11:52";"Zdenda";"127.0.0.1";"Match Actions";"New Match Action: dsadas";"Successful"
"2012-07-12 14:12:18";"Zdenda";"127.0.0.1";"Match Actions";"Delete Match Action From Teams: dsadas";"Successful"
"2012-07-12 14:12:24";"Zdenda";"127.0.0.1";"Match Actions";"Delete Match Action: dsadas";"Successful"
"2012-07-12 17:56:31";"Zdenda";"127.0.0.1";"Update Match";"Match Morašice A:Morašice B (5)";"Successful"
"2012-07-12 17:56:47";"Zdenda";"127.0.0.1";"Update Match";"Match Morašice B:Morašice A (5)";"Successful"
"2012-07-12 20:03:39";"Zdenda";"127.0.0.1";"Create Match";"Česká Třebová:Bratislava (27)";"Successful"
"2012-07-12 20:04:25";"Zdenda";"127.0.0.1";"Update Match";"Match Česká Třebová:Bratislava (27)";"Successful"
"2012-07-12 20:05:40";"Zdenda";"127.0.0.1";"Update Match";"Match Bratislava:Česká Třebová (27)";"Successful"
"2012-07-12 20:06:04";"Zdenda";"127.0.0.1";"Update Match";"Match Česká Třebová:Bratislava (27)";"Successful"
"2012-07-12 20:07:21";"Zdenda";"127.0.0.1";"Create Match";"Makov:Morašice A (28)";"Successful"
"2012-07-12 20:07:34";"Zdenda";"127.0.0.1";"Create Match";"Morašice B:Pardubice C (29)";"Successful"
"2012-07-12 20:07:50";"Zdenda";"127.0.0.1";"Update Match";"Match Makov:Morašice A (28)";"Successful"
"2012-07-12 20:17:50";"Zdenda";"127.0.0.1";"Update Match";"Match Morašice A:Makov (28)";"Successful"
"2012-07-12 20:18:24";"Zdenda";"127.0.0.1";"Create Match";"Makov:Pardubice C (30)";"Successful"
"2012-07-12 20:18:44";"Zdenda";"127.0.0.1";"Update Match";"Match Morašice A:Makov (28)";"Successful"
"2012-07-12 20:20:40";"Zdenda";"127.0.0.1";"Create Match";"Makov:Morašice B (31)";"Successful"
"2012-07-12 20:22:27";"Zdenda";"127.0.0.1";"Create Match";"Morašice B:Makov (32)";"Successful"
"2012-07-12 20:22:38";"Zdenda";"127.0.0.1";"Create Match";"Pardubice C:Morašice A (33)";"Successful"
"2012-07-12 20:22:55";"Zdenda";"127.0.0.1";"Create Period";"5:9 (32)";"Successful"
"2012-07-12 20:23:00";"Zdenda";"127.0.0.1";"Create Period";"2:0 (33)";"Successful"
"2012-07-12 20:26:14";"Zdenda";"127.0.0.1";"Update Match";"Match Pardubice C:Morašice A (33)";"Successful"
"2012-07-12 20:28:08";"Zdenda";"127.0.0.1";"Create Match";"Makov:Morašice A (34)";"Successful"
"2012-07-12 20:28:59";"Zdenda";"127.0.0.1";"Update Match";"Match Morašice A:Pardubice C (33)";"Successful"
"2012-07-12 20:30:14";"Zdenda";"127.0.0.1";"Create Period";"5:8 (33)";"Successful"
"2012-07-13 09:27:59";"Zdenda";"127.0.0.1";"Create Period";"2:2 (1)";"Successful"
"2012-07-13 09:28:03";"Zdenda";"127.0.0.1";"Create Period";"1:1 (1)";"Successful"
"2012-07-13 09:28:09";"Zdenda";"127.0.0.1";"Delete Period";"2:2 (1)";"Successful"
"2012-07-13 09:28:14";"Zdenda";"127.0.0.1";"Update Period";"1:1 changed to 1:2 (1)";"Successful"
"2012-07-13 09:28:17";"Zdenda";"127.0.0.1";"Delete Period";"1:2 (1)";"Successful"
"2012-07-13 18:10:40";"Zdenda";"127.0.0.1";"Create Period";"0:3 in Pardubice C:Makov (27)";"Successful"
"2012-07-14 10:42:09";"Zdenda";"127.0.0.1";"Update Period";"1:2 changed to 1:2 in Morašice A:Morašice B (5)";"Successful"
"2012-07-14 11:01:13";"Zdenda";"127.0.0.1";"Create Match";"Morašice B:Morašice A (39)";"Successful"
"2012-07-14 11:01:42";"Zdenda";"127.0.0.1";"Update Match";"Match Morašice B:Morašice A (39)";"Successful"
"2012-07-14 11:01:54";"Zdenda";"127.0.0.1";"Update Match";"Match Morašice B:Morašice A (39)";"Successful"
"2012-07-14 11:06:35";"Zdenda";"127.0.0.1";"Update Match";"Match Morašice B:Morašice A (39)";"Successful"
"2012-07-14 11:07:24";"Zdenda";"127.0.0.1";"Update Match";"Match Morašice B:Morašice A (39)";"Successful"
"2012-07-14 11:10:13";"Zdenda";"127.0.0.1";"Update Match";"Match Morašice B:Morašice A (39)";"Successful"
"2012-07-14 15:54:16";"Zdenda";"127.0.0.1";"Create Period";"2:2 in Morašice A:Pardubice C (7)";"Successful"
"2012-07-16 09:46:08";"Zdenda";"127.0.0.1";"Create Match";"Makov:Morašice A (40)";"Successful"
"2012-07-16 09:46:13";"Zdenda";"127.0.0.1";"Create Match";"Morašice B:Pardubice C (41)";"Successful"
"2012-07-16 09:46:22";"Zdenda";"127.0.0.1";"Create Match";"Morašice A:Morašice B (42)";"Successful"
"2012-07-16 09:48:12";"Zdenda";"127.0.0.1";"Update Match";"Match Makov:Morašice A (40)";"Successful"
"2012-07-16 09:51:21";"Zdenda";"127.0.0.1";"Create Period";"1:2 in Makov:Morašice A (40)";"Successful"
"2012-07-16 09:51:26";"Zdenda";"127.0.0.1";"Create Period";"3:0 in Makov:Morašice A (40)";"Successful"
"2012-07-16 09:51:32";"Zdenda";"127.0.0.1";"Create Period";"0:0 in Makov:Morašice A (40)";"Successful"
"2012-07-16 09:52:18";"Zdenda";"127.0.0.1";"Delete Period";"1:2 in Makov:Morašice A (40)";"Successful"
"2012-07-16 09:52:48";"Zdenda";"127.0.0.1";"Create Period";"1:1 in Makov:Morašice A (40)";"Successful"
"2012-07-16 10:24:25";"Zdenda";"127.0.0.1";"Delete Period";"0:0 in Makov:Morašice A (40)";"Successful"
"2012-07-16 13:38:18";"Zdenda";"127.0.0.1";"Delete Period";"3:0 in Makov:Morašice A (40)";"Successful"
"2012-07-16 13:38:21";"Zdenda";"127.0.0.1";"Delete Period";"1:1 in Makov:Morašice A (40)";"Successful"
"2012-07-16 13:43:51";"Zdenda";"127.0.0.1";"Update Match";"Match Makov:Morašice A (40)";"Successful"
"2012-07-16 13:45:11";"Zdenda";"127.0.0.1";"Update Match";"Match Makov:Morašice A (40)";"Successful"
"2012-07-16 13:46:00";"Zdenda";"127.0.0.1";"Update Match";"Match Makov:Morašice A (40)";"Successful"
"2012-07-16 13:46:15";"Zdenda";"127.0.0.1";"Update Match";"Match Makov:Morašice A (40)";"Successful"
"2012-07-16 13:53:10";"Zdenda";"127.0.0.1";"Update Match";"Match Makov:Morašice A (40)";"Successful"
"2012-07-16 14:19:22";"Zdenda";"127.0.0.1";"Update Match";"Match Makov:Morašice A (40)";"Successful"
"2012-07-16 14:19:31";"Zdenda";"127.0.0.1";"Update Match";"Match Makov:Morašice A (40)";"Successful"
"2012-07-16 14:28:15";"Zdenda";"127.0.0.1";"Update Match";"Match Makov:Morašice A (40)";"Successful"
"2012-07-16 14:46:00";"Zdenda";"127.0.0.1";"Update Match";"Match Makov:Morašice A (40)";"Successful"
"2012-07-16 14:46:23";"Zdenda";"127.0.0.1";"Update Match";"Match Makov:Morašice A (40)";"Successful"
"2012-07-16 14:46:43";"Zdenda";"127.0.0.1";"Update Match";"Match Makov:Morašice A (40)";"Successful"
"2012-07-16 14:46:56";"Zdenda";"127.0.0.1";"Update Match";"Match Makov:Morašice A (40)";"Successful"
"2012-07-17 13:46:57";"Zdenda";"127.0.0.1";"Match Actions";"New Match Action: ";"Successful"
"2012-07-17 15:49:19";"Zdenda";"127.0.0.1";"Players";"Create players 1/1 in Morašice A:Morašice B (5)";"Successful"
"2012-07-17 15:49:45";"Zdenda";"127.0.0.1";"Players";"Update player Martin Štancl (Goalkeeper, Morašice B) in Morašice A:Morašice B (5)";"Successful"
"2012-07-17 15:50:56";"Zdenda";"127.0.0.1";"Players";"Update player Martin Štancl (Goalkeeper, Morašice B) in Morašice A:Morašice B (5)";"Successful"
"2012-07-17 15:52:35";"Zdenda";"127.0.0.1";"Create Match";"Morašice A:Makov (41)";"Successful"
"2012-07-17 16:19:13";"Zdenda";"127.0.0.1";"Referees";"Update Position of Zdeněk Drahoš in Morašice A:Morašice B (5)";"Successful"
"2012-07-17 16:19:17";"Zdenda";"127.0.0.1";"Referees";"Delete member Jaromír Jágr [Asistent] in Morašice A:Morašice B (5)";"Successful"
"2012-07-17 16:20:18";"Zdenda";"127.0.0.1";"Referees";"Add referee Martin Štancl [Hlavní rozhodčí] to Morašice A:Morašice B (5)";"Successful"
"2012-07-18 10:32:12";"Zdenda";"127.0.0.1";"Create Match";"Makov:Morašice A (42)";"Successful"
"2012-07-18 10:32:25";"Zdenda";"127.0.0.1";"Create Period";"1:1 in Makov:Morašice A (42)";"Successful"
"2012-07-18 10:32:34";"Zdenda";"127.0.0.1";"Delete Period";"1:1 in Makov:Morašice A (42)";"Successful"
"2012-07-18 10:32:50";"Zdenda";"127.0.0.1";"Create Period";"8:0 in Makov:Morašice A (42)";"Successful"
"2012-07-18 10:33:11";"Zdenda";"127.0.0.1";"Delete Period";"8:0 in Makov:Morašice A (42)";"Successful"
"2012-07-18 11:00:05";"Admin";"127.0.0.1";"Create Period";"2:2 in t2:t1 (1)";"Successful"
"2012-07-18 11:02:14";"Admin";"127.0.0.1";"Create Period";"1:1 in t2:t1 (1)";"Successful"
"2012-07-18 11:02:19";"Admin";"127.0.0.1";"Create Period";"0:0 in t2:t1 (1)";"Successful"
"2012-07-18 11:02:40";"Admin";"127.0.0.1";"Delete Period";"2:2 in t2:t1 (1)";"Successful"
"2012-07-18 11:03:48";"Admin";"127.0.0.1";"Update Period";"1:1 changed to 2:2 in t2:t1 (1)";"Successful"
"2012-07-19 15:47:19";"Zdenda";"127.0.0.1";"Create Period";"1:1 in Pardubice C:Makov (27)";"Successful"
"2012-07-20 10:10:22";"Zdenda";"127.0.0.1";"Create Match";"Bratislava:Makov (43)";"Successful"
"2012-07-20 10:14:39";"Zdenda";"127.0.0.1";"Create Match";"Makov:Morašice B (44)";"Successful"
"2012-07-20 10:15:32";"Zdenda";"127.0.0.1";"Create Match";"Makov:Morašice B (45)";"Successful"
"2012-07-20 10:18:00";"Zdenda";"127.0.0.1";"Create Period";"2:2 in Makov:Morašice B (45)";"Successful"
"2012-07-20 10:18:46";"Zdenda";"127.0.0.1";"Update Match";"Match Makov:Morašice B (45)";"Successful"
"2012-07-20 10:19:02";"Zdenda";"127.0.0.1";"Delete Result";"2:2 (45)";"Successful"
"2012-07-20 10:19:10";"Zdenda";"127.0.0.1";"Delete Match";"Makov:Morašice B (45)";"Successful"
"2012-07-24 13:05:53";"Zdenda";"127.0.0.1";"Create Match";"Makov:Morašice A (58)";"Successful"
"2012-07-24 13:06:04";"Zdenda";"127.0.0.1";"Create Period";"2:0 in Makov:Morašice A (58)";"Successful"
"2012-07-25 11:16:20";"Zdenda";"127.0.0.1";"Players";"Create players 1/1 in Morašice B:Makov (8)";"Successful"
"2012-07-25 11:43:23";"Zdenda";"127.0.0.1";"Match Player Actions";"Create action Jaromír Jágr (Goalkeeper, Morašice B) (Penalty, 22) in Morašice B:Makov (8)";"Successful"
"2012-07-27 14:03:06";"Zdenda";"127.0.0.1";"Update Period";"5:5 changed to 6:6 in Morašice B:Morašice A (6)";"Successful"
"2012-07-27 14:03:18";"Zdenda";"127.0.0.1";"Create Period";"0:0 in Morašice B:Morašice A (6)";"Successful"
"2012-07-27 14:03:28";"Zdenda";"127.0.0.1";"Update Period";"0:0 changed to 1:1 in Morašice B:Morašice A (6)";"Successful"
"2012-07-27 14:03:55";"Zdenda";"127.0.0.1";"Delete Period";"1:1 in Morašice B:Morašice A (6)";"Successful"
"2012-07-27 14:04:07";"Zdenda";"127.0.0.1";"Update Period";"6:6 changed to 5:5 in Morašice B:Morašice A (6)";"Successful"
"2012-08-02 10:56:35";"Zdenda";"127.0.0.1";"Create Result";"Create '1' periods in Morašice B:Morašice A (28)";"Successful"
"2012-08-02 10:56:54";"Zdenda";"127.0.0.1";"Delete Period";"5:5 in Morašice B:Morašice A (28)";"Successful"
"2012-08-02 10:57:01";"Zdenda";"127.0.0.1";"Create Result";"Create '2' periods in Morašice B:Morašice A (28)";"Successful"
"2012-08-02 10:57:08";"Zdenda";"127.0.0.1";"Delete Period";"5:0 in Morašice B:Morašice A (28)";"Successful"
"2012-08-02 10:57:11";"Zdenda";"127.0.0.1";"Delete Period";"2:2 in Morašice B:Morašice A (28)";"Successful"
"2012-08-02 10:57:15";"Zdenda";"127.0.0.1";"Create Result";"Create '1' periods in Morašice B:Morašice A (28)";"Successful"
"2012-08-02 10:57:39";"Zdenda";"127.0.0.1";"Delete Period";"2:2 in Morašice B:Morašice A (28)";"Successful"
"2012-08-02 10:57:53";"Zdenda";"127.0.0.1";"Create Result";"Create '1' periods in Morašice B:Morašice A (28)";"Successful"
"2012-08-02 10:59:58";"Zdenda";"127.0.0.1";"Delete Period";"5:5 in Morašice B:Morašice A (28)";"Successful"
"2012-08-02 11:00:06";"Zdenda";"127.0.0.1";"Create Result";"Create '2' periods in Morašice B:Morašice A (28)";"Successful"
"2012-08-02 11:02:06";"Zdenda";"127.0.0.1";"Create Result";"Create '2' periods in Berdych:Kvitová (14)";"Successful"
"2012-08-02 11:02:25";"Zdenda";"127.0.0.1";"Delete Result";"13:10 (14)";"Successful"
"2012-08-02 13:13:49";"Zdenda";"127.0.0.1";"Create Result";"Create '2' periods in Makov:Morašice B (32)";"Successful"
"2012-08-02 13:28:04";"Zdenda";"127.0.0.1";"Delete Result";"7:2 (32)";"Successful"
"2012-08-02 13:29:30";"Zdenda";"127.0.0.1";"Create Result";"Create '4' periods in matches: 31, 32";"Successful"
"2012-08-02 13:30:15";"Zdenda";"127.0.0.1";"Delete Result";"2:0 (32)";"Successful"
"2012-08-02 13:33:09";"Zdenda";"127.0.0.1";"Create Result";"Create '1' periods in matches: 32";"Successful"
"2012-08-02 13:36:03";"Zdenda";"127.0.0.1";"Create Result";"Create '4' periods in matches: 59, 60";"Successful"
"2012-08-02 13:48:15";"Zdenda";"127.0.0.1";"Create Result";"Create '4' periods in matches: 61, 62";"Successful"
"2012-08-02 13:50:56";"Zdenda";"127.0.0.1";"Create Result";"Create '2' periods in matches: 63, 64";"Successful"
"2012-08-02 13:51:14";"Zdenda";"127.0.0.1";"Delete Result";"0:0 (64)";"Successful"
"2012-08-02 13:51:32";"Zdenda";"127.0.0.1";"Create Result";"Create '2' periods in matches: 63, 64";"Successful"
"2012-08-02 13:51:45";"Zdenda";"127.0.0.1";"Delete Result";"2:0 (64)";"Successful"
"2012-08-02 14:35:35";"Kamil";"127.0.0.1";"Create Result";"Create '2' periods in matches: 64";"Successful"
"2012-08-02 14:35:41";"Kamil";"127.0.0.1";"Create Result";"Create '4' periods in matches: 65, 66";"Successful"
"2012-08-13 10:53:20";"Zdenda";"127.0.0.1";"Players";"Create players 4/4 in Morašice B:Morašice A (6)";"Successful"
"2012-08-13 10:53:37";"Zdenda";"127.0.0.1";"Match Actions";"New Match Action: Gól";"Successful"
"2012-08-13 10:53:42";"Zdenda";"127.0.0.1";"Match Actions";"New Match Action: Asistence";"Successful"
"2012-08-13 10:53:51";"Zdenda";"127.0.0.1";"Match Player Actions";"Create action Zdeněk Drahoš (Goalkeeper, Morašice B) (Gól, 5) in Morašice B:Morašice A (6)";"Successful"
"2012-08-13 10:54:00";"Zdenda";"127.0.0.1";"Match Player Actions";"Create action Zdeněk Drahoš (Goalkeeper, Morašice B) (Gól, 55) in Morašice B:Morašice A (6)";"Successful"
"2012-08-13 10:54:09";"Zdenda";"127.0.0.1";"Match Player Actions";"Create action Zdeněk Drahoš (Goalkeeper, Morašice B) (Gól, 90) in Morašice B:Morašice A (6)";"Successful"
"2012-08-13 10:54:16";"Zdenda";"127.0.0.1";"Match Player Actions";"Create action Jaromír Jágr (Goalkeeper, Morašice B) (Asistence, 5) in Morašice B:Morašice A (6)";"Successful"
"2012-08-13 10:54:23";"Zdenda";"127.0.0.1";"Match Player Actions";"Create action Jaromír Jágr (Goalkeeper, Morašice B) (Asistence, 90) in Morašice B:Morašice A (6)";"Successful"
"2012-08-13 10:54:29";"Zdenda";"127.0.0.1";"Match Player Actions";"Create action Martin Štancl (Boss, Morašice B) (Asistence, 55) in Morašice B:Morašice A (6)";"Successful"
"2012-08-13 11:05:24";"Zdenda";"127.0.0.1";"Match Player Actions";"Create action Martin Štancl (Boss, Morašice B) (Rohy, na konci) in Morašice B:Morašice A (6)";"Successful"
"2012-08-13 14:26:14";"Zdenda";"127.0.0.1";"Match Player Actions";"Create action Zdeněk Drahoš (Goalkeeper, Morašice B) (Penalty, 63) in Morašice B:Morašice A (6)";"Successful"
"2012-08-13 14:51:44";"Zdenda";"127.0.0.1";"Players";"Create players 1/1 in Makov:Morašice A (54)";"Successful"
"2012-08-13 14:51:56";"Zdenda";"127.0.0.1";"Match Player Actions";"Create action Zdeněk Drahoš (Goalkeeper, Makov) (Penalty, 55) in Makov:Morašice A (54)";"Successful"
"2012-08-13 14:52:01";"Zdenda";"127.0.0.1";"Match Player Actions";"Create action Zdeněk Drahoš (Goalkeeper, Makov) (Asistence, 1) in Makov:Morašice A (54)";"Successful"
"2012-08-13 14:52:07";"Zdenda";"127.0.0.1";"Match Player Actions";"Create action Zdeněk Drahoš (Goalkeeper, Makov) (Gól, 1) in Makov:Morašice A (54)";"Successful"
"2012-08-13 14:53:42";"Zdenda";"127.0.0.1";"Players";"Create players 1/1 in Morašice B:Makov (59)";"Successful"
"2012-08-13 14:53:55";"Zdenda";"127.0.0.1";"Match Player Actions";"Create action Zdeněk Drahoš (Goalkeeper, Makov) (Gól, 85) in Morašice B:Makov (59)";"Successful"
"2012-08-17 13:35:18";"Zdenda";"127.0.0.1";"Update Match";"Match Makov:Morašice B (44)";"Successful"
"2012-08-17 13:36:19";"Zdenda";"127.0.0.1";"Update Match";"Match Makov:Morašice B (44)";"Successful"
"2012-08-17 13:37:56";"Zdenda";"127.0.0.1";"Update Match";"Match Makov:Morašice B (44)";"Successful"
"2012-08-19 19:19:30";"Zdenda";"127.0.0.1";"Update Period";"2:0 changed to 3:0 in Makov:Žilina (14)";"Successful"
"2012-08-19 19:21:53";"Zdenda";"127.0.0.1";"Delete Result";"4:0 (87)";"Successful"
"2012-08-19 19:21:56";"Zdenda";"127.0.0.1";"Delete Match";"Makov:Žilina (87)";"Successful"
"2012-08-19 19:28:26";"Zdenda";"127.0.0.1";"Create Match";"Morašice B:Makov (88)";"Successful"
"2012-08-19 19:28:31";"Zdenda";"127.0.0.1";"Create Match";"Pardubice C:Morašice A (89)";"Successful"
"2012-08-19 19:28:41";"Zdenda";"127.0.0.1";"Create Result";"Create '1' periods in Morašice B:Makov (88)";"Successful"
"2012-08-19 19:28:50";"Zdenda";"127.0.0.1";"Create Result";"Create '1' periods in Pardubice C:Morašice A (89)";"Successful"
"2012-08-19 19:32:31";"Zdenda";"127.0.0.1";"Delete Result";"2:3 (88)";"Successful"
"2012-08-19 19:32:43";"Zdenda";"127.0.0.1";"Create Result";"Create '2' periods in Morašice B:Makov (88)";"Successful"
"2012-08-22 12:28:32";"Zdenda";"127.0.0.1";"Delete Result";"10:10 (66)";"Successful"
"2012-08-23 11:40:19";"Zdenda";"127.0.0.1";"Players";"Create players 1/1 in Morašice A:Morašice B (5)";"Successful"
"2012-08-24 10:14:40";"Zdenda";"127.0.0.1";"Create Result";"Create '1' periods in Morašice A:Makov (41)";"Successful"
"2012-08-24 12:54:30";"Zdenda";"127.0.0.1";"Update Detail";"Morašice A:Morašice B (5)";"Successful"
"2012-08-24 12:54:51";"Zdenda";"127.0.0.1";"Update Detail";"Morašice B:Morašice A (6)";"Successful"
"2012-08-24 13:20:28";"Zdenda";"127.0.0.1";"Update Period";"1:2 changed to 2:3 in Morašice A:Morašice B (5)";"Successful"
"2012-08-24 13:20:37";"Zdenda";"127.0.0.1";"Update Period";"2:3 changed to 2:3 in Morašice A:Morašice B (5)";"Successful"
"2012-08-24 13:20:41";"Zdenda";"127.0.0.1";"Update Period";"2:3 changed to 2:3 in Morašice A:Morašice B (5)";"Successful"
"2012-08-24 13:20:53";"Zdenda";"127.0.0.1";"Create Period";"0:0 in Morašice A:Morašice B (5)";"Successful"
"2012-08-24 13:21:11";"Zdenda";"127.0.0.1";"Delete Period";"0:0 in Morašice A:Morašice B (5)";"Successful"
"2012-08-24 13:21:20";"Zdenda";"127.0.0.1";"Delete Result";"2:3 (5)";"Successful"
"2012-08-24 13:21:31";"Zdenda";"127.0.0.1";"Create Result";"Create '1' periods in Morašice A:Morašice B (5)";"Successful"
"2012-08-24 13:25:36";"Zdenda";"127.0.0.1";"Create Result";"Create '1' periods in matches: 66";"Successful"
"2012-08-24 13:25:52";"Zdenda";"127.0.0.1";"Delete Result";"0:0 (66)";"Successful"
"2012-08-24 13:26:08";"Zdenda";"127.0.0.1";"Create Result";"Create '4' periods in matches: 69, 70";"Successful"
"2012-08-24 13:27:02";"Zdenda";"127.0.0.1";"Create Result";"Create '4' periods in matches: 67, 68";"Successful"
"2012-08-24 20:54:40";"Zdenda";"127.0.0.1";"Players";"Create players 0/1 in Morašice A:Morašice B (5)";"Successful"
"2012-08-24 21:10:11";"Zdenda";"127.0.0.1";"Referees";"Update Position of Zdeněk Drahoš in Morašice A:Morašice B (5)";"Successful"
"2012-08-24 21:10:26";"Zdenda";"127.0.0.1";"Referees";"Update Position of Martin Štancl in Morašice A:Morašice B (5)";"Successful"
"2012-08-25 10:30:46";"Zdenda";"127.0.0.1";"Players";"Create players 1/1 in Morašice A:Morašice B (5)";"Successful"
"2012-08-25 10:33:01";"Zdenda";"127.0.0.1";"Players";"Delete player Petr Čech (Goalkeeper, Morašice A) in Morašice A:Morašice B (5)";"Successful"
"2012-08-25 10:33:07";"Zdenda";"127.0.0.1";"Players";"Create players 1/1 in Morašice A:Morašice B (5)";"Successful"
"2012-08-25 10:33:41";"Zdenda";"127.0.0.1";"Players";"Create players 1/1 in Morašice A:Morašice B (5)";"Successful"
"2012-08-25 10:33:52";"Zdenda";"127.0.0.1";"Players";"Update player Petr Čech (Goalkeeper, Morašice A) in Morašice A:Morašice B (5)";"Successful"
"2012-08-25 10:33:57";"Zdenda";"127.0.0.1";"Players";"Update player Petr Čech (Goalkeeper, Morašice A) in Morašice A:Morašice B (5)";"Successful"
"2012-08-25 12:18:37";"Zdenda";"127.0.0.1";"Players";"Update player Zdeněk Drahoš (Goalkeeper, Morašice B) in Morašice A:Morašice B (5)";"Successful"
"2012-08-25 12:19:47";"Zdenda";"127.0.0.1";"Players";"Update player Zdeněk Drahoš (Goalkeeper, Morašice B) in Morašice A:Morašice B (5)";"Successful"
"2012-08-25 12:22:01";"Zdenda";"127.0.0.1";"Match Player Actions";"Create action Zdeněk Drahoš (Goalkeeper, Morašice B) (Gól, 89) in Morašice A:Morašice B (5)";"Successful"
"2012-08-25 12:22:12";"Zdenda";"127.0.0.1";"Match Player Actions";"Update action Zdeněk Drahoš (Gól, 89) in Morašice A:Morašice B (5)";"Successful"
"2012-08-25 13:18:07";"Zdenda";"127.0.0.1";"Create Result";"Create '2' periods in Pardubice C:Morašice A (66)";"Successful"
"2012-08-25 13:18:36";"Zdenda";"127.0.0.1";"Create Match";"České Budejovice:Jihlava (90)";"Successful"
"2012-08-25 13:19:04";"Zdenda";"127.0.0.1";"Create Result";"Create '1' periods in České Budejovice:Jihlava (90)";"Successful"
"2012-08-25 13:25:28";"Zdenda";"127.0.0.1";"Create Period";"0:3 in České Budejovice:Jihlava (90)";"Successful"
"2012-08-25 13:26:00";"Zdenda";"127.0.0.1";"Create Period";"1:0 in České Budejovice:Jihlava (90)";"Successful"
"2012-08-25 13:26:36";"Zdenda";"127.0.0.1";"Delete Period";"1:0 in České Budejovice:Jihlava (90)";"Successful"
"2012-08-25 13:28:45";"Zdenda";"127.0.0.1";"Delete Period";"0:3 in České Budejovice:Jihlava (90)";"Successful"
"2012-08-25 13:35:28";"Zdenda";"127.0.0.1";"Create Period";"0:3 in České Budejovice:Jihlava (90)";"Successful"
"2012-08-25 13:36:38";"Zdenda";"127.0.0.1";"Update Period";"1:1 changed to 1:2 in Pardubice C:Morašice A (66)";"Successful"
"2012-08-25 13:36:50";"Zdenda";"127.0.0.1";"Update Period";"1:2 changed to 1:0 in Pardubice C:Morašice A (66)";"Successful"
"2012-08-25 13:36:59";"Zdenda";"127.0.0.1";"Create Period";"1:1 in Pardubice C:Morašice A (66)";"Successful"
"2012-08-25 13:37:02";"Zdenda";"127.0.0.1";"Delete Period";"1:0 in Pardubice C:Morašice A (66)";"Successful"
"2012-08-26 19:03:15";"Admin";"127.0.0.1";"Update Match";"Match Makov:Jihlava (73)";"Successful"
"2012-08-31 14:11:59";"Zdenda";"127.0.0.1";"Create Match";"Makov:Morašice A (94)";"Successful"
"2012-08-31 14:12:29";"Zdenda";"127.0.0.1";"Create Match";"Morašice A:Česká Třebová (95)";"Successful"
"2012-08-31 14:50:23";"Zdenda";"127.0.0.1";"Update Match";"Match Morašice A:Česká Třebová (95)";"Successful"
"2012-08-31 14:51:26";"Zdenda";"127.0.0.1";"Update Match";"Match Morašice A:Česká Třebová (95)";"Successful"
"2012-09-01 10:26:16";"Zdenda";"127.0.0.1";"Create Match";"Česká Třebová:Morašice A (96)";"Successful"
"2012-09-01 10:26:28";"Zdenda";"127.0.0.1";"Create Period";"2:0 in Česká Třebová:Morašice A (96)";"Successful"
"2012-09-01 10:31:23";"Zdenda";"127.0.0.1";"Create Period";"0:2 in Česká Třebová:Morašice A (96)";"Successful"
"2012-09-01 10:31:51";"Zdenda";"127.0.0.1";"Create Period";"1:0 in Česká Třebová:Morašice A (96)";"Successful"
"2012-09-28 11:44:55";"Zdenda";"127.0.0.1";"Create Match";"Morašice B:Morašice A (97)";"Successful"
"2013-01-20 09:53:21";"Zdenda";"127.0.0.1";"Create Period";"2:2 in Morašice B:Morašice A (6)";"Successful"
"2013-01-20 09:53:26";"Zdenda";"127.0.0.1";"Create Period";"1:1 in Morašice B:Morašice A (6)";"Successful"
"2013-01-20 10:32:21";"Zdenda";"127.0.0.1";"Update Result";"Update '3' periods in Morašice B:Morašice A (6)";"Successful"
"2013-01-20 10:33:06";"Zdenda";"127.0.0.1";"Update Result";"Update '3' periods in Morašice B:Morašice A (6)";"Successful"
"2013-01-20 10:41:15";"Zdenda";"127.0.0.1";"Update Result";"Update '3' periods in Morašice B:Morašice A (6)";"Successful"
"2013-01-20 10:41:36";"Zdenda";"127.0.0.1";"Update Result";"Update '1' periods in Morašice B:Morašice A (6)";"Successful"
"2013-01-20 10:44:16";"Zdenda";"127.0.0.1";"Update Result";"Update '1' periods in Morašice B:Morašice A (6)";"Successful"
"2013-01-20 10:44:22";"Zdenda";"127.0.0.1";"Update Result";"Update '1' periods in Morašice B:Morašice A (6)";"Successful"
"2013-01-20 10:44:27";"Zdenda";"127.0.0.1";"Update Result";"Update '1' periods in Morašice B:Morašice A (6)";"Successful"
"2013-01-20 11:15:35";"Zdenda";"127.0.0.1";"Update Result";"Update '3' periods in Morašice B:Morašice A (6)";"Successful"
"2013-01-20 11:16:57";"Zdenda";"127.0.0.1";"Update Result";"Update '1' periods in Morašice B:Morašice A (6)";"Successful"
"2013-01-20 11:17:05";"Zdenda";"127.0.0.1";"Update Result";"Update '2' periods in Morašice B:Morašice A (6)";"Successful"
"2013-01-20 11:17:10";"Zdenda";"127.0.0.1";"Update Result";"Update '2' periods in Morašice B:Morašice A (6)";"Successful"
"2013-01-20 11:17:28";"Zdenda";"127.0.0.1";"Update Result";"Update '1' periods in Morašice B:Morašice A (6)";"Successful"
"2013-01-20 11:17:44";"Zdenda";"127.0.0.1";"Update Result";"Update '1' periods in Morašice B:Morašice A (6)";"Successful"
"2013-01-20 11:17:47";"Zdenda";"127.0.0.1";"Delete Period";"1:1 in Morašice B:Morašice A (6)";"Successful"
"2013-01-20 13:58:28";"Zdenda";"127.0.0.1";"Create Period";"3:0 in Morašice B:Morašice A (6)";"Successful"
"2013-01-20 13:58:47";"Zdenda";"127.0.0.1";"Create Period";"0:0 in Morašice B:Morašice A (6)";"Successful"
"2013-01-20 13:59:04";"Zdenda";"127.0.0.1";"Create Period";"1:0 in Morašice B:Morašice A (6)";"Successful"
"2013-01-20 14:00:39";"Zdenda";"127.0.0.1";"Create Period";"3:0 in Morašice B:Morašice A (6)";"Successful"
"2013-01-20 14:15:34";"Zdenda";"127.0.0.1";"Create Period";"3:0 in Morašice B:Morašice A (6)";"Successful"
"2013-01-20 14:42:15";"Zdenda";"127.0.0.1";"Create Period";"3:0 in Morašice B:Morašice A (6)";"Successful"
"2013-01-20 14:42:29";"Zdenda";"127.0.0.1";"Create Period";"1:0 in Morašice B:Morašice A (6)";"Successful"
"2013-01-20 14:42:39";"Zdenda";"127.0.0.1";"Update Result";"Update '1' periods in Morašice B:Morašice A (6)";"Successful"
"2013-01-20 17:15:07";"Zdenda";"127.0.0.1";"Create Period";"8:12 in Repre:Los-Zewlos (1)";"Successful"
"2013-01-20 20:47:04";"Zdenda";"127.0.0.1";"Create Result";"Create '1' periods in Morašice B:Pardubice C (98)";"Successful"
"2013-01-20 20:47:12";"Zdenda";"127.0.0.1";"Players";"Create players 2/2 in Morašice B:Pardubice C (98)";"Successful"
"2013-01-20 20:50:47";"Zdenda";"127.0.0.1";"Players";"Create players 2/2 in Morašice B:Pardubice C (98)";"Successful"
"2013-01-20 21:11:23";"Zdenda";"127.0.0.1";"Players";"Create players 3/3 in Morašice A:Morašice B (100)";"Successful"
"2013-01-20 21:20:11";"Zdenda";"127.0.0.1";"Players";"Delete player Morašice B - Zdeněk Drahoš (Boss) in Morašice B:Pardubice C (98)";"Successful"
"2013-01-20 21:23:53";"Zdenda";"127.0.0.1";"Players";"Delete player Morašice B - Zdeněk Drahoš (Goalkeeper) in Morašice B:Pardubice C (98)";"Successful"
"2013-01-21 09:16:54";"Zdenda";"127.0.0.1";"Players";"Delete player Morašice B - Martin Štancl (Boss) in Morašice B:Pardubice C (98)";"Successful"
"2013-01-21 09:38:02";"Zdenda";"127.0.0.1";"Players";"Update player Morašice B - Zdeněk Drahoš (Hlavní rozhodčí) in Morašice B:Pardubice C (98)";"Successful"
"2013-01-21 09:38:11";"Zdenda";"127.0.0.1";"Players";"Update player Morašice B - Zdeněk Drahoš (Boss) in Morašice B:Pardubice C (98)";"Successful"
"2013-01-21 09:43:04";"Zdenda";"127.0.0.1";"Players";"Delete player Morašice B - Martin Štancl (Hlavní rozhodčí) in Morašice B:Pardubice C (98)";"Successful"
"2013-01-21 09:55:56";"Zdenda";"127.0.0.1";"Players";"Create players 1/1 in Morašice B:Pardubice C (98)";"Successful"
"2013-01-21 09:56:07";"Zdenda";"127.0.0.1";"Players";"Update player Morašice B - Martin Štancl (Hlavní rozhodčí) in Morašice B:Pardubice C (98)";"Successful"
"2013-01-21 09:56:38";"Zdenda";"127.0.0.1";"Players";"Delete player Morašice B - Jaromír Jágr (Hlavní rozhodčí) in Morašice B:Pardubice C (98)";"Successful"
"2013-01-21 09:56:41";"Zdenda";"127.0.0.1";"Players";"Delete player Morašice B - Zdeněk Drahoš (Goalkeeper) in Morašice B:Pardubice C (98)";"Successful"
"2013-01-21 09:56:44";"Zdenda";"127.0.0.1";"Players";"Delete player Morašice B - Martin Štancl (Hlavní rozhodčí) in Morašice B:Pardubice C (98)";"Successful"
"2013-01-21 09:56:58";"Zdenda";"127.0.0.1";"Players";"Create players 3/3 in Morašice B:Pardubice C (98)";"Successful"
"2013-01-21 11:08:12";"Zdenda";"127.0.0.1";"Match Player Actions";"Create action Morašice B - Martin Štancl (Boss) (Gól, 1) in Morašice B:Pardubice C (98)";"Successful"
"2013-01-21 11:37:42";"Zdenda";"127.0.0.1";"Match Player Actions";"Create 2 match actions in Morašice B:Pardubice C (98)";"Successful"
"2013-01-21 11:38:41";"Zdenda";"127.0.0.1";"Match Player Actions";"Create 3 match actions in Morašice B:Pardubice C (98)";"Successful"
"2013-01-21 13:15:38";"Zdenda";"127.0.0.1";"Match Player Actions";"Delete action Martin Štancl (Gól, 1) in Morašice B:Pardubice C (98)";"Successful"
"2013-01-21 13:15:41";"Zdenda";"127.0.0.1";"Match Player Actions";"Delete action Zdeněk Drahoš (Gól, 70) in Morašice B:Pardubice C (98)";"Successful"
"2013-01-21 13:15:43";"Zdenda";"127.0.0.1";"Match Player Actions";"Delete action Jaromír Jágr (Penalty, 68) in Morašice B:Pardubice C (98)";"Successful"
"2013-01-21 13:15:45";"Zdenda";"127.0.0.1";"Match Player Actions";"Delete action Jaromír Jágr (Asistence, 20) in Morašice B:Pardubice C (98)";"Successful"
"2013-01-21 13:15:48";"Zdenda";"127.0.0.1";"Match Player Actions";"Delete action Zdeněk Drahoš (Gól, 55) in Morašice B:Pardubice C (98)";"Successful"
"2013-01-21 13:15:50";"Zdenda";"127.0.0.1";"Match Player Actions";"Delete action Martin Štancl (Gól, 50) in Morašice B:Pardubice C (98)";"Successful"
"2013-01-21 13:16:51";"Zdenda";"127.0.0.1";"Match Player Actions";"Create 8 match actions in Morašice B:Pardubice C (98)";"Successful"
"2013-01-21 13:27:53";"Zdenda";"127.0.0.1";"Match Player Actions";"Create 1 match actions in Morašice B:Pardubice C (98)";"Successful"
"2013-01-21 13:48:22";"Zdenda";"127.0.0.1";"Match Player Actions";"Create 1 match actions in Morašice B:Pardubice C (98)";"Successful"
"2013-01-21 13:48:42";"Zdenda";"127.0.0.1";"Match Player Actions";"Create 1 match actions in Morašice B:Pardubice C (98)";"Successful"
"2013-01-21 13:53:06";"Zdenda";"127.0.0.1";"Match Team Actions";"Create 4 match actions in Morašice B:Pardubice C (98)";"Successful"
"2013-01-21 13:54:36";"Zdenda";"127.0.0.1";"Match Team Actions";"Create 0 match actions in Morašice B:Pardubice C (98)";"Successful"
"2013-01-21 13:54:51";"Zdenda";"127.0.0.1";"Match Team Actions";"Create 1 match actions in Morašice B:Pardubice C (98)";"Successful"
"2013-01-21 14:01:30";"Zdenda";"127.0.0.1";"Create Period";"5:0 in Morašice B:Pardubice C (98)";"Successful"
"2013-01-21 14:38:00";"Zdenda";"127.0.0.1";"Create Match";"Morašice A:Morašice B (104)";"Successful"
"2013-01-21 15:28:22";"Zdenda";"127.0.0.1";"Create Match";"Morašice B:Morašice A (105)";"Successful"
"2013-01-21 15:28:32";"Zdenda";"127.0.0.1";"Create Result";"Create '2' periods in Morašice B:Morašice A (105)";"Successful"
"2013-01-21 15:29:13";"Zdenda";"127.0.0.1";"Create Match";"Morašice A:Pardubice C (106)";"Successful"
"2013-01-21 15:29:23";"Zdenda";"127.0.0.1";"Create Match";"Morašice B:Pardubice C (107)";"Successful"
"2013-01-21 15:29:32";"Zdenda";"127.0.0.1";"Create Result";"Create '1' periods in Morašice A:Pardubice C (106)";"Successful"
"2013-01-21 15:29:41";"Zdenda";"127.0.0.1";"Create Result";"Create '1' periods in Morašice B:Pardubice C (107)";"Successful"
"2013-01-21 19:07:25";"Zdenda";"127.0.0.1";"Update Match";"Match Morašice A:Morašice B (104)";"Successful"
"2013-01-21 19:32:31";"Zdenda";"127.0.0.1";"Update Match";"Match Morašice A:Morašice B (104)";"Successful"
"2013-01-22 16:08:41";"Zdenda";"127.0.0.1";"Create Match";"111:444 (404)";"Successful"
"2013-01-22 16:08:50";"Zdenda";"127.0.0.1";"Update Match";"Match 111:444 (404)";"Successful"
"2013-01-22 16:09:07";"Zdenda";"127.0.0.1";"Create Match";"České Budejovice:Ostrava (405)";"Successful"
"2013-01-22 16:09:34";"Zdenda";"127.0.0.1";"Create Match";"Žilina:Mladá Boleslav (406)";"Successful"
"2013-01-22 16:09:43";"Zdenda";"127.0.0.1";"Update Match";"Match Žilina:Mladá Boleslav (406)";"Successful"
"2013-01-22 16:10:17";"Zdenda";"127.0.0.1";"Create Match";"333:Jihlava (407)";"Successful"
"2013-01-23 09:46:53";"Zdenda";"127.0.0.1";"Create Result";"Create '12' periods in matches: 510, 544, 547, 552, 612, 631";"Successful"
"2013-01-23 09:56:28";"Zdenda";"127.0.0.1";"Create Result";"Create '12' periods in matches: 476, 487, 489, 577, 597, 605";"Successful"
"2013-01-23 17:28:31";"Zdenda";"127.0.0.1";"Create Result";"Create '2' periods in 111:Praha (541)";"Successful"
"2013-01-23 17:29:30";"Zdenda";"127.0.0.1";"Delete Result";"0:2 (541)";"Successful"
"2013-01-23 17:35:21";"Zdenda";"127.0.0.1";"Create Result";"Create '1' periods in 111:Praha (541)";"Successful"
"2013-01-24 13:06:37";"Zdenda";"127.0.0.1";"Match Actions";"New Match Action: gol";"Successful"
"2013-01-24 13:06:43";"Zdenda";"127.0.0.1";"Match Actions";"New Match Action: karta";"Successful"
"2013-01-24 13:06:55";"Zdenda";"127.0.0.1";"Match Actions";"Update Match Action karta to Žlutá karta";"Successful"
"2013-01-24 13:07:04";"Zdenda";"127.0.0.1";"Match Actions";"Delete Match Action: Žlutá karta";"Successful"
"2013-01-24 13:46:03";"Zdenda";"127.0.0.1";"Update Match";"Match A1:B1 (1)";"Successful"
"2013-01-24 13:46:10";"Zdenda";"127.0.0.1";"Delete Result";"3:0 (1)";"Successful"
"2013-01-24 13:46:26";"Zdenda";"127.0.0.1";"Create Result";"Create '1' periods in A1:B1 (1)";"Successful"
"2013-01-24 13:46:45";"Zdenda";"127.0.0.1";"Update Match";"Match A1:B1 (1)";"Successful"
"2013-01-24 13:49:37";"Zdenda";"127.0.0.1";"Create Match";"A1:B1 (4)";"Successful"
"2013-01-24 13:54:39";"Zdenda";"127.0.0.1";"Players";"Delete player B1 - Zdenda Drahoš (Hráč) in A1:B1 (4)";"Successful"
"2013-01-24 13:58:36";"Zdenda";"127.0.0.1";"Create Result";"Create '9' periods in matches: 5, 6, 7, 8, 9, 10, 11, 12, 13";"Successful"
"2013-01-24 14:05:50";"Zdenda";"127.0.0.1";"Create Match";"A1:J1 (463)";"Successful"
"2013-01-24 14:05:58";"Zdenda";"127.0.0.1";"Create Result";"Create '1' periods in A1:J1 (463)";"Successful"
"2013-01-24 14:06:33";"Zdenda";"127.0.0.1";"Create Match";"D1:G1 (464)";"Successful"
"2013-01-24 14:06:38";"Zdenda";"127.0.0.1";"Create Result";"Create '1' periods in D1:G1 (464)";"Successful"
"2013-01-24 14:07:50";"Zdenda";"127.0.0.1";"Create Period";"2:0 in H1:D1 (5)";"Successful"
"2013-01-24 14:08:14";"Zdenda";"127.0.0.1";"Update Detail";"H1:D1 (5)";"Successful"
"2013-01-24 14:08:17";"Zdenda";"127.0.0.1";"Delete Detail";"H1:D1 (5)";"Successful"
"2013-01-24 14:08:28";"Zdenda";"127.0.0.1";"Referees";"Add referee Abraham Fanda [Hráč] to H1:D1 (5)";"Successful"
"2013-01-24 14:08:35";"Zdenda";"127.0.0.1";"Referees";"Add referee Krýda Pavel [Hráč] to H1:D1 (5)";"Successful"
"2013-01-24 14:08:46";"Zdenda";"127.0.0.1";"Referees";"Delete member Pavel Krýda [Hráč] in H1:D1 (5)";"Successful"
"2013-01-24 14:09:10";"Zdenda";"127.0.0.1";"Players";"Create players 1/1 in H1:D1 (5)";"Successful"
"2013-01-24 14:09:22";"Zdenda";"127.0.0.1";"Match Team Actions";"Create 1 match actions in H1:D1 (5)";"Successful"
"2013-01-24 14:09:33";"Zdenda";"127.0.0.1";"Match Player Actions";"Create 1 match actions in H1:D1 (5)";"Successful"
"2013-01-24 14:09:45";"Zdenda";"127.0.0.1";"Create Period";"1:0 in H1:D1 (5)";"Successful"
"2013-01-24 14:10:09";"Zdenda";"127.0.0.1";"Update Match";"Match H1:D1 (5)";"Successful"
"2013-01-24 14:10:27";"Zdenda";"127.0.0.1";"Delete Match";"tým:tým (6)";"Successful"
"2013-01-24 14:10:56";"Zdenda";"127.0.0.1";"Players";"Update player H1 - Fanda Abraham (Hráč) in H1:D1 (5)";"Successful"
"2013-01-24 14:11:07";"Zdenda";"127.0.0.1";"Match Team Actions";"Update action gol = 1:1 in H1:D1 (5)";"Successful"
"2013-07-02 13:40:33";"Zdenda";"127.0.0.1";"Match Actions";"New Match Action: akce";"Successful"
"2013-07-02 13:40:40";"Zdenda";"127.0.0.1";"Match Actions";"Update Match Action akce to akce";"Successful"
"2013-07-02 13:40:52";"Zdenda";"127.0.0.1";"Match Actions";"Delete Match Action: akce";"Successful"
"2013-07-02 15:33:58";"Zdenda";"127.0.0.1";"Create Period";"2:2 in Morašice A:Pardubice C (60)";"Successful"
"2013-07-02 15:34:07";"Zdenda";"127.0.0.1";"Update Result";"Update '1' periods in Morašice A:Pardubice C (60)";"Successful"
"2013-07-02 15:34:10";"Zdenda";"127.0.0.1";"Delete Period";"5:5 in Morašice A:Pardubice C (60)";"Successful"
"2013-07-02 15:34:36";"Zdenda";"127.0.0.1";"Update Detail";"Morašice A:Pardubice C (60)";"Successful"
"2013-07-02 15:34:45";"Zdenda";"127.0.0.1";"Referees";"Add referee Čech Petr [Hlavní rozhodčí] to Morašice A:Pardubice C (60)";"Successful"
"2013-07-02 15:34:54";"Zdenda";"127.0.0.1";"Players";"Create players 1/1 in Morašice A:Pardubice C (60)";"Successful"
"2013-07-02 15:35:03";"Zdenda";"127.0.0.1";"Players";"Create players 1/1 in Morašice A:Pardubice C (60)";"Successful"
"2013-07-02 15:35:33";"Zdenda";"127.0.0.1";"Match Team Actions";"Create 1 match actions in Morašice A:Pardubice C (60)";"Successful"
"2013-07-02 15:36:03";"Zdenda";"127.0.0.1";"Match Player Actions";"Create 1 match actions in Morašice A:Pardubice C (60)";"Successful"
"2013-07-02 15:36:20";"Zdenda";"127.0.0.1";"Create Period";"1:0 in Morašice A:Pardubice C (60)";"Successful"
"2013-07-02 15:36:27";"Zdenda";"127.0.0.1";"Update Result";"Update '1' periods in Morašice A:Pardubice C (60)";"Successful"
"2013-07-02 15:36:44";"Zdenda";"127.0.0.1";"Update Match";"Match Morašice A:Pardubice C (60)";"Successful"
"2013-07-02 15:36:50";"Zdenda";"127.0.0.1";"Update Match";"Match Morašice A:Pardubice C (60)";"Successful"
"2013-07-02 15:37:44";"Zdenda";"127.0.0.1";"Delete Match";"Morašice A:Morašice B (632)";"Successful"
"2013-07-02 16:29:19";"Zdenda";"127.0.0.1";"Create Match";"importTým:Olomouc (633)";"Successful"
"2013-07-02 16:29:26";"Zdenda";"127.0.0.1";"Create Result";"Create '1' periods in importTým:Olomouc (633)";"Successful"
"2013-07-02 16:30:13";"Zdenda";"127.0.0.1";"Create Match";"importTým:Brno (634)";"Successful"
"2013-07-02 16:32:13";"Zdenda";"127.0.0.1";"Create Result";"Create '2' periods in matches: 635, 636";"Successful"
"2013-07-03 16:12:47";"Zdenda";"127.0.0.1";"Update Detail";"Plzeň:Hradec Králové (10)";"Successful"
"2013-07-03 16:12:51";"Zdenda";"127.0.0.1";"Delete Detail";"Plzeň:Hradec Králové (10)";"Successful"
"2013-07-03 16:21:33";"Zdenda";"127.0.0.1";"Referees";"Add referee Abraham František [Goalkeeper] to Plzeň:Hradec Králové (10)";"Successful"
"2013-07-03 16:21:37";"Zdenda";"127.0.0.1";"Referees";"Delete member František Abraham [Goalkeeper] in Plzeň:Hradec Králové (10)";"Successful"
"2013-07-03 16:27:27";"Zdenda";"127.0.0.1";"Update Match";"Match Makov:Morašice B (44)";"Successful"
"2013-07-03 16:40:37";"Zdenda";"127.0.0.1";"Create Period";"0:0 in Morašice B:Morašice A (6)";"Successful"
"2013-07-03 16:40:42";"Zdenda";"127.0.0.1";"Delete Period";"0:0 in Morašice B:Morašice A (6)";"Successful"
"2013-07-03 18:14:05";"Zdenda";"127.0.0.1";"Players";"Update player Makov - Zdeněk Drahoš (Goalkeeper) in Makov:Morašice A (54)";"Successful"
"2013-07-03 18:28:31";"Zdenda";"127.0.0.1";"Match Actions";"New Match Action: namespace";"Successful"
"2013-07-03 18:28:36";"Zdenda";"127.0.0.1";"Match Actions";"Update Match Action namespace to namespacee";"Successful"
"2013-07-03 18:28:39";"Zdenda";"127.0.0.1";"Match Actions";"Delete Match Action: namespacee";"Successful"
"2013-07-03 18:38:39";"Zdenda";"127.0.0.1";"Match Player Actions";"Create 1 match actions in Makov:Morašice A (54)";"Successful"
"2013-07-03 18:38:44";"Zdenda";"127.0.0.1";"Match Player Actions";"Update action Zdeněk Drahoš (Tets, 20) in Makov:Morašice A (54)";"Successful"
"2013-07-03 18:38:47";"Zdenda";"127.0.0.1";"Match Player Actions";"Delete action Zdeněk Drahoš (Tets, 25) in Makov:Morašice A (54)";"Successful"
"2013-07-03 18:44:02";"Zdenda";"127.0.0.1";"Match Team Actions";"Create 1 match actions in Makov:Morašice A (54)";"Successful"
"2013-07-03 18:44:08";"Zdenda";"127.0.0.1";"Match Team Actions";"Update action Asistence = 1:1 in Makov:Morašice A (54)";"Successful"
"2013-07-03 18:44:11";"Zdenda";"127.0.0.1";"Match Team Actions";"Delete action Asistence = 0:0 in Makov:Morašice A (54)";"Successful"
"2013-07-06 16:42:24";"Zdenda";"127.0.0.1";"Create Period";"0:0 in Makov:Morašice A (54)";"Successful"
"2013-07-06 16:43:33";"Zdenda";"127.0.0.1";"Delete Period";"2:0 in Makov:Morašice A (54)";"Successful"
"2013-07-06 16:44:48";"Zdenda";"127.0.0.1";"Create Period";"1:0 in Makov:Morašice A (54)";"Successful"
"2013-07-06 16:45:04";"Zdenda";"127.0.0.1";"Delete Result";"1:0 (54)";"Successful"
"2013-07-06 16:45:09";"Zdenda";"127.0.0.1";"Create Result";"Create '1' periods in Makov:Morašice A (54)";"Successful"
"2013-07-06 16:53:10";"Zdenda";"127.0.0.1";"Referees";"Add referee Abraham František [Hlavní rozhodčí] to Makov:Morašice A (54)";"Successful"
"2013-07-06 16:53:16";"Zdenda";"127.0.0.1";"Referees";"Update Position of František Abraham in Makov:Morašice A (54)";"Successful"
"2013-07-06 16:53:19";"Zdenda";"127.0.0.1";"Referees";"Delete member František Abraham [Asistent] in Makov:Morašice A (54)";"Successful"
"2013-07-06 17:01:38";"Zdenda";"127.0.0.1";"Match Actions";"New Match Action: primaryKey";"Successful"
"2013-07-06 17:01:49";"Zdenda";"127.0.0.1";"Match Team Actions";"Create 1 match actions in Makov:Morašice A (54)";"Successful"
"2013-07-06 17:01:58";"Zdenda";"127.0.0.1";"Match Team Actions";"Update action primaryKey = 5:5 in Makov:Morašice A (54)";"Successful"
"2013-07-06 17:02:10";"Zdenda";"127.0.0.1";"Match Team Actions";"Create 0 match actions in Makov:Morašice A (54)";"Successful"
"2013-07-06 17:02:25";"Zdenda";"127.0.0.1";"Match Team Actions";"Create 1 match actions in Makov:Morašice A (54)";"Successful"
"2013-07-06 17:02:29";"Zdenda";"127.0.0.1";"Match Team Actions";"Delete action Asistence = 0:0 in Makov:Morašice A (54)";"Successful"
"2013-07-06 17:02:39";"Zdenda";"127.0.0.1";"Match Actions";"Delete Match Action From Teams: primaryKey";"Successful"
"2013-07-06 17:02:46";"Zdenda";"127.0.0.1";"Match Actions";"Delete Match Action: primaryKey";"Successful"
"2013-07-06 17:07:38";"Zdenda";"127.0.0.1";"Match Player Actions";"Update action Zdeněk Drahoš (Penalty, 55) in Makov:Morašice A (54)";"Successful"
"2013-07-06 17:07:47";"Zdenda";"127.0.0.1";"Match Player Actions";"Create 1 match actions in Makov:Morašice A (54)";"Successful"
"2013-07-06 17:08:09";"Zdenda";"127.0.0.1";"Match Player Actions";"Create 1 match actions in Makov:Morašice A (54)";"Successful"
"2013-07-06 17:08:28";"Zdenda";"127.0.0.1";"Match Player Actions";"Delete action Zdeněk Drahoš (Žlutá karta, 6) in Makov:Morašice A (54)";"Successful"
"2013-07-06 17:08:31";"Zdenda";"127.0.0.1";"Match Player Actions";"Delete action Zdeněk Drahoš (Žlutá karta, 5) in Makov:Morašice A (54)";"Successful"
"2013-07-06 19:55:25";"Zdenda";"127.0.0.1";"Create Match";"Pardubice:Jihlava (941)";"Successful"
"2013-07-06 19:55:35";"Zdenda";"127.0.0.1";"Create Match";"České Budejovice:Mladá Boleslav (942)";"Successful"
"2013-07-06 19:55:46";"Zdenda";"127.0.0.1";"Create Result";"Create '1' periods in Pardubice:Jihlava (941)";"Successful"
"2013-07-06 19:55:51";"Zdenda";"127.0.0.1";"Create Result";"Create '1' periods in České Budejovice:Mladá Boleslav (942)";"Successful"
"2013-07-06 20:37:41";"Zdenda";"127.0.0.1";"Create Match";"Makov:Morašice B (963)";"Successful"
"2013-07-06 20:37:43";"Zdenda";"127.0.0.1";"Create Match";"Pardubice C:Morašice A (964)";"Successful"
"2013-07-06 20:37:49";"Zdenda";"127.0.0.1";"Create Result";"Create '1' periods in Pardubice C:Morašice A (964)";"Successful"
"2013-07-06 20:37:57";"Zdenda";"127.0.0.1";"Create Result";"Create '1' periods in Makov:Morašice B (963)";"Successful"
"2013-07-08 09:00:00";"Zdenda";"127.0.0.1";"Players";"Delete player Morašice B - Zdeněk Drahoš (Goalkeeper) in Morašice B:Morašice A (39)";"Successful"
"2013-07-08 09:04:50";"Zdenda";"127.0.0.1";"Players";"Delete player Morašice B - Zdeněk Drahoš (Boss) in Morašice B:Morašice A (39)";"Successful"
"2013-07-08 11:11:49";"Zdenda";"127.0.0.1";"Create Period";"1:0 in Morašice A:Pardubice C (7)";"Successful"
"2013-07-08 11:11:57";"Zdenda";"127.0.0.1";"Delete Period";"1:0 in Morašice A:Pardubice C (7)";"Successful"
"2013-07-08 11:18:40";"Zdenda";"127.0.0.1";"Create Period";"2:2 in Morašice A:Pardubice C (7)";"Successful"
"2013-07-08 11:19:13";"Zdenda";"127.0.0.1";"Delete Period";"2:2 in Morašice A:Pardubice C (7)";"Successful"
"2013-07-08 14:58:25";"Zdenda";"127.0.0.1";"Create Period";"1:0 in Morašice A:Pardubice C (7)";"Successful"
"2013-07-09 15:12:17";"Zdenda";"127.0.0.1";"Create Result";"Create '1' periods in Makov:Morašice B (44)";"Successful"
"2013-07-09 15:12:29";"Zdenda";"127.0.0.1";"Update Result";"Update '1' periods in Makov:Morašice B (44)";"Successful"
"2013-07-09 15:57:50";"Zdenda";"127.0.0.1";"Create Period";"0:0 in Morašice A:Makov (41)";"Successful"
"2013-07-09 16:00:41";"Zdenda";"127.0.0.1";"Delete Period";"0:0 in Morašice A:Makov (41)";"Successful"
"2013-07-10 09:36:19";"Zdenda";"127.0.0.1";"Delete Period";"2:2 in Makov:Morašice B (44)";"Successful"
"2013-07-12 13:01:03";"Zdenda";"127.0.0.1";"Match Actions";"New Match Action: nová";"Successful"
"2013-07-12 13:01:08";"Zdenda";"127.0.0.1";"Match Actions";"Update Match Action nová to nováa";"Successful"
"2013-07-12 13:01:32";"Zdenda";"127.0.0.1";"Match Team Actions";"Create 1 match actions in Morašice B:Morašice A (6)";"Successful"
"2013-07-12 13:01:54";"Zdenda";"127.0.0.1";"Match Player Actions";"Create 1 match actions in Morašice B:Morašice A (6)";"Successful"
"2013-07-12 13:02:05";"Zdenda";"127.0.0.1";"Match Actions";"Update Match Action nováa to nová";"Successful"
"2013-07-12 13:02:07";"Zdenda";"127.0.0.1";"Match Actions";"Delete Match Action From Teams: nová";"Successful"
"2013-07-12 13:02:09";"Zdenda";"127.0.0.1";"Match Actions";"Delete Match Action From Players: nová";"Successful"
"2013-07-12 13:02:11";"Zdenda";"127.0.0.1";"Match Actions";"Delete Match Action: nová";"Successful"
"2013-07-12 13:36:13";"Zdenda";"127.0.0.1";"Create Match";"Bratislava:Brno (965)";"Successful"
"2013-07-12 15:18:54";"Zdenda";"127.0.0.1";"Create Match";"Bratislava:namesapce (969)";"Successful"
"2013-07-12 15:19:31";"Zdenda";"127.0.0.1";"Create Match";"Makov:Morašice A (970)";"Successful"
"2013-07-12 15:42:32";"Zdenda";"127.0.0.1";"Create Match";"Makov:Žilina (971)";"Successful"
"2013-07-12 15:42:42";"Zdenda";"127.0.0.1";"Delete Match";"Makov:Žilina (971)";"Successful"
"2013-07-12 15:43:11";"Zdenda";"127.0.0.1";"Create Match";"Makov:Žilina (972)";"Successful"
"2013-07-12 15:43:17";"Zdenda";"127.0.0.1";"Delete Match";"Makov:Žilina (972)";"Successful"
"2013-07-12 15:56:41";"Zdenda";"127.0.0.1";"Create Match";"Morašice B:xxx3 (973)";"Successful"
"2013-07-12 15:56:44";"Zdenda";"127.0.0.1";"Create Match";"Pardubice:Žilina (974)";"Successful"
"2013-07-12 15:56:48";"Zdenda";"127.0.0.1";"Create Match";"Jihlava:Bratislava (975)";"Successful"
"2013-07-12 15:56:51";"Zdenda";"127.0.0.1";"Create Match";"České Budejovice:Mladá Boleslav (976)";"Successful"
"2013-07-12 15:57:10";"Zdenda";"127.0.0.1";"Create Result";"Create '1' periods in Morašice B:xxx3 (973)";"Successful"
"2013-07-12 15:57:32";"Zdenda";"127.0.0.1";"Create Result";"Create '1' periods in Pardubice:Žilina (974)";"Successful"
"2013-07-12 15:57:55";"Zdenda";"127.0.0.1";"Create Result";"Create '1' periods in Jihlava:Bratislava (975)";"Successful"
"2013-07-12 15:58:03";"Zdenda";"127.0.0.1";"Create Result";"Create '1' periods in České Budejovice:Mladá Boleslav (976)";"Successful"
"2013-07-12 16:30:03";"Zdenda";"127.0.0.1";"Create Result";"Create '1' periods in Jihlava:České Budejovice (977)";"Successful"
"2013-07-12 16:30:09";"Zdenda";"127.0.0.1";"Create Result";"Create '1' periods in Olomouc:Mladá Boleslav (983)";"Successful"
"2013-07-12 16:30:46";"Zdenda";"127.0.0.1";"Create Result";"Create '4' periods in matches: 979, 984";"Successful"
"2013-07-12 16:30:46";"Zdenda";"127.0.0.1";"Create Result";"Create '4' periods in matches: 979, 984";"Successful"
"2013-07-12 16:31:03";"Zdenda";"127.0.0.1";"Create Result";"Create '4' periods in matches: 978, 985";"Successful"
"2013-07-12 16:31:34";"Zdenda";"127.0.0.1";"Delete Period";"1:1 in České Budejovice:Mladá Boleslav (979)";"Successful"
"2013-07-12 16:31:36";"Zdenda";"127.0.0.1";"Delete Period";"1:1 in České Budejovice:Mladá Boleslav (979)";"Successful"
"2013-07-12 16:33:00";"Zdenda";"127.0.0.1";"Create Result";"Create '2' periods in matches: 980";"Successful"
"2013-07-12 17:12:22";"Zdenda";"127.0.0.1";"Players";"Create players 1/1 in Makov:Morašice A (51)";"Successful"
"2013-07-12 17:12:31";"Zdenda";"127.0.0.1";"Players";"Create players 1/1 in Makov:Morašice A (51)";"Successful"
"2013-07-12 17:12:46";"Zdenda";"127.0.0.1";"Players";"Create players 1/1 in Makov:Morašice A (51)";"Successful"
"2013-07-12 17:12:51";"Zdenda";"127.0.0.1";"Players";"Update player Morašice A - Petr Čech (Goalkeeper) in Makov:Morašice A (51)";"Successful"
"2013-07-12 17:12:57";"Zdenda";"127.0.0.1";"Players";"Delete player Morašice A - Petr Čech (Goalkeeper) in Makov:Morašice A (51)";"Successful"
"2013-07-12 17:13:06";"Zdenda";"127.0.0.1";"Match Team Actions";"Create 1 match actions in Makov:Morašice A (51)";"Successful"
"2013-07-12 17:13:16";"Zdenda";"127.0.0.1";"Referees";"Add referee Abraham František [Hlavní rozhodčí] to Makov:Morašice A (51)";"Successful"
"2013-07-12 17:13:20";"Zdenda";"127.0.0.1";"Referees";"Add referee Exportovič Import [Asistent] to Makov:Morašice A (51)";"Successful"
"2013-07-12 17:13:22";"Zdenda";"127.0.0.1";"Referees";"Delete member Import Exportovič [Asistent] in Makov:Morašice A (51)";"Successful"
"2013-07-12 17:13:26";"Zdenda";"127.0.0.1";"Referees";"Update Position of František Abraham in Makov:Morašice A (51)";"Successful"
"2013-07-12 17:13:50";"Zdenda";"127.0.0.1";"Match Player Actions";"Create 2 match actions in Makov:Morašice A (51)";"Successful"
"2013-07-12 17:14:01";"Zdenda";"127.0.0.1";"Create Period";"1:1 in Makov:Morašice A (51)";"Successful"
"2013-07-12 17:14:10";"Zdenda";"127.0.0.1";"Create Period";"5:5 in Makov:Morašice A (51)";"Successful"
"2013-07-12 17:14:18";"Zdenda";"127.0.0.1";"Create Period";"2:2 in Makov:Morašice A (51)";"Successful"
"2013-07-12 17:14:30";"Zdenda";"127.0.0.1";"Update Result";"Update '1' periods in Makov:Morašice A (51)";"Successful"
"2013-07-12 17:14:34";"Zdenda";"127.0.0.1";"Update Result";"Update '1' periods in Makov:Morašice A (51)";"Successful"
"2013-07-12 17:14:36";"Zdenda";"127.0.0.1";"Delete Period";"2:2 in Makov:Morašice A (51)";"Successful"
"2013-07-12 17:14:45";"Zdenda";"127.0.0.1";"Delete Result";"5:5 (51)";"Successful"
"2013-07-12 17:14:49";"Zdenda";"127.0.0.1";"Create Result";"Create '1' periods in Makov:Morašice A (51)";"Successful"
"2013-07-12 17:15:07";"Zdenda";"127.0.0.1";"Update Match";"Match Makov:Morašice A (51)";"Successful"
"2013-07-12 17:15:22";"Zdenda";"127.0.0.1";"Create Match";"Bratislava:Pardubice C (989)";"Successful"
"2013-07-12 17:15:39";"Zdenda";"127.0.0.1";"Update Match";"Match Bratislava:Pardubice C (989)";"Successful"
"2013-07-12 17:15:42";"Zdenda";"127.0.0.1";"Delete Match";"Bratislava:Liberec (989)";"Successful"
"2013-07-13 15:36:04";"Zdenda";"127.0.0.1";"Update Detail";"Morašice B:Morašice A (6)";"Successful"
"2013-07-15 10:10:25";"Zdenda";"127.0.0.1";"Update Match";"Match Morašice B:Morašice A (6)";"Successful"
"2013-07-15 10:10:31";"Zdenda";"127.0.0.1";"Delete Period";"5:5 in Morašice B:Morašice A (6)";"Successful"
"2013-07-15 10:10:53";"Zdenda";"127.0.0.1";"Create Result";"Create '1' periods in Morašice B:Morašice A (6)";"Successful"
"2013-07-15 10:11:24";"Zdenda";"127.0.0.1";"Match Player Actions";"Update action Zdeněk Drahoš (Gól, 90) in Morašice B:Morašice A (6)";"Successful"
"2013-07-17 10:49:26";"Zdenda";"127.0.0.1";"Players";"Update player Morašice B - Zdeněk Drahoš (Goalkeeper) in Morašice B:Morašice A (6)";"Successful"
"2013-07-17 10:50:32";"Zdenda";"127.0.0.1";"Players";"Update player Morašice B - Martin Štancl (Goalkeeper) in Morašice B:Morašice A (6)";"Successful"
"2013-07-21 10:21:01";"Zdenda";"127.0.0.1";"Create Result";"Create '1' periods in Stará garda:FC Párci (731)";"Successful"
"2013-07-21 13:53:26";"Zdenda";"127.0.0.1";"Create Result";"Create '1' periods in Tým 3:Tým 7 (1247)";"Successful"
"2013-07-21 13:54:49";"Zdenda";"127.0.0.1";"Create Result";"Create '1' periods in Tým 1:Tým 5 (1245)";"Successful"
"2013-07-21 13:55:07";"Zdenda";"127.0.0.1";"Match Player Actions";"Create 2 match actions in Tým 4:Tým 2 (1246)";"Successful"
"2013-07-21 13:55:16";"Zdenda";"127.0.0.1";"Create Period";"6:3 in Tým 4:Tým 2 (1246)";"Successful"
"2013-07-21 13:55:32";"Zdenda";"127.0.0.1";"Create Period";"1:1 in Tým 4:Tým 2 (1246)";"Successful"
"2013-07-21 14:02:15";"Zdenda";"127.0.0.1";"Create Result";"Create '3' periods in matches: 1248, 1249, 1250";"Successful"
"2013-07-21 14:02:27";"Zdenda";"127.0.0.1";"Create Result";"Create '3' periods in matches: 1251, 1252, 1253";"Successful"
"2013-07-21 14:02:34";"Zdenda";"127.0.0.1";"Create Result";"Create '3' periods in matches: 1254, 1255, 1256";"Successful"
"2013-07-21 14:02:43";"Zdenda";"127.0.0.1";"Create Result";"Create '3' periods in matches: 1257, 1258, 1259";"Successful"
"2013-07-21 14:02:48";"Zdenda";"127.0.0.1";"Create Result";"Create '3' periods in matches: 1260, 1261, 1262";"Successful"
"2013-07-21 14:02:56";"Zdenda";"127.0.0.1";"Create Result";"Create '3' periods in matches: 1263, 1264, 1265";"Successful"
"2013-07-22 13:47:08";"Zdenda";"127.0.0.1";"Delete Match";"Tým 2:Tým 3 (1265)";"Successful"
