{
  "title": "Technology Registry Q4.2024",
  "technologies": [
    {
      "name": "Rust",
      "category": "languages",
      "lifecycle": "trial",
      "link": "https://www.rust-lang.org/",
      "moved": 1,
      "highlight": true
    },
    {
      "name": "Go",
      "category": "languages",
      "lifecycle": "remember",
      "link": "https://golang.org/",
      "moved": 0,
      "highlight": false
    },
    {
      "name": "C++",
      "category": "languages",
      "lifecycle": "remember",
      "link": "https://www.cplusplus.com/",
      "moved": 0,
      "highlight": false
    },
    {
      "name": "Kotlin",
      "category": "languages",
      "lifecycle": "use",
      "link": "https://kotlinlang.org/",
      "moved": 0,
      "highlight": true
    },
    {
      "name": "Groovy",
      "category": "languages",
      "lifecycle": "remember",
      "link": "https://groovy-lang.org/",
      "moved": 0,
      "highlight": false
    },
    {
      "name": "JavaScript",
      "category": "languages",
      "lifecycle": "use",
      "link": "https://www.javascript.com/",
      "moved": 0,
      "highlight": true
    },
    {
      "name": "TypeScript",
      "category": "languages",
      "lifecycle": "use",
      "link": "https://www.typescriptlang.org/",
      "moved": 0,
      "highlight": true
    },
    {
      "name": "Python",
      "category": "languages",
      "lifecycle": "use",
      "link": "https://www.python.org/",
      "moved": 0,
      "highlight": true
    },
    {
      "name": "SQL",
      "category": "languages",
      "lifecycle": "use",
      "link": "https://www.w3schools.com/sql/",
      "moved": 0,
      "highlight": false
    },
    {
      "name": "HTML",
      "category": "languages",
      "lifecycle": "use",
      "link": "https://www.w3schools.com/html/",
      "moved": 0,
      "highlight": true
    },
    {
      "name": "Ruby",
      "category": "languages",
      "lifecycle": "avoid",
      "link": "https://www.ruby-lang.org/en/",
      "moved": 0,
      "highlight": false
    },
    {
      "name": "C#",
      "category": "languages",
      "lifecycle": "remember",
      "link": "https://docs.microsoft.com/cs-cz/dotnet/csharp/",
      "moved": 0,
      "highlight": false
    },
    {
      "name": "Java",
      "category": "languages",
      "lifecycle": "use",
      "link": "https://www.oracle.com/java",
      "moved": 0,
      "highlight": true
    },
    {
      "name": "TensorFlow",
      "category": "frameworks",
      "lifecycle": "remember",
      "link": "https://www.tensorflow.org/",
      "moved": 0,
      "highlight": false
    },
    {
      "name": "Svelte",
      "category": "frameworks",
      "lifecycle": "use",
      "link": "https://svelte.dev/",
      "moved": 0,
      "highlight": false
    },
    {
      "name": "Playwright",
      "category": "frameworks",
      "lifecycle": "use",
      "link": "https://playwright.dev/",
      "moved": 0,
      "highlight": false
    },
    {
      "name": "Cypress",
      "category": "frameworks",
      "lifecycle": "remember",
      "link": "https://www.cypress.io/",
      "moved": 0,
      "highlight": false
    },
    {
      "name": "React",
      "category": "frameworks",
      "lifecycle": "remember",
      "link": "https://reactjs.org/",
      "moved": 0,
      "highlight": false
    },
    {
      "name": "Spring",
      "category": "frameworks",
      "lifecycle": "use",
      "link": "https://projects.spring.io/spring-framework/",
      "moved": 0,
      "highlight": true
    },
    {
      "name": "Spring Boot",
      "category": "frameworks",
      "lifecycle": "use",
      "link": "https://projects.spring.io/spring-boot/",
      "moved": 0,
      "highlight": true
    },
    {
      "name": "jOOQ",
      "category": "frameworks",
      "lifecycle": "use",
      "link": "https://www.jooq.org/",
      "moved": 0,
      "highlight": true
    },
    {
      "name": "Hazelcast",
      "category": "frameworks",
      "lifecycle": "remember",
      "link": "https://hazelcast.com/",
      "moved": 0,
      "highlight": false
    },
    {
      "name": "Kotest",
      "category": "frameworks",
      "lifecycle": "use",
      "link": "https://kotest.io/",
      "moved": 0,
      "highlight": true
    },
    {
      "name": "Apache Camel",
      "category": "frameworks",
      "lifecycle": "remember",
      "link": "https://camel.apache.org/",
      "moved": 0,
      "highlight": false
    },
    {
      "name": "D3.js",
      "category": "frameworks",
      "lifecycle": "use",
      "link": "https://d3js.org/",
      "moved": 0,
      "highlight": false
    },
    {
      "name": "DGS",
      "category": "frameworks",
      "lifecycle": "use",
      "link": "https://netflix.github.io/dgs/",
      "moved": 0,
      "highlight": false
    },
    {
      "name": "AngularJS",
      "category": "frameworks",
      "lifecycle": "avoid",
      "link": "https://angularjs.org/",
      "moved": 0,
      "highlight": false
    },
    {
      "name": "GWT",
      "category": "frameworks",
      "lifecycle": "avoid",
      "link": "https://www.gwtproject.org/",
      "moved": 0,
      "highlight": false
    },
    {
      "name": "AWS Lambda",
      "category": "runtime",
      "lifecycle": "remember",
      "link": "https://aws.amazon.com/lambda/",
      "moved": 0,
      "highlight": false
    },
    {
      "name": "NGINX",
      "category": "runtime",
      "lifecycle": "use",
      "link": "https://www.nginx.com/",
      "moved": 0,
      "highlight": false
    },
    {
      "name": "Elastic Stack",
      "category": "runtime",
      "lifecycle": "use",
      "link": "https://www.elastic.co/elastic-stack/",
      "moved": 0,
      "highlight": false
    },
    {
      "name": "GCP Functions",
      "category": "runtime",
      "lifecycle": "use",
      "link": "https://cloud.google.com/functions/",
      "moved": 0,
      "highlight": true
    },
    {
      "name": "Azure Functions",
      "category": "runtime",
      "lifecycle": "avoid",
      "link": "https://azure.microsoft.com/",
      "moved": 0,
      "highlight": false
    },
    {
      "name": "GCP Datastore",
      "category": "runtime",
      "lifecycle": "use",
      "link": "https://cloud.google.com/datastore/",
      "moved": 0,
      "highlight": false
    },
    {
      "name": "AWS S3",
      "category": "runtime",
      "lifecycle": "use",
      "link": "https://aws.amazon.com/lambda/",
      "moved": 0,
      "highlight": true
    },
    {
      "name": "AWS API GW",
      "category": "runtime",
      "lifecycle": "remember",
      "link": "https://aws.amazon.com/api-gateway/",
      "moved": 0,
      "highlight": false
    },
    {
      "name": "AWS EC2",
      "category": "runtime",
      "lifecycle": "remember",
      "link": "https://aws.amazon.com/ec2/",
      "moved": 0,
      "highlight": false
    },
    {
      "name": "Docker",
      "category": "runtime",
      "lifecycle": "use",
      "link": "https://www.docker.com/",
      "moved": 0,
      "highlight": true
    },
    {
      "name": "Kubernetes",
      "category": "runtime",
      "lifecycle": "use",
      "link": "https://kubernetes.io/",
      "moved": 0,
      "highlight": true
    },
    {
      "name": "A. Kafka",
      "category": "runtime",
      "lifecycle": "remember",
      "link": "https://kafka.apache.org/",
      "moved": 0,
      "highlight": false
    },
    {
      "name": "A. ZooKeeper",
      "category": "runtime",
      "lifecycle": "remember",
      "link": "https://zookeeper.apache.org/",
      "moved": 0,
      "highlight": false
    },
    {
      "name": "Node.js",
      "category": "runtime",
      "lifecycle": "use",
      "link": "https://nodejs.org/en/",
      "moved": 0,
      "highlight": false
    },
    {
      "name": "Android",
      "category": "runtime",
      "lifecycle": "use",
      "link": "https://www.android.com/",
      "moved": 0,
      "highlight": true
    },
    {
      "name": "Linux",
      "category": "runtime",
      "lifecycle": "use",
      "link": "https://www.linux.com/",
      "moved": 0,
      "highlight": true
    },
    {
      "name": "Windows",
      "category": "runtime",
      "lifecycle": "avoid",
      "link": "https://www.microsoft.com/en-us/windows",
      "moved": 0,
      "highlight": false
    },
    {
      "name": "MarvelApp",
      "category": "tools",
      "lifecycle": "remember",
      "link": "https://marvelapp.com/",
      "moved": 0,
      "highlight": false
    },
    {
      "name": "OpenAPI",
      "category": "tools",
      "lifecycle": "use",
      "link": "https://swagger.io/",
      "moved": 0,
      "highlight": true
    },
    {
      "name": "Gradle",
      "category": "tools",
      "lifecycle": "use",
      "link": "https://gradle.org/",
      "moved": 0,
      "highlight": true
    },
    {
      "name": "Helm",
      "category": "tools",
      "lifecycle": "use",
      "link": "https://helm.sh/",
      "moved": 0,
      "highlight": true
    },
    {
      "name": "JetBrains IDEs",
      "category": "tools",
      "lifecycle": "use",
      "link": "https://www.jetbrains.com/",
      "moved": 0,
      "highlight": true
    },
    {
      "name": "GitHub Copilot",
      "category": "tools",
      "lifecycle": "use",
      "link": "https://github.com/features/copilot",
      "moved": 0,
      "highlight": false
    },
    {
      "name": "Visual Studio",
      "category": "tools",
      "lifecycle": "avoid",
      "link": "https://visualstudio.microsoft.com/cs/",
      "moved": 0,
      "highlight": false
    },
    {
      "name": "VS Code",
      "category": "tools",
      "lifecycle": "use",
      "link": "https://code.visualstudio.com/",
      "moved": 0,
      "highlight": false
    },
    {
      "name": "TeamCity",
      "category": "tools",
      "lifecycle": "remember",
      "link": "https://www.jetbrains.com/teamcity/",
      "moved": 0,
      "highlight": false
    },
    {
      "name": "Trello",
      "category": "tools",
      "lifecycle": "use",
      "link": "https://trello.com/",
      "moved": 0,
      "highlight": true
    },
    {
      "name": "Jira",
      "category": "tools",
      "lifecycle": "use",
      "link": "https://www.jetbrains.com/youtrack/",
      "moved": 0,
      "highlight": true
    },
    {
      "name": "TestRail",
      "category": "tools",
      "lifecycle": "remember",
      "link": "https://www.gurock.com/testrail/",
      "moved": 0,
      "highlight": false
    },
    {
      "name": "Ansible",
      "category": "tools",
      "lifecycle": "use",
      "link": "https://www.ansible.com/",
      "moved": 0,
      "highlight": false
    },
    {
      "name": "Git",
      "category": "tools",
      "lifecycle": "use",
      "link": "https://git-scm.com/",
      "moved": 0,
      "highlight": true
    },
    {
      "name": "GitLab CI",
      "category": "tools",
      "lifecycle": "use",
      "link": "https://docs.gitlab.com/ee/ci/",
      "moved": 0,
      "highlight": true
    },
    {
      "name": "Maven",
      "category": "tools",
      "lifecycle": "avoid",
      "link": "https://maven.apache.org/",
      "moved": 0,
      "highlight": false
    },
    {
      "name": "Eclipse",
      "category": "tools",
      "lifecycle": "avoid",
      "link": "https://www.eclipse.org/",
      "moved": 0,
      "highlight": false
    },
    {
      "name": "Jenkins",
      "category": "tools",
      "lifecycle": "remember",
      "link": "https://jenkins.io/",
      "moved": 0,
      "highlight": false
    },
    {
      "name": "k9s",
      "category": "tools",
      "lifecycle": "use",
      "link": "https://k9scli.io/",
      "moved": 1,
      "highlight": true
    },
    {
      "name": "OpenAI Models",
      "category": "runtime",
      "lifecycle": "use",
      "link": "https://platform.openai.com/docs/models",
      "moved": 0,
      "highlight": false
    }
  ]
}
