<?xml version="1.0" encoding="UTF-8" standalone="no"?>
<svg
   height="912.36255"
   stroke-miterlimit="10"
   style="clip-rule:evenodd;fill-rule:nonzero;stroke-linecap:round;stroke-linejoin:round"
   version="1.1"
   viewBox="0 0 794.7578 912.36255"
   width="794.75781"
   xml:space="preserve"
   id="svg9"
   sodipodi:docname="rdb_logo_mini_blue.svg"
   inkscape:version="1.3.2 (091e20ef0f, 2023-11-25)"
   xmlns:inkscape="http://www.inkscape.org/namespaces/inkscape"
   xmlns:sodipodi="http://sodipodi.sourceforge.net/DTD/sodipodi-0.dtd"
   xmlns="http://www.w3.org/2000/svg"
   xmlns:svg="http://www.w3.org/2000/svg"><sodipodi:namedview
   id="namedview9"
   pagecolor="#ffffff"
   bordercolor="#000000"
   borderopacity="0.25"
   inkscape:showpageshadow="2"
   inkscape:pageopacity="0.0"
   inkscape:pagecheckerboard="0"
   inkscape:deskcolor="#d1d1d1"
   inkscape:zoom="0.49323894"
   inkscape:cx="380.14031"
   inkscape:cy="506.85374"
   inkscape:window-width="5120"
   inkscape:window-height="1376"
   inkscape:window-x="0"
   inkscape:window-y="0"
   inkscape:window-maximized="1"
   inkscape:current-layer="svg9" />
<defs
   id="defs1" />
<g
   id="Ebene-1"
   transform="translate(-1305.8011,-684.45637)">
<path
   d="M 2083.28,921.185 V 1360.09"
   fill="none"
   opacity="1"
   stroke="#3f4eff"
   stroke-linecap="round"
   stroke-linejoin="round"
   stroke-width="34.5578"
   id="path1" />
<path
   d="m 2083.28,1360.09 -380.1,219.45 v -438.9 l -380.1,-219.455 380.1,-219.45 380.1,219.45"
   fill="none"
   opacity="1"
   stroke="#3f4eff"
   stroke-linecap="round"
   stroke-linejoin="round"
   stroke-width="34.5578"
   id="path2" />
<path
   d="m 1364.04,1047.53 335.68,193.8"
   fill="none"
   opacity="1"
   stroke="#3f4eff"
   stroke-linecap="round"
   stroke-linejoin="round"
   stroke-width="34.5578"
   id="path3" />
<path
   d="m 1957.41,1158.84 -42.57,170.65 -93.59,-23.12 -118.07,260.98"
   fill="none"
   opacity="1"
   stroke="#3f4eff"
   stroke-linecap="round"
   stroke-linejoin="round"
   stroke-width="34.5578"
   id="path4" />
<path
   d="m 1703.18,1140.64 380.1,-219.455"
   fill="none"
   opacity="1"
   stroke="#3f4eff"
   stroke-linecap="round"
   stroke-linejoin="bevel"
   stroke-width="34.5578"
   id="path5" />
<path
   d="m 1362.41,1165.21 335.68,193.8"
   fill="none"
   opacity="1"
   stroke="#3f4eff"
   stroke-linecap="round"
   stroke-linejoin="round"
   stroke-width="34.5578"
   id="path6" />
<path
   d="m 1364.22,1274.47 335.68,193.81"
   fill="none"
   opacity="1"
   stroke="#3f4eff"
   stroke-linecap="round"
   stroke-linejoin="round"
   stroke-width="34.5578"
   id="path7" />
<path
   d="m 1323.08,1360.09 380.1,219.45"
   fill="none"
   opacity="1"
   stroke="#3f4eff"
   stroke-linecap="round"
   stroke-linejoin="round"
   stroke-width="34.5578"
   id="path8" />
<path
   d="m 1621.25,956.296 142.74,-82.413"
   fill="none"
   opacity="1"
   stroke="#3f4eff"
   stroke-linecap="round"
   stroke-linejoin="round"
   stroke-width="34.5578"
   id="path9" />
</g>
</svg>
