{
  "last_updated": "2022-08-31",
  "summary": null,
  "tools": {
    "1": {
      "text": "The canton has various channels on social media ([Twitter](https://twitter.com/KantonZug), [YouTube](https://www.youtube.com/channel/UC8SKbyhlwjhx5_gnyw2vuqw/videos)) that are used regularly. Therefore, 25 points are assigned.\r\n\r\nIn total, the canton receives 25 points."
    },
    "2": {
      "text": "In the canton, voters have access to [VoteInfo](https://www.bfs.admin.ch/bfs/fr/home/statistiques/politique/votations/voteinfo.html) and smartvote. Therefore, 50 points are assigned.\r\n\r\nIn total, the canton receives 50 points."
    },
    "3": {
      "text": "The canton makes [minutes of the sessions of the Grand Council](https://www.zg.ch/behoerden/kr/protokolle), [government reports](https://www.zg.ch/behoerden/regierungsrat/finanzen-und-geschaeftsberichte) and important statistics available online as PDF files. Results of votations are availlable as [Excel-files](https://www.zg.ch/behoerden/kr/abstimmungsergebnisse-kantonsrat). However, these are not processed systematically and therefore, have to be cleaned and processed before they can be used further. Additionally, the canton of Zug is advancing an open government strategy however, there is no full [open government data portal](https://opendata.swiss/de/organization/kanton-zug) yet. Therefore, 50 points are assigned.\r\n\r\nBonus and Malus:  \r\nInclusiveness: There is a [livestream](https://www.zg.ch/behoerden/kr/livestream) of the parliamentary sessions. For this 5 points are assigned.\r\n\r\nIn total, the canton receives 55 points."
    },
    "4": {
      "text": "The canton used a proprietary software in the past. However, during the past year material could only be sent in by [e-mail](https://www.zg.ch/behoerden/regierungsrat/vernehmlassungen/anpassung-kantonaler-richtplan-22-1-antraege-der-gemeinden-im-rahmen-der-ortsplanungsrevisionen-u-a-umfahrung-unteraegeri-und-zentrumstunnel-zug-sowie-archaeologische-fundstaetten-weiler-waelder-mit-besonderer-erholungsfunktion-naturgefahren-kommunale). Therefore, 0 points are assigned.\r\n\r\nBonus and Malus:  \r\nUse: Consultations were held regularly and email are the standard practice. For this 5 points are assigned.\r\n\r\nIn total, the canton receives 5 points."
    },
    "5": {
      "text": "No online petition platform is used in the canton. There is currently a [basic electronic petition](https://gruene-zug.ch/2022/02/28/petition-zug-soll-haltung-zeigen/) directed at the government of Zug to support tougher sanctions against Russia. Therefore, 25 points are assigned.\r\n\r\nBonus and Malus:  \r\nInclusiveness: petition is mainly run by the Junge Grüne For this -5 points are assigned.\r\n\r\nIn total, the canton receives 20 points."
    },
    "6": {
      "text": "The canton has its own [e-ID system](https://www.benutzerkonto.ch/ezug_de.html). Therefore, 75 points are assigned.\r\n\r\nBonus and Malus:  \r\nUsability: The login is intuitive. For people living in the canton of Zug a [physical verification](https://www.zuglogin.ch/web/registration-np.xhtml) is not needed. For this 5 points are assigned.\r\n\r\nIn total, the canton receives 80 points."
    },
    "7": {
      "text": "There is a legal basis for e-voting in the canton ([WAG Art 17](https://bgs.zg.ch/app/de/texts_of_law/131.1)). Therefore, 25 points are assigned.\r\n\r\nIn total, the canton receives 25 points."
    }
  }
}
