{
  "last_updated": "2022-08-10",
  "summary": "Avec 35 points sur 100 pour le DigiPartIndex, le canton de Fribourg se classe au 11e rang de Suisse, c’est-à-dire dans la moyenne cantonale, mais à un niveau relativement bas dans l’index. Bien que son score ait augmenté de 5 points par rapport à l'année dernière, le canton a malgré tout perdu 1 place dans le classement général.\r\n\r\nIl existe des différences relativement importantes entre les dimensions individuelles : formation de l’opinion, participation et prise de décision. Le canton de Fribourg a obtenu le score de 47 (+4) pour la dimension « formation de l’opinion » (discuter, apprendre, surveiller), 15 (-3) pour la dimension « participation » (consulter, donner son avis) et 63 (+45) pour la dimension « prise de décision » (s’identifier, voter et élire).\r\n\r\nIl y a également des différences significatives entre les outils individuels. Avec 75 points d’écart, la fourchette entre la valeur la plus basse et celle la plus haute est très élevée.",
  "tools": {
    "1": {
      "text": null
    },
    "2": {
      "text": null
    },
    "3": {
      "text": null
    },
    "4": {
      "text": null
    },
    "5": {
      "text": null
    },
    "6": {
      "text": null
    },
    "7": {
      "text": null
    }
  }
}
