{
  "last_updated": "2022-08-17",
  "summary": "Avec 56 points sur 100 pour le DigiPartIndex, le canton de Genève se hisse au 1er rang de Suisse, c’est-à-dire en tête du classement, mais seulement dans la zone médiane de l’index. Par rapport à l'année dernière, le score a augmenté de 1 point. Le canton de Genève a su conserver sa première place, bien qu’il ait encore une belle marge de progression dans tous les domaines.\r\n\r\nLe canton de Genève est relativement équilibré en termes de dimensions individuelles : formation d’opinion, participation et prise de décision. Il a obtenu 62 points (+4) pour la dimension « formation d’opinion » (discuter, apprendre, suivre), 58 (+/- 0) pour la dimension « participation » (consulter, exprimer une opinion) et 50 points (+/-0) pour la dimension prise de décision (identification, vote et vote).\r\n\r\nCependant, il y a des différences significatives entre les outils individuels. Avec 55 points d’écart, la fourchette entre la valeur la plus basse et celle la plus haute est relativement élevée.",
  "tools": {
    "1": {
      "text": null
    },
    "2": {
      "text": null
    },
    "3": {
      "text": null
    },
    "4": {
      "text": null
    },
    "5": {
      "text": null
    },
    "6": {
      "text": null
    },
    "7": {
      "text": null
    }
  }
}
