{
  "last_updated": "2022-08-10",
  "summary": null,
  "tools": {
    "1": {
      "text": "The canton has various channels on social media ([Twitter](https://twitter.com/cantondujura), [Facebook](https://www.facebook.com/juraoriginalsuisse), [Instagram](https://www.instagram.com/juraoriginal/?hl=fr)). Therefore, 25 points are assigned.\r\n\r\nIn total, the canton receives 25 points."
    },
    "2": {
      "text": "In the canton, voters have access to platforms with information about ballots ([VoteInfo](https://www.bfs.admin.ch/bfs/fr/home/statistiques/politique/votations/voteinfo.html) and [Smartvote](https://www.smartvote.ch/fr/group/21/election/20_ju_exe2/home)). Therefore, 50 points are assigned.\r\n\r\nIn total, the canton receives 50 points."
    },
    "3": {
      "text": "The canton makes [minutes of the Grand Council sessions](https://rsju.jura.ch/fr/Sommaire/Journal-des-debats/Journal-des-debats.html) as well as [governmental reports](https://www.jura.ch/fr/Autorites/GVT/Rapport-de-legislature-2016-2020.html) and important statistics available online as PDF files. These filesare not processed further. Therefore, 50 points are assigned.\r\n\r\nBonus and Malus:  \r\nInclusiveness: There is a [livestream](https://www.youtube.com/user/sic71000) of the parliamentary sessions. For this 5 points are assigned.\r\n\r\nIn total, the canton receives 55 points."
    },
    "4": {
      "text": "The canton does not have a digital tool for consultations. Materials can be submitted by [e-mail](https://www.jura.ch/Projets-de-lois/Projets-mis-en-consultation/Mise-en-consultation-de-l-avant-projet-de-loi-concernant-l-exercice-de-la-prostitution-et-le-commerce-de-la-pornographie.html). Therefore, 0 points are assigned.\r\n\r\nBonus and Malus:  \r\nUse: Consultations are held occasionally ([six times in the past year and approximately once a month in the past four months](https://www.jura.ch/Projets-de-lois.html)). For this 5 points are assigned.\r\n\r\nIn total, the canton receives 5 points."
    },
    "5": {
      "text": "One private online petition platform is available in the canton ([petitionenligne.ch](https://www.petitionenligne.ch/la_maturite_theatre_dans_le_jura_en_danger)), however it was not used during the past year. Therefore, 0 points are assigned.\r\n\r\nIn total, the canton receives 0 points."
    },
    "6": {
      "text": "The canton has an [e-government portal](https://www.guichetunique.ch/private/?login) where you have to register with an e-ID (SwissID). Therefore, 75 points are assigned.\r\n\r\nIn total, the canton receives 75 points."
    },
    "7": {
      "text": "There is neither [e-voting nor the legal basis](https://www.swissinfo.ch/fre/politique/e-voting_le-jura-ne-veut-pas-du-vote-%C3%A9lectronique/44631502) for it in the canton. Therefore, 0 points are assigned.\r\n\r\nIn total, the canton receives 0 points."
    }
  }
}
