<?xml version="1.0" encoding="UTF-8" standalone="no"?>
<svg
   height="510"
   width="420"
   version="1.1"
   id="svg16"
   xmlns="http://www.w3.org/2000/svg"
   xmlns:svg="http://www.w3.org/2000/svg"
   xmlns:rdf="http://www.w3.org/1999/02/22-rdf-syntax-ns#"
   xmlns:cc="http://creativecommons.org/ns#"
   xmlns:dc="http://purl.org/dc/elements/1.1/">
  <defs
     id="defs20" />
  <title
     id="title2">Wappen Nidwalden</title>
  <g
     stroke="#000000"
     stroke-linecap="square"
     stroke-miterlimit="10"
     stroke-width="14.13"
     fill="#ffffff"
     id="g14"
     transform="matrix(0.22362788,0,0,0.22368421,-2.4330713,-1.5765263)">
    <path
       d="M 949.4,7.048 H 1889 v 1381 c 0,497 -420,899 -939,899 -518.6,0 -939.1,-402 -939.1,-899 l -0.02,-1381 938.5,0.048 z"
       fill="#e7423f"
       id="path4"
       style="stroke:none" />
    <path
       d="m 1119,844.2 h 129 v 107.3 h 200 V 844.2 h 90 v 107.3 h 220 V 829.8 h -81 v -96.9 h 81 V 610 h -220 v 107.3 h -90 V 610 h -119 v -94.3 h 119 V 408.4 h 90 v 107.3 h 220 V 394.1 h -81 v -96.9 h 81 V 175.6 h -220 v 105.9 h -90 V 175.6 h -200 v 105.9 h -129 z"
       id="path6" />
    <path
       d="M 777.8,844.2 H 649.6 V 951.5 H 449.4 V 844.2 H 359.1 V 951.5 H 139.3 V 829.8 h 81.1 V 732.9 H 139.3 V 610 h 219.8 v 107.3 h 90.3 V 610 H 568.5 V 515.7 H 449.4 V 408.4 H 359.1 V 515.7 H 139.3 V 394.1 h 81.1 V 297.2 H 139.3 V 175.6 h 219.8 v 105.9 h 90.3 V 175.6 h 200.2 v 105.9 h 128.2 z"
       id="path8" />
    <path
       d="m 969.1,69.66 1.2,1293 c 0,2 1.7,132 134.7,132 72,0 104,-24 134,-46 34,-25 68,-50 156,-51 32,0 107,4 156,53 32,32 48,76 48,133 0,52 -34,103 -89,134 -73,39 -162,36 -234,-12 l -18,-12 c -41,-28 -98,-67 -165,-34 -43,21 -66,57 -63,99 0,26 8,41 18,58 15,25 33,56 33,140 0,50 -16,137 -119.7,146 -83.1,8 -143.7,-73 -144.1,-146 -0.5,-84 18.1,-115 32.6,-140 9.9,-17 18.4,-32 18.4,-57 2.7,-43 -20.4,-79 -63.5,-100 -66.8,-33 -123.1,6 -164.7,34 l -17.8,12 c -72.7,49 -161.2,51 -233.8,12 -55.3,-31 -89.6,-82 -89.6,-134 0,-57 16.2,-101 48,-133 49.4,-49 124.3,-53 154.2,-53 89.9,1 124.3,26 157.6,51 30.9,22 62.8,46 134.3,46 133.1,0 134.8,-130 134.8,-132 l 1.1,-1293 -163.3,-0.68 v 1227 c 0,22 -6,37 -17,42 -12.7,6 -32.3,-2 -53.6,-21 -56.4,-51 -151.6,-74 -220.9,-74 -69.8,0 -330.7,57 -330.7,339 0,151 113.5,314 362.9,314 76.5,0 150.5,-39 190.5,-67 -20.8,37 -34.7,80 -34.7,126 0,39 7.3,79 22.4,118 40.8,103 125.6,170 232.6,182 9.3,2 23.7,2 33,2 9.2,0 18.1,0 26.2,-1 111.8,-13 196.8,-80 237.8,-183 15,-38 22,-79 22,-117 0,-47 -14,-90 -35,-127 40,28 114,67 191,67 249,0 363,-163 363,-314 0,-282 -261,-339 -331,-339 -69,0 -165,23 -221,74 -21,19 -41,27 -54,21 -10,-5 -16,-20 -16,-42 v -1227 z"
       id="path10" />
    <path
       d="m 1213,1127 c 0,29 -23,52 -51,52 H 737.3 c -28.6,0 -51.7,-23 -51.7,-52 0,-29 23.1,-52 51.7,-52 H 1162 c 28,0 51,23 51,52 z"
       id="path12" />
  </g>
  <metadata
     id="metadata2430">
    <rdf:RDF>
      <cc:Work
         rdf:about="">
        <dc:title>Wappen Nidwalden</dc:title>
      </cc:Work>
    </rdf:RDF>
  </metadata>
</svg>
