{
  "last_updated": "2023-08-24",
  "summary": "Avec un score de 29 points sur 100 pour l'indice DigiPart, le canton Tessin se classe en 15e position au milieu de terrain des cantons au niveau national, mais seulement dans la  basse de l'échelle. Par rapport à l'année précédente, le score s'est amélioré de 11 points, ce qui fait que le canton a gagné 7 places dans le classement final.\r\n \r\nIl obtient un score de 60 (+17) pour la dimension Formation de l'opinion (discuter, apprendre et surveiller), un score de 28 (+ 18) pour la dimension co-création (consulter, exprimer son opinion) et un score de 15 (+ 2) pour la dimension prise de décision (identifier et voter), il convient de noter qu'il y a eu un changement dans le schéma de codage pour l'indicateur 'eVoting' dans cette dernière dimension, ce qui rend impossible une comparaison directe des valeurs indiquées ici avec celles du profil de l'année précédente).\r\n \r\nD'extrêmement grandes différences apparaissent également entre les divers outils, avec un écart de 80 points entre la valeur la plus basse et celle la plus élevée.",
  "tools": {
    "1": {
      "text": null
    },
    "2": {
      "text": null
    },
    "3": {
      "text": null
    },
    "4": {
      "text": null
    },
    "5": {
      "text": null
    },
    "6": {
      "text": null
    },
    "7": {
      "text": null
    }
  }
}
