<?xml version="1.0" encoding="UTF-8" standalone="no"?>
<!-- Generator: Adobe Illustrator 16.0.2, SVG Export Plug-In . SVG Version: 6.00 Build 0)  -->

<svg
   version="1.1"
   id="Ebene_1"
   x="0px"
   y="0px"
   width="420.00003"
   height="510"
   viewBox="-176.119 -213.831 420.00002 510"
   enable-background="new -176.119 -213.831 406.523 492.832"
   xml:space="preserve"
   xmlns:xlink="http://www.w3.org/1999/xlink"
   xmlns="http://www.w3.org/2000/svg"
   xmlns:svg="http://www.w3.org/2000/svg"><defs
   id="defs27" />
<g
   id="g22"
   transform="matrix(1.0409232,0,0,1.0412987,5.6251498,7.2481683)">
	<path
   fill="#e7423f"
   d="M 27.018,-212.311 H 228.889 V 84.392 c 0,106.633 -90.328,193.07 -201.742,193.07 -111.426,0 -201.746,-86.438 -201.746,-193.07 v -296.703 z"
   id="path2" />
	<polygon
   fill="#ffffff"
   points="73.577,-120.217 132.014,-120.217 132.014,-61.92 151.092,-61.92 151.092,-120.217 209.686,-120.217 209.686,-139.518 151.092,-139.518 151.092,-197.553 132.014,-197.553 132.014,-139.518 73.577,-139.518 "
   id="polygon4" />
	<g
   id="g20">
		<g
   id="g18">
			<g
   id="g16">
				<g
   id="g14">
					<defs
   id="defs7">
						<rect
   id="SVGID_1_"
   x="-176.119"
   y="-213.83099"
   width="406.52301"
   height="492.832" />
					</defs>
					<clipPath
   id="SVGID_2_">
						<use
   xlink:href="#SVGID_1_"
   overflow="visible"
   id="use9"
   x="0"
   y="0"
   width="100%"
   height="100%" />
					</clipPath>
					<path
   clip-path="url(#SVGID_2_)"
   fill="none"
   stroke="#000000"
   stroke-width="3.048"
   d="M 27.018,-212.311 H 228.889 V 84.392 c 0,106.633 -90.328,193.07 -201.742,193.07 -111.426,0 -201.746,-86.438 -201.746,-193.07 v -296.703 z"
   id="path12"
   style="stroke:none" />
				</g>
			</g>
		</g>
	</g>
</g>
</svg>
