<?xml version="1.0" encoding="UTF-8" standalone="no"?>
<!-- Generator: Adobe Illustrator 16.0.2, SVG Export Plug-In . SVG Version: 6.00 Build 0)  -->

<svg
   version="1.1"
   id="Ebene_1"
   x="0px"
   y="0px"
   width="420"
   height="510"
   viewBox="-176.681 -214.424 419.99999 510"
   enable-background="new -176.681 -214.424 407.152 493.613"
   xml:space="preserve"
   xmlns:xlink="http://www.w3.org/1999/xlink"
   xmlns="http://www.w3.org/2000/svg"
   xmlns:svg="http://www.w3.org/2000/svg"><defs
   id="defs101" />
<g
   id="g96"
   style="stroke:none"
   transform="matrix(1.0392824,0,0,1.0396388,5.3607445,6.9202987)">
	<path
   fill="#ffffff"
   d="m 26.78,-212.905 h 202.184 v 297.18 c 0,106.805 -90.469,193.375 -202.055,193.375 -111.59,0 -202.07,-86.57 -202.07,-193.375 v -297.18 z"
   id="path2"
   style="stroke:none" />
	<g
   id="g18"
   style="stroke:none">
		<g
   id="g16"
   style="stroke:none">
			<g
   id="g14"
   style="stroke:none">
				<g
   id="g12"
   style="stroke:none">
					<defs
   id="defs5">
						<rect
   id="SVGID_1_"
   x="-176.681"
   y="-214.424"
   width="407.15201"
   height="493.61301" />
					</defs>
					<clipPath
   id="SVGID_2_">
						<use
   xlink:href="#SVGID_1_"
   overflow="visible"
   id="use7"
   x="0"
   y="0"
   width="100%"
   height="100%" />
					</clipPath>
					<path
   clip-path="url(#SVGID_2_)"
   fill="none"
   stroke="#010202"
   stroke-width="3.048"
   d="m 26.78,-212.905 h 202.184 v 297.18 c 0,106.805 -90.469,193.375 -202.055,193.375 -111.59,0 -202.07,-86.57 -202.07,-193.375 v -297.18 z"
   id="path10"
   style="stroke:none" />
				</g>
			</g>
		</g>
	</g>
	<path
   fill="#010202"
   d="m -39.787,-112.249 c 21.641,8.055 45.262,17.223 50.535,21.504 1.504,1.223 -14.84,14.832 -15.574,41.688 -11.371,4.656 -14.555,-0.41 -14.555,-0.41 0,0 -3.125,0.473 -4.063,2.504 -8.273,-4.766 -6.391,-11.215 -12.25,-7.293 -1.375,0.918 -6.941,-9.707 -9.328,-4.969 -5.949,-1.359 -5.344,-7.785 -6.973,-8.145 -1.602,-0.336 -5.016,2.246 -5.945,0.504 -1.504,-2.938 -3.238,-6.41 -3.816,-6.922 -0.609,-0.496 -1.375,1.625 -3.871,0.84 -2.551,-0.813 -3.93,-6.773 -6.129,-7.621 -4.535,1.598 -6.84,-5.145 -7.113,-6.059 -0.742,1.852 -6.863,2.488 -5.965,-0.648 3.152,-10.926 -13.355,-13.344 -11.465,-23.848 -23.656,-3.695 -17.48,-41.902 -22.121,-42.711 -8.559,-1.504 -14.48,-0.969 -14.48,-0.969 0,0 0.961,-6.168 12.914,-6.934 -6.121,-3.984 -14.402,-5.023 -14.402,-5.023 0,0 3.57,-4.824 18.418,-2.25 -3.066,-7 -10.891,-10.449 -10.891,-10.449 0,0 9.152,-2.094 18.297,5.504 -0.457,-8.758 -7.656,-15.887 -7.656,-15.887 0,0 8.945,-1.09 17.09,12.719 2.277,-8.301 -0.777,-17.125 -0.777,-17.125 0,0 9.578,1.238 11.84,18.527 7.816,10.352 1.848,25.719 9.832,43.496 4.441,9.888 20.343,13.239 38.448,19.977"
   id="path20"
   style="stroke:none" />
	<path
   fill="#010202"
   d="m -9.994,128.541 c 6.68,-22.75 29.383,-36.891 52.402,-35 1.219,-4.688 2.266,-9.891 1.844,-10.719 C 30.749,54.306 22.717,52.431 22.717,52.431 c 0,0 -29.762,-6.672 -47.746,1.672 -3.598,1.688 -30.469,17.594 -25.176,18.766 8.691,1.906 -3.461,7.516 -5.398,12.188 -1.91,4.672 2.855,3.547 3.07,4.109 0.531,1.422 -12.023,13.578 -8.902,14.219 11.648,2.25 -5.238,13.828 -1.633,14.688 10.031,2.359 -2.262,12.438 1.32,12.953 1.266,0.164 3.719,0.797 5.703,1.078 -1.117,1.984 -4.094,7.688 -3.445,13.594 0.277,2.734 3.496,-2.492 5.133,1.109 -8.254,6.688 7.18,25.813 8.266,37.203 -5.59,0.625 -4.656,-6.422 -9.504,-8.508 -2.617,4.758 -7.938,4.703 -14.289,3.164 -6.32,-1.547 -13.727,-4.625 -20.488,-4.719 -14.91,-3.758 -21.102,1.328 -22.461,3.031 0.445,0.141 5.68,1.328 13.168,4.539 -12.648,0.922 -14.898,8.523 -14.898,8.523 0,0 6.512,-0.375 14.609,1.203 -13.121,6.609 -11.313,13.922 -11.313,13.922 0,0 7.266,-4.266 14.754,-4.844 -4.051,3 -7.402,9.578 -4.922,14.281 2.977,-2.766 8.719,-5.391 10.785,-6.25 -2.785,6.297 -2.359,10.891 0.711,14.25 8.16,-11.156 11.105,-10.469 13.48,-10.297 1.297,0.117 4.824,1.234 10.016,1.773 4.32,0.453 9.793,0.289 16.055,0.648 15.016,0.859 32.457,1.352 43.938,-10.156 -3.551,-25.623 -9.993,-54.147 -3.544,-76.029"
   id="path22"
   style="stroke:none" />
	<path
   fill="#010202"
   d="m 15.397,-121.018 c 0,0 -0.695,7.664 4.945,8.16 1.816,0.145 8.504,-0.48 17.16,0.688 18.203,2.418 38.859,8.902 53.938,-5.801 13,-12.711 2.797,-31.521 14.484,-39.543 9.594,-6.641 20.156,-0.656 20.578,1.91 -14.344,-5.23 -17.359,-0.598 -19.016,0.508 -11.563,7.773 5.703,47.32 -38.219,48.492 -15.297,0.41 -31.398,1.234 -38.375,7.984 -3.961,3.801 -7.922,3.586 -13.625,8.738 -15.565,13.934 -16.12,31.528 -17.733,40.153 -0.641,3.391 1.121,2.313 1.121,2.313 0,0 9.832,-2.488 15.863,-3.203 1.078,-0.141 1.207,0.488 1.207,0.488 0,0 0.328,1.184 -1.039,1.281 -20.082,1.184 -73.305,24.457 -97.199,24.703 -1.508,-0.328 -15.426,-3.473 -17.152,-10.934 1.934,-2.344 10.84,11.375 19.184,7.184 -9.824,-8.066 -15.863,-27.199 -27.051,-32.953 -7.184,-20.582 -16.398,-20.938 -16.398,-20.938 0,0 5.273,17.266 3.594,20.73 -14.496,-13.898 -22.547,-9.953 -22.547,-9.953 l 12.922,16.266 c 0,0 -14.906,-6.785 -21.891,-0.859 8.707,3 16.656,8.547 16.449,10.363 -1.086,0.184 -13.52,-0.953 -16.129,6.063 4.938,0.594 13.641,3.031 15.059,5.457 -5.16,2.313 -14.617,5.625 -13.344,13.512 6.445,-1.266 11.473,-4.871 17.238,-4.016 7.824,-2.379 14.512,5.871 23.426,14.719 10.48,10.41 25.824,20.281 33.063,17.375 1.746,-0.703 0.727,-2.309 2.008,-2.527 1.313,-0.199 10.168,7.441 10.832,5.266 2.207,-7.25 2.52,-3.313 6.504,-1.563 2.023,0.875 5.234,0.203 7.961,2.266 1.75,-7.785 12.984,3.922 15.535,-2.801 5.625,0.832 11.609,4.656 10.727,-1.871 7.258,4.512 7.914,2.184 11.578,3.887 0.344,-6.656 7.734,-1.277 10.488,-1.328 28.944,-0.575 36.077,-8.919 41.6,-20.247 2.234,-4.578 4.703,-4.266 3.969,-1.594 -4.109,14.441 -14.5,24.891 -38.785,23.754 -1.348,-0.066 -1.977,0.473 -2.531,1.297 -0.551,0.824 -0.527,1.488 -0.383,4.406 0.23,6 17.137,25.313 26.426,38.594 12.18,17.375 16.836,26.344 15.344,30.211 -2.602,6.859 -7.742,43.375 -7.492,44.531 0.266,1.156 2.227,2.188 4.195,0.578 2.359,2.453 -2.18,11.859 0.75,12.094 2.188,-1.391 4.922,-2.594 4.922,-2.594 0,0 -4.586,10.563 2,15.609 0.867,-2.953 3.461,-5.109 3.461,-5.109 0,0 -1.297,10.234 5.094,13.094 0.094,-0.641 0.016,-1.063 0.734,-4.313 3.828,12.375 5.641,13.516 6.625,12.641 1.031,-0.828 -1.844,-5.172 1.508,-4.219 1.148,10.797 4.531,10.656 4.531,10.656 0,0 0.422,-0.453 2.031,-2.969 3.82,9.172 25.047,18.328 21.211,40.344 -0.75,0.492 -2.5,0.422 -3.016,-1.281 -0.523,-1.703 -1.852,-6.719 -2.469,-7.406 -0.609,-0.688 -2.438,-2.891 -16.625,-4.406 -14.219,-1.469 -21.25,4.984 -21.25,4.984 0,0 -15.719,-4.688 -24.125,5.234 4.969,-1.047 17.227,4.828 17.227,4.828 0,0 -12.617,2.719 -14.539,14.25 8.969,-4.156 18.125,-3.016 18.125,-3.016 0,0 -11.133,7.625 -8.883,18.406 7.836,-7.357 16.07,-9.281 16.07,-9.281 0,0 -7.563,11.359 -1.297,18.922 3.063,-3.97 8.625,-12.281 12.844,-11.641 1.703,11.25 8.859,15.234 9.859,14.438 0.961,-0.781 -1.938,-10.392 5.273,-16.328 12.383,-2.656 42.789,-7.867 54.547,-33.313 -1.383,-7.852 -26.266,-44.734 -25.742,-71.273 0.148,-7.43 1.281,-36.773 1.281,-36.773 0,0 0.906,-15.523 -5.906,-26.969 4.219,0.313 5.859,7.844 8.266,9.203 2.445,1.375 4.359,-2.078 4.359,-2.078 l -0.898,-6.469 4.836,5.234 c 0,0 4.164,-8.234 0.672,-18.414 -3.5,-10.18 -19.836,-29.328 -22.094,-36.047 -1.547,-4.672 -4.516,-24.543 -5.656,-31.801 -1.172,-7.25 -0.766,-30.656 -0.766,-30.656 0,0 3.438,0.512 5.672,2.297 1.828,-1.938 -0.875,-8.512 -0.063,-9.488 0.766,1.277 3.852,1.391 5.688,3.113 2.953,-5.41 0.344,-10.691 0.063,-11.379 4.969,1.922 9.547,1.512 10.281,-0.215 -1.891,-1.734 -4.508,-12.016 -4.375,-13.313 1.922,-0.84 7.375,3.512 8.328,1.938 -2.969,-4.168 -1.359,-10.617 -6.047,-17.77 1.734,-1.23 3.57,1.023 5.672,-2.008 -9.164,-12.938 2.094,-24.672 1.141,-34.32 -1.578,-15.367 -10.984,-17.969 -10.984,-17.969 0,0 24.766,-0.109 19.578,-17.992 -5.234,-17.855 -18.094,-6.48 -26.516,-11.078 -8.422,-4.609 -8.219,-16.824 -21.188,-17.488 -18.359,-0.953 -42.852,11.504 -57.098,11.504 -4.426,-0.031 -3.852,0.695 -14.402,-2.082 -2.766,13.387 2.73,14.793 1.137,17.922 -2.961,5.848 -1.848,7.328 -1.848,7.328 l 1.566,0.031 c -0.43,2.066 -0.613,6.023 2.633,10.52 3.895,-5.375 5.184,-8.773 5.617,-10.375 l 1.078,0.031 c -0.176,2.457 -0.078,6.969 2.539,10.344 3.949,-3.551 5.324,-8.063 5.805,-10.199 h 0.227 c 0,0 8.98,-0.594 14.699,2.242 5.75,2.828 5.508,12.813 5.508,12.813 0,0 -15.586,-4.672 -22.289,-4.527 -9.504,0.176 -24.23,3.77 -33.168,1.898 -8.961,-1.883 -17.063,-13.355 -17.063,-13.355 0,0 -14.066,19.922 17.383,24.656 7.016,1.051 13.625,0.656 19.344,-0.164 0,0 14.984,-2.938 18.199,-3.336 3.18,-0.395 16.273,1.293 16.273,1.293 0,0 -0.734,4.242 -7.172,4.242 -2.14,0.008 -27.667,-0.441 -27.667,-0.441"
   id="path24"
   style="stroke:none" />
	<path
   fill="#010202"
   d="m 90.557,-181.811 c 6.898,-8.359 33.734,-2.84 21.406,17.043 -10.586,2.664 -11.632,-15.488 -21.406,-17.043"
   id="path26"
   style="stroke:none" />
	<path
   fill="#e8423f"
   d="m -22.083,-137.62 c 0,1.41 0.266,2.715 0.824,3.891 2.07,4.625 8.121,7.711 17.984,9.184 5.816,0.871 11.918,0.824 18.75,-0.16 0.105,-0.023 14.914,-2.922 18.246,-3.336 2.852,-0.352 11.813,0.68 15.508,1.137 0,0 1.18,0.152 1.609,0.207 0.18,-0.703 0.469,-1.992 0.602,-2.672 -0.422,-0.145 -1.734,-0.449 -1.734,-0.449 -3.414,-0.977 -15.109,-4.191 -20.406,-4.07 -3.367,0.07 -7.445,0.574 -11.773,1.113 -7.793,0.973 -15.84,2 -21.848,0.742 -7.016,-1.479 -13.371,-8.098 -16.336,-11.617 -0.708,1.624 -1.426,3.761 -1.426,6.03"
   id="path28"
   style="stroke:none" />
	<path
   fill="#e8423f"
   d="m 15.397,63.025 c 0,0 7.719,-2.125 19.113,1.875 1.508,2.531 4.477,6.859 6.602,11.547 C 36.721,71.822 15.397,63.025 15.397,63.025"
   id="path30"
   style="stroke:none" />
	<path
   fill="#e8423f"
   d="m -145.9,-55.788 c 4.754,2.02 10.418,5.203 12.871,7.984 0.859,-1.984 2.867,-4.816 3.609,-5.781 -2.398,-0.96 -10.726,-3.992 -16.48,-2.203"
   id="path32"
   style="stroke:none" />
	<path
   fill="#e8423f"
   d="m -146.787,-40.393 c 3.457,0.672 9.168,2.199 12.168,4.297 -0.063,-0.771 -0.121,-1.531 -0.121,-2.281 0,-1.816 0.191,-3.563 0.504,-5.266 -1.695,0 -10.015,0.137 -12.551,3.25"
   id="path34"
   style="stroke:none" />
	<path
   fill="#e8423f"
   d="m -137.869,-69.866 c 0.699,0.879 10.641,13.406 11.008,13.863 1.754,-1.344 5.715,-3.527 6.992,-4.23 -8.718,-8.258 -14.839,-9.68 -18,-9.633"
   id="path36"
   style="stroke:none" />
	<path
   fill="#e8423f"
   d="m -146.169,-22.346 c 1.414,-0.391 2.84,-0.832 4.551,-1.457 2.992,-1.094 6.094,-2.215 9.457,-2.16 -0.832,-1.918 -1.504,-4 -1.961,-6.184 -1.922,0.754 -11.649,4.816 -12.047,9.801"
   id="path38"
   style="stroke:none" />
	<path
   fill="#e8423f"
   d="m -116.365,-63.202 c 0,0.984 -0.133,1.703 -0.293,2.297 1.504,-0.168 6.359,-0.641 9.176,-0.328 -4.234,-11.715 -9.059,-16.176 -11.93,-17.871 1.223,4.375 3.047,11.574 3.047,15.902"
   id="path40"
   style="stroke:none" />
	<path
   fill="#e8423f"
   d="m 33.487,211.65 c 5.742,0.984 12.969,4.391 13.789,4.789 0,0 0.727,0.359 1.18,0.539 -0.031,-0.156 -0.031,-0.313 -0.031,-0.469 0,-3.125 1.016,-5.641 2.891,-7.547 -4.431,-0.765 -12.118,-1.265 -17.829,2.688"
   id="path42"
   style="stroke:none" />
	<path
   fill="#e8423f"
   d="m 51.081,230.478 v 0 c -0.078,0.047 -8.047,5.703 -8.391,13.688 6.273,-5.078 12.227,-6.984 13.688,-7.375 -0.922,-0.953 -1.75,-2.078 -2.555,-3.391 0.016,0.016 0,0.016 -1.203,-2.266 0,0 -0.508,-0.906 -0.688,-1.25 -0.164,0.094 -0.422,0.282 -0.851,0.594"
   id="path44"
   style="stroke:none" />
	<path
   fill="#e8423f"
   d="m 46.854,219.509 v 0 c -0.086,0.016 -9.164,2.188 -12.297,10.031 8.148,-2.875 15.445,-2.094 15.727,-2.031 0,0 0.406,0.031 0.719,0.078 -1.359,-2.906 -2.18,-5.734 -2.5,-8.438 -0.243,0.063 -0.735,0.157 -1.649,0.36"
   id="path46"
   style="stroke:none" />
	<path
   fill="#e8423f"
   d="m 70.471,245.197 c 0.023,0.031 0.023,0.078 0.023,0.078 1.109,7.219 4.539,11.148 6.672,12.547 0,-0.563 0,-1.625 0,-1.625 0,-2.984 0.391,-7.328 3.305,-11.172 -2.781,0.937 -6.273,1.016 -10,0.172"
   id="path48"
   style="stroke:none" />
	<path
   fill="#e8423f"
   d="m 58.659,239.142 c -0.039,0.063 -3.492,5.359 -3.492,10.805 0,1.625 0.359,3.063 0.961,4.359 2.859,-3.859 6.922,-9.25 11.039,-10.205 -3.102,-1.107 -6.055,-2.81 -8.508,-4.959"
   id="path50"
   style="stroke:none" />
	<path
   fill="#e8423f"
   d="m -89.955,-176.354 c 0,0 0.016,-0.008 0.016,-0.023 -1.391,-9.105 -4.902,-13.184 -7.418,-14.992 0.395,1.816 0.77,4.176 0.816,6.824 0.059,2.465 -0.168,5.137 -0.895,7.793 l -0.215,0.797 c 2.767,-0.751 5.415,-0.895 7.696,-0.399"
   id="path52"
   style="stroke:none" />
	<path
   fill="#e8423f"
   d="m -100.673,-176.385 c -4.121,-7.023 -8.426,-9.871 -11.402,-11.063 2.199,3.07 4.961,7.887 5.258,13.406 l 0.07,1.48 c 2.266,-1.168 4.535,-2.051 6.762,-2.648 z"
   id="path54"
   style="stroke:none" />
	<path
   fill="#e8423f"
   d="m -116.306,-167.467 c -6.863,-1.199 -11.051,-0.711 -13.52,0.02 3.063,0.758 7.262,2.109 10.895,4.438 l 0.574,0.375 c 0.977,-1.453 2.234,-2.934 3.691,-4.344 z"
   id="path56"
   style="stroke:none" />
	<path
   fill="#e8423f"
   d="m -119.869,-160.163 c -6.109,0.395 -8.887,2.242 -10.199,3.703 1.785,0 5.465,0.184 9.176,0.57 0.082,-1.359 0.457,-2.816 1.16,-4.289 z"
   id="path58"
   style="stroke:none" />
	<path
   fill="#e8423f"
   d="m -108.337,-171.659 -1.379,-1.16 c -4.293,-3.551 -8.535,-4.809 -11.656,-5.207 5.289,3.473 7.754,9.113 8.066,9.84 0.52,-0.527 2.734,-2.168 4.352,-3.137 0.191,-0.109 0.39,-0.215 0.617,-0.336"
   id="path60"
   style="stroke:none" />
	<path
   fill="#e8423f"
   d="m -93.345,199.994 -2.168,1.609 c -2.844,2.125 -5.113,5.969 -5.113,9.375 0,0.297 0.07,0.547 0.094,0.844 3.531,-2.5 8.152,-4.5 9.195,-4.938 l 2.871,-1.188 c -1.879,-1.671 -3.578,-3.585 -4.879,-5.702"
   id="path62"
   style="stroke:none" />
	<path
   fill="#e8423f"
   d="m -96.357,191.291 -2.848,1.406 c -7.199,3.656 -9.512,7.344 -10.207,9.711 2.922,-1.398 7.754,-3.297 12.762,-3.695 l 2.52,-0.18 c -0.105,-0.211 -0.242,-0.422 -0.336,-0.656 -0.946,-2.11 -1.571,-4.368 -1.891,-6.586"
   id="path64"
   style="stroke:none" />
	<path
   fill="#e8423f"
   d="m -96.244,182.9 -3.32,0.234 c -7.191,0.516 -10.598,3.297 -12.16,5.297 2.723,0.047 7.059,0.281 12.09,1.266 l 3.16,0.609 c -0.297,-2.539 -0.176,-5.094 0.23,-7.406"
   id="path66"
   style="stroke:none" />
	<path
   fill="#e8423f"
   d="m -89.138,209.009 c -1.129,2.594 -1.723,4.875 -1.723,6.859 0,1.484 0.371,2.766 0.977,3.938 4.617,-5.969 7.648,-8.203 10.113,-8.875 -2.801,-1.063 -5.602,-2.703 -8.09,-4.766 z"
   id="path68"
   style="stroke:none" />
	<path
   fill="#e8423f"
   d="m -109.306,176.291 c 2.375,0.703 5.926,1.875 10.305,3.75 l 3.094,1.328 c 0.648,-2.5 1.641,-4.703 2.953,-6.313 -8.727,-1.812 -13.809,-0.219 -16.352,1.235"
   id="path70"
   style="stroke:none" />
	<path
   fill="#e8423f"
   d="m 109.182,-142.034 c 0,0 -1.688,0.168 -1.594,1.215 0.102,1.066 1.359,1.234 1.359,1.234 0,0 6.836,1.848 8.563,-5.691 -1.148,3.602 -8.328,3.242 -8.328,3.242"
   id="path72"
   style="stroke:none" />
	<path
   fill="#e8423f"
   d="m 110.018,-147.561 c -0.578,-0.121 -2.359,0.84 -2.328,1.902 0.031,0.57 0.656,0.602 1.258,0.695 2.773,0.395 8.953,-4.504 6.195,-5.406 -1.125,-0.375 -1.375,3.032 -5.125,2.809"
   id="path74"
   style="stroke:none" />
	<path
   fill="#e8423f"
   d="m 78.213,-171.737 c -0.703,-0.695 -22.359,7.191 -22.82,11.063 -0.031,0.313 0.43,1.32 1.531,1.082 0.813,-0.168 11.563,-1.281 19.813,-0.84 3.172,0.176 6.031,0.879 7.703,1.535 2.234,0.848 5.344,0.52 5.477,-0.441 0.102,-0.984 -7.867,-3.254 -11.375,-3.535 -6.359,-0.535 -18.984,1.063 -18.984,1.063 0,0 19.64,-8.919 18.655,-9.927"
   id="path76"
   style="stroke:none" />
	<path
   fill="#ffffff"
   d="m 14.901,-144.338 c 0,1.398 0.273,3.16 1.266,5.145 2.117,-3.246 3.262,-5.816 3.742,-7.184 -1.77,-0.113 -3.496,0.031 -4.785,-0.055 -0.118,0.527 -0.223,1.238 -0.223,2.094"
   id="path78"
   style="stroke:none" />
	<path
   fill="#ffffff"
   d="m 24.42,-144.971 c 0,1.777 0.25,4.074 1.234,6.121 2.23,-2.641 3.285,-5.77 3.734,-7.527 -1.664,0 -3.391,-0.008 -4.914,-0.129 -0.03,0.449 -0.054,0.953 -0.054,1.535"
   id="path80"
   style="stroke:none" />
	<path
   fill="#ffffff"
   d="m -90.357,-125.827 c 4.473,-16.246 -7.07,-31.656 -6.863,-44.223 -3.734,9.52 1.922,19.695 3.914,29.816 2.191,11.063 1.512,20.168 -6.066,20.102 -1.422,0.035 -1.301,1.426 -0.488,1.41 6.64,-0.288 8.21,-3.234 9.503,-7.105"
   id="path82"
   style="stroke:none" />
	<path
   fill="#ffffff"
   d="m 76.198,-157.889 c 0.805,0.574 1.328,1.504 1.328,2.535 0,1.762 -1.461,3.16 -3.25,3.16 -1.82,0 -3.273,-1.398 -3.273,-3.16 0,-1.152 0.617,-2.129 1.586,-2.688 -2.953,0.633 -5.586,2.641 -5.586,3.734 0,1.289 3.617,4 7.156,4.121 3.375,0.121 6.703,-2.918 6.703,-3.926 -0.008,-0.807 -2.125,-2.968 -4.664,-3.776"
   id="path84"
   style="stroke:none" />
	<path
   fill="#010202"
   d="m 17.428,-127.124 c -0.672,1.242 -1.504,3.191 -1.504,5.402 0,2.398 0.93,4.453 2.711,5.969 l 0.402,0.328 h 7.383 l -1.52,-2.059 c -0.969,-1.277 -1.617,-2.895 -2.352,-4.711 -0.832,-2.168 -1.656,-4.031 -2.984,-5.266 l -1.305,-1.168 z"
   id="path86"
   style="stroke:none" />
	<path
   fill="#010202"
   d="m 26.924,-127.506 c -0.68,1.402 -1.512,3.711 -1.512,6.863 0,1.176 0.176,2.504 0.465,3.875 l 0.223,1.086 3.785,-0.16 c -0.023,0 3.406,-0.113 3.406,-0.113 l 2.414,-0.063 -1.344,-1.93 c -0.781,-1.133 -1.438,-2.629 -2.156,-4.23 -0.887,-2.047 -1.777,-4.016 -2.977,-5.551 l -1.336,-1.711 z"
   id="path88"
   style="stroke:none" />
	<path
   fill="#ffffff"
   d="m 21.292,-121.729 c -0.789,-1.945 -1.527,-3.738 -2.672,-4.793 -0.75,1.344 -1.336,3.023 -1.336,4.801 0,0.254 0.016,0.504 0.043,0.75 1.078,0.016 2.559,0.051 4.293,0.082 -0.118,-0.297 -0.223,-0.559 -0.328,-0.84"
   id="path90"
   style="stroke:none" />
	<path
   fill="#ffffff"
   d="m 30.999,-121.674 c -0.867,-1.895 -1.73,-3.832 -2.852,-5.281 -0.52,1.082 -1.324,3.195 -1.359,6.137 1.504,0.031 3.059,0.059 4.602,0.09 -0.145,-0.321 -0.266,-0.626 -0.391,-0.946"
   id="path92"
   style="stroke:none" />
	<path
   fill="#ffffff"
   d="M 33.362,-116.834 H 33.346 Z"
   id="path94"
   style="stroke:none" />
</g>
</svg>
