{
  "last_updated": "2022-08-09",
  "summary": "Der Kanton Neuenburg liegt mit 39 von 100 möglichen Punkten für den\r\nDigiPartIndex schweizweit auf Rang 9, also im Mittelfeld der Kantone,\r\nim tiefen Bereich der Skala. Im Vergleich zu letztem Jahr hat sich die\r\nPunktzahl um 10 Punkte verbessert, wodurch der Kanton 5 Plätze\r\naufgestiegen ist.\r\n\r\nIn den einzelnen Dimensionen Meinungsbildung, Mitwirkung und\r\nEntscheidung ist der Kanton relativ ausgeglichen. Für die Dimension\r\nMeinungsbildung (Diskutieren, Lernen, Monitoring) erzielt er einen\r\nWert von 45 (+3), für die Dimension Mitwirkung (Konsultieren,\r\nMeinung äussern) 28 (+15) und für die Dimension Entscheidung\r\n(Identifizierung, Abstimmen und Wählen) einen Wert von 48 (+/-0).\r\n\r\nFür die einzelnen Tools zeichnen sich jedoch kleinere Unterschiede ab.\r\nDie Spannbreite zwischen dem niedrigsten und höchsten Wert ist mit 30\r\nZählern eher hoch.",
  "tools": {
    "1": {
      "text": null
    },
    "2": {
      "text": null
    },
    "3": {
      "text": null
    },
    "4": {
      "text": null
    },
    "5": {
      "text": null
    },
    "6": {
      "text": null
    },
    "7": {
      "text": null
    }
  }
}
