{
  "last_updated": "2022-08-17",
  "summary": "Der Kanton Luzern liegt mit 43 von 100 möglichen Punkten für den\r\nDigiPartIndex schweizweit auf Rang 6, also in der Spitzengruppe der\r\nKantone, im mittleren Bereich der Skala. Im Vergleich zu letztem Jahr\r\nhat sich die Punktzahl um 1 Punkt verschlechtert, wodurch der Kanton 1\r\nPlatz abgerutscht ist.\r\n\r\nZwischen den einzelnen Dimensionen Meinungsbildung, Mitwirkung\r\nund Entscheidung gibt es durchaus Unterschiede. Für die Dimension\r\nMeinungsbildung (Diskutieren, Lernen, Monitoring) erzielt er einen\r\nWert von 60 (+1), für die Dimension Mitwirkung (Konsultieren,\r\nMeinung äussern) 53 (-7) und für die Dimension Entscheidung\r\n(Identifizierung, Abstimmen und Wählen) einen Wert von 25 (+/-0).\r\n\r\nFür die einzelnen Tools zeichnen sich jedoch erhebliche Unterschiede ab.\r\nDie Spannbreite zwischen dem niedrigsten und höchsten Wert ist mit 80\r\nZählern sehr hoch.",
  "tools": {
    "1": {
      "text": null
    },
    "2": {
      "text": null
    },
    "3": {
      "text": null
    },
    "4": {
      "text": null
    },
    "5": {
      "text": null
    },
    "6": {
      "text": null
    },
    "7": {
      "text": null
    }
  }
}
