{
  "last_updated": "2021-08-23",
  "summary": "Avec 30 points sur 100 pour le DigiPartIndex, le canton de Berne se classe au 10e rang de Suisse, c’est-à-dire dans la moyenne cantonale, mais à un niveau relativement bas dans l’index. Tous les cantons, y compris Berne, ont donc encore une grande marge de progression.\r\n\r\nIl existe des différences relativement importantes entre les dimensions individuelles « formation de l’opinion », « participation » et « prise de décision » dans le canton de Berne. Ce dernier a obtenu le score de 43 pour la dimension « formation de l’opinion » (discuter, apprendre, surveiller), 18 pour la dimension « participation » (consulter, donner son avis) et 35 pour la dimension « prise de décision » (s’identifier, voter et élire).\r\n\r\nCependant, il existe également des différences significatives entre les outils individuels. Avec 45 points d’écart, la fourchette entre la valeur la plus basse et celle la plus haute est relativement élevée.",
  "tools": {
    "1": {
      "text": "Le canton de Berne dispose de différents canaux sur les médias sociaux (Facebook en [allemand](https://www.facebook.com/ktbern/) et en [français](https://www.facebook.com/Cantondeberne/), Twitter en [allemand](https://twitter.com/kanton_bern) et en [français](https://twitter.com/cantondeberne?ref_src=twsrc%5Egoogle%7Ctwcamp%5Eserp%7Ctwgr%5Eauthor)), qui sont régulièrement utilisés. Les interactions entre le canton et les internautes sont occasionnelles. Le score est de 25. Avec un bonus pour l’utilisation de 5 points, le score final est de 30. Pour cet indicateur, le canton de Berne se place légèrement au-dessus de la moyenne générale qui est de 24,8 points."
    },
    "2": {
      "text": "Dans le canton de Berne, [VoteInfo](https://www.bfs.admin.ch/bfs/fr/home/statistiques/politique/votations/voteinfo.html) et [smartvote](https://smartvote.ch/fr/group/40/election/21_fr_leg/home?locale=fr_CH) sont à la disposition des citoyen·ne·s. Le score est donc de 50 points ce qui place Berne à peu près dans la moyenne cantonale qui est de 52,5."
    },
    "3": {
      "text": "Le canton de Berne fournit des [procès-verbaux](https://www.gr.be.ch/fr/start/sessionen.html) des séances du Grand Conseil, [des rapports du gouvernement](https://www.be.ch/fr/start.html) et d’importantes [statistiques](https://www.gsi.be.ch/fr/start/themen/statistiken.html) en ligne accessibles sous format PDF. Ces ressources ne sont pas traitées ultérieurement. Le score est donc de 50. Cela place le canton légèrement en dessous de la moyenne cantonale qui s’élève à 55,8."
    },
    "4": {
      "text": "Le canton de Berne ne propose pas d’outil digital pour les consultations. Des matériaux peuvent néanmoins être soumis par e-mail. Les consultations sont [régulières](https://www.be.ch/fr/start.html). Le score est de 0. Avec un bonus de 5 points pour l’utilisation, le score final est de 5. Avec cette note, Berne se situe bien en dessous de la moyenne générale des cantons qui est de 25,4 points."
    },
    "5": {
      "text": "Dans le canton de Berne, il existe plusieurs plateformes de pétitions en ligne privées non affiliées à un parti, qui sont occasionnellement utilisées (ex : [Petitio.ch,](https://www.petitio.ch/petitions/province/bern-71VLR?state=all) [OpenPetition](https://www.openpetition.eu/ch/region/petition/Bern_-_Berne)). Le score est de 25. Avec un bonus de 5 points pour la variété, le score final est de 30, ce qui place Berne légèrement au-dessus de la moyenne cantonale qui s’élève à 24,0."
    },
    "6": {
      "text": "Le canton de Berne dispose d’un [portail d’e-gouvernement](https://www.belogin.directories.be.ch/emaillogin/gui/faqpopup) sur lequel il est possible de s’inscrire sans vérification de l’identité. Le score est de 25, à savoir juste en dessous de la moyenne de tous les cantons qui est de 29,6 points."
    },
    "7": {
      "text": "Le canton ne dispose actuellement d’aucun e-vote. [Par le passé](https://www.sta.be.ch/fr/start/themen/wahlen-und-abstimmungen/e--voting.html), il était disponible pour les Suisse·sse·s de l’étranger et certains groupes pilotes. Le score est de 50. Avec un malus pour l’utilisation ainsi que pour les projets pilotes, et un bonus d’inclusion de 5 points chacun, le score final est de 45. Pour cet indicateur, le canton de Berne se place au-dessus de la moyenne générale qui est de 24,8 points."
    }
  }
}
