{
  "last_updated": "2022-08-24",
  "summary": "Der Kanton Thurgau liegt mit 40 von 100 möglichen Punkten für den\r\nDigiPartIndex schweizweit auf Rang 7, also in der Spitzengruppe der\r\nKantone, im mittleren Bereich der Skala. Im Vergleich zu letztem Jahr\r\nhat sich die Punktzahl um 1 Punkt verschlechtert. Trotzdem konnte der\r\nKanton um 1 Platz aufsteigen.\r\n\r\nZwischen den einzelnen Dimensionen Meinungsbildung, Mitwirkung\r\nund Entscheidung gibt es durchaus Unterschiede. Für die Dimension\r\nMeinungsbildung (Diskutieren, Lernen, Monitoring) erzielt er einen\r\nWert von 52 (+2), für die Dimension Mitwirkung (Konsultieren,\r\nMeinung äussern) 50 (-5) und für die Dimension Entscheidung\r\n(Identifizierung, Abstimmen und Wählen) einen Wert von 25 (+/-0).\r\n\r\nFür die einzelnen Tools zeichnen sich jedoch grosse Unterschiede ab.\r\nDie Spannbreite zwischen dem niedrigsten und höchsten Wert ist mit 75\r\nZählern sehr hoch.",
  "tools": {
    "1": {
      "text": null
    },
    "2": {
      "text": null
    },
    "3": {
      "text": null
    },
    "4": {
      "text": null
    },
    "5": {
      "text": null
    },
    "6": {
      "text": null
    },
    "7": {
      "text": null
    }
  }
}
