<svg xmlns="http://www.w3.org/2000/svg" xmlns:xlink="http://www.w3.org/1999/xlink" class="main-svg" width="100%" height="100%" style="" viewBox="17 26 684 454">
  <rect x="0" y="0" width="700" height="500" style="fill: rgb(0, 0, 0); fill-opacity: 0;"/>
  <defs id="defs-ef0a48">
    <g class="clips">
      <clipPath id="clipef0a48xyplot" class="plotclip">
        <rect width="630" height="394"/>
      </clipPath>
      <clipPath class="axesclip" id="clipef0a48x">
        <rect x="60" y="0" width="630" height="500"/>
      </clipPath>
      <clipPath class="axesclip" id="clipef0a48y">
        <rect x="0" y="25" width="700" height="394"/>
      </clipPath>
      <clipPath class="axesclip" id="clipef0a48xy">
        <rect x="60" y="25" width="630" height="394"/>
      </clipPath>
    </g>
    <g class="gradients"/>
    <g class="patterns"/>
  </defs>
  <g class="bglayer">
    <rect class="bg" x="60" y="25" width="630" height="394" style="fill: rgb(0, 0, 0); fill-opacity: 0; stroke-width: 0;"/>
  </g>
  <g class="layer-below">
    <g class="imagelayer"/>
    <g class="shapelayer"/>
  </g>
  <g class="cartesianlayer">
    <g class="subplot xy">
      <g class="layer-subplot">
        <g class="shapelayer"/>
        <g class="imagelayer"/>
      </g>
      <g class="gridlayer">
        <g class="x"/>
        <g class="y"/>
      </g>
      <g class="zerolinelayer">
        <path class="yzl zl crisp" transform="translate(0,419)" d="M60,0h630" style="stroke: rgb(68, 68, 68); stroke-opacity: 1; stroke-width: 1px;"/>
      </g>
      <path class="xlines-below"/>
      <path class="ylines-below"/>
      <g class="overlines-below"/>
      <g class="xaxislayer-below"/>
      <g class="yaxislayer-below"/>
      <g class="overaxes-below"/>
      <g class="plot" transform="translate(60,25)" clip-path="url(#clipef0a48xyplot)">
        <g class="scatterlayer mlayer">
          <g class="trace scatter trace00e29e" style="stroke-miterlimit: 2;">
            <g class="fills">
              <g>
                <path class="js-fill" d="M630,394L0.1,394L0.1,394L57.36,394L114.63,394L171.89,394L229.15,287.06L286.42,359.97L343.68,394L400.95,323.82L458.21,370.61L515.47,362.81L572.74,383.88L630,383.31" style="fill: rgb(31, 119, 180); fill-opacity: 0.5; stroke-width: 0;"/>
              </g>
              <g>
                <path class="js-fill" d="M0.1,394L57.36,206.85L114.63,206.85L171.89,244.28L229.15,233.59L286.42,223.86L343.68,113.28L400.95,136.67L458.21,300.43L515.47,258.84L572.74,242.26L630,233.59L630,383.31L572.74,383.88L515.47,362.81L458.21,370.61L400.95,323.82L343.68,394L286.42,359.97L229.15,287.06L171.89,394L114.63,394L57.36,394L0.1,394Z" style="fill: rgb(255, 127, 14); fill-opacity: 0.5; stroke-width: 0;"/>
              </g>
            </g>
            <g class="errorbars"/>
            <g class="lines"/>
            <g class="points"/>
            <g class="text"/>
          </g>
          <g class="trace scatter tracef5418d" style="stroke-miterlimit: 2;">
            <g class="fills">
              <g>
                <path class="js-fill" d="M0.1,19.7L57.36,19.7L114.63,19.7L171.89,57.13L229.15,73.17L286.42,53.73L343.68,19.7L400.95,43.09L458.21,43.09L515.47,92.48L572.74,60.16L630,73.17L630,233.59L572.74,242.26L515.47,258.84L458.21,300.43L400.95,136.67L343.68,113.28L286.42,223.86L229.15,233.59L171.89,244.28L114.63,206.85L57.36,206.85L0.1,394Z" style="fill: rgb(44, 160, 44); fill-opacity: 0.5; stroke-width: 0;"/>
              </g>
            </g>
            <g class="errorbars"/>
            <g class="lines"/>
            <g class="points"/>
            <g class="text"/>
          </g>
          <g class="trace scatter trace14c8d6" style="stroke-miterlimit: 2;">
            <g class="fills">
              <g>
                <path class="js-fill" d="M0.1,19.7L57.36,19.7L114.63,19.7L171.89,19.7L229.15,19.7L286.42,19.7L343.68,19.7L400.95,19.7L458.21,19.7L515.47,19.7L572.74,19.7L630,19.7L630,73.17L572.74,60.16L515.47,92.48L458.21,43.09L400.95,43.09L343.68,19.7L286.42,53.73L229.15,73.17L171.89,57.13L114.63,19.7L57.36,19.7L0.1,19.7Z" style="fill: rgb(214, 39, 40); fill-opacity: 0.5; stroke-width: 0;"/>
              </g>
            </g>
            <g class="errorbars"/>
            <g class="lines"/>
            <g class="points"/>
            <g class="text"/>
          </g>
          <g class="trace scatter trace19d675" style="stroke-miterlimit: 2;">
            <g class="fills"/>
            <g class="errorbars"/>
            <g class="lines"/>
            <g class="points"/>
            <g class="text"/>
          </g>
        </g>
      </g>
      <g class="overplot"/>
      <path class="xlines-above crisp" d="" style="fill: none; stroke-width: 1px; stroke: rgb(0, 0, 0); stroke-opacity: 0;"/>
      <path class="ylines-above crisp" d="M0,0" style="fill: none;"/>
      <g class="overlines-above"/>
      <g class="xaxislayer-above">
        <path class="xtick ticks crisp" d="M0,420v5" transform="translate(60.1,0)" style="stroke: rgb(68, 68, 68); stroke-opacity: 1; stroke-width: 1px;"/>
        <path class="xtick ticks crisp" d="M0,420v5" transform="translate(117.36,0)" style="stroke: rgb(68, 68, 68); stroke-opacity: 1; stroke-width: 1px;"/>
        <path class="xtick ticks crisp" d="M0,420v5" transform="translate(174.63,0)" style="stroke: rgb(68, 68, 68); stroke-opacity: 1; stroke-width: 1px;"/>
        <path class="xtick ticks crisp" d="M0,420v5" transform="translate(231.89,0)" style="stroke: rgb(68, 68, 68); stroke-opacity: 1; stroke-width: 1px;"/>
        <path class="xtick ticks crisp" d="M0,420v5" transform="translate(289.15,0)" style="stroke: rgb(68, 68, 68); stroke-opacity: 1; stroke-width: 1px;"/>
        <path class="xtick ticks crisp" d="M0,420v5" transform="translate(346.42,0)" style="stroke: rgb(68, 68, 68); stroke-opacity: 1; stroke-width: 1px;"/>
        <path class="xtick ticks crisp" d="M0,420v5" transform="translate(403.68,0)" style="stroke: rgb(68, 68, 68); stroke-opacity: 1; stroke-width: 1px;"/>
        <path class="xtick ticks crisp" d="M0,420v5" transform="translate(460.95,0)" style="stroke: rgb(68, 68, 68); stroke-opacity: 1; stroke-width: 1px;"/>
        <path class="xtick ticks crisp" d="M0,420v5" transform="translate(518.21,0)" style="stroke: rgb(68, 68, 68); stroke-opacity: 1; stroke-width: 1px;"/>
        <path class="xtick ticks crisp" d="M0,420v5" transform="translate(575.47,0)" style="stroke: rgb(68, 68, 68); stroke-opacity: 1; stroke-width: 1px;"/>
        <path class="xtick ticks crisp" d="M0,420v5" transform="translate(632.74,0)" style="stroke: rgb(68, 68, 68); stroke-opacity: 1; stroke-width: 1px;"/>
        <path class="xtick ticks crisp" d="M0,420v5" transform="translate(690,0)" style="stroke: rgb(68, 68, 68); stroke-opacity: 1; stroke-width: 1px;"/>
        <g class="xtick">
          <text text-anchor="middle" x="0" y="441.8" transform="translate(60.1,0)" style="font-family: 'Alegreya Sans', sans-serif; font-size: 14px; fill: rgb(68, 68, 68); fill-opacity: 1; white-space: pre; opacity: 1;">1900</text>
        </g>
        <g class="xtick">
          <text text-anchor="middle" x="0" y="441.8" style="font-family: 'Alegreya Sans', sans-serif; font-size: 14px; fill: rgb(68, 68, 68); fill-opacity: 1; white-space: pre; opacity: 1;" transform="translate(117.36,0)"> </text>
        </g>
        <g class="xtick">
          <text text-anchor="middle" x="0" y="441.8" style="font-family: 'Alegreya Sans', sans-serif; font-size: 14px; fill: rgb(68, 68, 68); fill-opacity: 1; white-space: pre; opacity: 1;" transform="translate(174.63,0)"> </text>
        </g>
        <g class="xtick">
          <text text-anchor="middle" x="0" y="441.8" style="font-family: 'Alegreya Sans', sans-serif; font-size: 14px; fill: rgb(68, 68, 68); fill-opacity: 1; white-space: pre; opacity: 1;" transform="translate(231.89,0)"> </text>
        </g>
        <g class="xtick">
          <text text-anchor="middle" x="0" y="441.8" style="font-family: 'Alegreya Sans', sans-serif; font-size: 14px; fill: rgb(68, 68, 68); fill-opacity: 1; white-space: pre; opacity: 1;" transform="translate(289.15,0)"> </text>
        </g>
        <g class="xtick">
          <text text-anchor="middle" x="0" y="441.8" style="font-family: 'Alegreya Sans', sans-serif; font-size: 14px; fill: rgb(68, 68, 68); fill-opacity: 1; white-space: pre; opacity: 1;" transform="translate(346.42,0)">1950</text>
        </g>
        <g class="xtick">
          <text text-anchor="middle" x="0" y="441.8" style="font-family: 'Alegreya Sans', sans-serif; font-size: 14px; fill: rgb(68, 68, 68); fill-opacity: 1; white-space: pre; opacity: 1;" transform="translate(403.68,0)"> </text>
        </g>
        <g class="xtick">
          <text text-anchor="middle" x="0" y="441.8" style="font-family: 'Alegreya Sans', sans-serif; font-size: 14px; fill: rgb(68, 68, 68); fill-opacity: 1; white-space: pre; opacity: 1;" transform="translate(460.95,0)"> </text>
        </g>
        <g class="xtick">
          <text text-anchor="middle" x="0" y="441.8" style="font-family: 'Alegreya Sans', sans-serif; font-size: 14px; fill: rgb(68, 68, 68); fill-opacity: 1; white-space: pre; opacity: 1;" transform="translate(518.21,0)"> </text>
        </g>
        <g class="xtick">
          <text text-anchor="middle" x="0" y="441.8" style="font-family: 'Alegreya Sans', sans-serif; font-size: 14px; fill: rgb(68, 68, 68); fill-opacity: 1; white-space: pre; opacity: 1;" transform="translate(575.47,0)"> </text>
        </g>
        <g class="xtick">
          <text text-anchor="middle" x="0" y="441.8" style="font-family: 'Alegreya Sans', sans-serif; font-size: 14px; fill: rgb(68, 68, 68); fill-opacity: 1; white-space: pre; opacity: 1;" transform="translate(632.74,0)">2000</text>
        </g>
        <g class="xtick">
          <text text-anchor="middle" x="0" y="441.8" style="font-family: 'Alegreya Sans', sans-serif; font-size: 14px; fill: rgb(68, 68, 68); fill-opacity: 1; white-space: pre; opacity: 1;" transform="translate(690,0)"> </text>
        </g>
      </g>
      <g class="yaxislayer-above">
        <g class="ytick">
          <text text-anchor="end" x="59" y="4.8999999999999995" transform="translate(0,419)" style="font-family: 'Alegreya Sans', sans-serif; font-size: 14px; fill: rgb(68, 68, 68); fill-opacity: 1; white-space: pre; opacity: 1;">0 % </text>
        </g>
        <g class="ytick">
          <text text-anchor="end" x="59" y="4.8999999999999995" style="font-family: 'Alegreya Sans', sans-serif; font-size: 14px; fill: rgb(68, 68, 68); fill-opacity: 1; white-space: pre; opacity: 1;" transform="translate(0,344.14)">20 % </text>
        </g>
        <g class="ytick">
          <text text-anchor="end" x="59" y="4.8999999999999995" style="font-family: 'Alegreya Sans', sans-serif; font-size: 14px; fill: rgb(68, 68, 68); fill-opacity: 1; white-space: pre; opacity: 1;" transform="translate(0,269.28)">40 % </text>
        </g>
        <g class="ytick">
          <text text-anchor="end" x="59" y="4.8999999999999995" style="font-family: 'Alegreya Sans', sans-serif; font-size: 14px; fill: rgb(68, 68, 68); fill-opacity: 1; white-space: pre; opacity: 1;" transform="translate(0,194.42)">60 % </text>
        </g>
        <g class="ytick">
          <text text-anchor="end" x="59" y="4.8999999999999995" style="font-family: 'Alegreya Sans', sans-serif; font-size: 14px; fill: rgb(68, 68, 68); fill-opacity: 1; white-space: pre; opacity: 1;" transform="translate(0,119.56)">80 % </text>
        </g>
        <g class="ytick">
          <text text-anchor="end" x="59" y="4.8999999999999995" style="font-family: 'Alegreya Sans', sans-serif; font-size: 14px; fill: rgb(68, 68, 68); fill-opacity: 1; white-space: pre; opacity: 1;" transform="translate(0,44.7)">100 % </text>
        </g>
      </g>
      <g class="overaxes-above"/>
    </g>
  </g>
  <g class="polarlayer"/>
  <g class="smithlayer"/>
  <g class="ternarylayer"/>
  <g class="geolayer"/>
  <g class="funnelarealayer"/>
  <g class="pielayer"/>
  <g class="iciclelayer"/>
  <g class="treemaplayer"/>
  <g class="sunburstlayer"/>
  <g class="glimages"/>
  <defs id="topdefs-ef0a48">
    <g class="clips"/>
    <clipPath id="legendef0a48">
      <rect width="503" height="32" x="0" y="0"/>
    </clipPath>
  </defs>
  <g class="layer-above">
    <g class="imagelayer"/>
    <g class="shapelayer">
      <path data-index="0" fill-rule="evenodd" d="M60.1,419L60.1,25" clip-path="url(#clipef0a48x)" style="opacity: 1; stroke: rgb(255, 255, 255); stroke-opacity: 1; fill: rgb(0, 0, 0); fill-opacity: 0; stroke-width: 0.2px;"/>
      <path data-index="1" fill-rule="evenodd" d="M346.42,419L346.42,25" clip-path="url(#clipef0a48x)" style="opacity: 1; stroke: rgb(255, 255, 255); stroke-opacity: 1; fill: rgb(0, 0, 0); fill-opacity: 0; stroke-width: 0.2px;"/>
      <path data-index="2" fill-rule="evenodd" d="M632.74,419L632.74,25" clip-path="url(#clipef0a48x)" style="opacity: 1; stroke: rgb(255, 255, 255); stroke-opacity: 1; fill: rgb(0, 0, 0); fill-opacity: 0; stroke-width: 0.2px;"/>
    </g>
  </g>
  <g class="infolayer">
    <g class="legend" pointer-events="all" transform="translate(60,458.40000000000003)">
      <rect class="bg" shape-rendering="crispEdges" style="stroke: rgb(68, 68, 68); stroke-opacity: 1; fill: rgb(0, 0, 0); fill-opacity: 0; stroke-width: 0px;" width="503" height="32" x="0" y="0"/>
      <g class="scrollbox" transform="" clip-path="url(#legendef0a48)">
        <g class="groups">
          <g class="traces" transform="translate(0,15.6)" style="opacity: 1;">
            <text class="legendtext" text-anchor="start" x="40" y="5.46" style="font-family: 'Alegreya Sans', sans-serif; font-size: 14px; fill: rgb(68, 68, 68); fill-opacity: 1; white-space: pre;">Central America</text>
            <g class="layers">
              <g class="legendfill">
                <path class="js-fill" d="M5,-3h30v6h-30z" style="stroke-width: 0; fill: rgb(214, 39, 40); fill-opacity: 0.5;"/>
              </g>
              <g class="legendlines"/>
              <g class="legendsymbols">
                <g class="legendpoints"/>
              </g>
            </g>
            <rect class="legendtoggle" x="0" y="-10.6" width="130.03125" height="21.2" style="fill: rgb(0, 0, 0); fill-opacity: 0;"/>
          </g>
          <g class="traces" transform="translate(132.53125,15.6)" style="opacity: 1;">
            <text class="legendtext" text-anchor="start" x="40" y="5.46" style="font-family: 'Alegreya Sans', sans-serif; font-size: 14px; fill: rgb(68, 68, 68); fill-opacity: 1; white-space: pre;">South America</text>
            <g class="layers">
              <g class="legendfill">
                <path class="js-fill" d="M5,-3h30v6h-30z" style="stroke-width: 0; fill: rgb(44, 160, 44); fill-opacity: 0.5;"/>
              </g>
              <g class="legendlines"/>
              <g class="legendsymbols">
                <g class="legendpoints"/>
              </g>
            </g>
            <rect class="legendtoggle" x="0" y="-10.6" width="122.671875" height="21.2" style="fill: rgb(0, 0, 0); fill-opacity: 0;"/>
          </g>
          <g class="traces" transform="translate(257.703125,15.6)" style="opacity: 1;">
            <text class="legendtext" text-anchor="start" x="40" y="5.46" style="font-family: 'Alegreya Sans', sans-serif; font-size: 14px; fill: rgb(68, 68, 68); fill-opacity: 1; white-space: pre;">Caribbean</text>
            <g class="layers">
              <g class="legendfill">
                <path class="js-fill" d="M5,-3h30v6h-30z" style="stroke-width: 0; fill: rgb(255, 127, 14); fill-opacity: 0.5;"/>
              </g>
              <g class="legendlines"/>
              <g class="legendsymbols">
                <g class="legendpoints"/>
              </g>
            </g>
            <rect class="legendtoggle" x="0" y="-10.6" width="98.421875" height="21.2" style="fill: rgb(0, 0, 0); fill-opacity: 0;"/>
          </g>
          <g class="traces" transform="translate(358.625,15.6)" style="opacity: 1;">
            <text class="legendtext" text-anchor="start" x="40" y="5.46" style="font-family: 'Alegreya Sans', sans-serif; font-size: 14px; fill: rgb(68, 68, 68); fill-opacity: 1; white-space: pre;">Northern America</text>
            <g class="layers">
              <g class="legendfill">
                <path class="js-fill" d="M5,-3h30v6h-30z" style="stroke-width: 0; fill: rgb(31, 119, 180); fill-opacity: 0.5;"/>
              </g>
              <g class="legendlines"/>
              <g class="legendsymbols">
                <g class="legendpoints"/>
              </g>
            </g>
            <rect class="legendtoggle" x="0" y="-10.6" width="141.0625" height="21.2" style="fill: rgb(0, 0, 0); fill-opacity: 0;"/>
          </g>
        </g>
      </g>
      <rect class="scrollbar" rx="20" ry="3" width="0" height="0" style="fill: rgb(128, 139, 164); fill-opacity: 1;" x="0" y="0"/>
    </g>
    <g class="g-gtitle"/>
    <g class="g-xtitle"/>
    <g class="g-ytitle"/>
  </g>
</svg>
