<?xml version='1.0' encoding='UTF-8' ?>
<svg xmlns='http://www.w3.org/2000/svg' xmlns:xlink='http://www.w3.org/1999/xlink' class='svglite' width='504.00pt' height='360.00pt' viewBox='0 0 504.00 360.00'>
<defs>
  <style type='text/css'><![CDATA[
    .svglite line, .svglite polyline, .svglite polygon, .svglite path, .svglite rect, .svglite circle {
      fill: none;
      stroke: #000000;
      stroke-linecap: round;
      stroke-linejoin: round;
      stroke-miterlimit: 10.00;
    }
    .svglite text {
      white-space: pre;
    }
  ]]></style>
</defs>
<rect width='100%' height='100%' style='stroke: none; fill: #F2F2F2;'/>
<defs>
  <clipPath id='cpMC4wMHw1MDQuMDB8MC4wMHwzNjAuMDA='>
    <rect x='0.00' y='0.00' width='504.00' height='360.00' />
  </clipPath>
</defs>
<g clip-path='url(#cpMC4wMHw1MDQuMDB8MC4wMHwzNjAuMDA=)'>
<rect x='0.00' y='0.00' width='504.00' height='360.00' style='stroke-width: 1.75; stroke: none; fill: #F2F2F2;' />
</g>
<defs>
  <clipPath id='cpNDEuNTh8NTA0LjAwfDAuMDB8MzM5Ljkx'>
    <rect x='41.58' y='0.000000000000057' width='462.42' height='339.91' />
  </clipPath>
</defs>
<g clip-path='url(#cpNDEuNTh8NTA0LjAwfDAuMDB8MzM5Ljkx)'>
<rect x='41.58' y='0.00' width='462.42' height='339.91' style='stroke-width: 1.75; stroke: none; fill: #F2F2F2;' />
<polyline points='41.58,285.83 504.00,285.83 ' style='stroke-width: 0.87; stroke: #D9D9D9; stroke-linecap: butt;' />
<polyline points='41.58,208.58 504.00,208.58 ' style='stroke-width: 0.87; stroke: #D9D9D9; stroke-linecap: butt;' />
<polyline points='41.58,131.33 504.00,131.33 ' style='stroke-width: 0.87; stroke: #D9D9D9; stroke-linecap: butt;' />
<polyline points='41.58,54.08 504.00,54.08 ' style='stroke-width: 0.87; stroke: #D9D9D9; stroke-linecap: butt;' />
<polyline points='109.31,339.91 109.31,0.000000000000057 ' style='stroke-width: 0.87; stroke: #D9D9D9; stroke-linecap: butt;' />
<polyline points='202.73,339.91 202.73,0.000000000000057 ' style='stroke-width: 0.87; stroke: #D9D9D9; stroke-linecap: butt;' />
<polyline points='296.14,339.91 296.14,0.000000000000057 ' style='stroke-width: 0.87; stroke: #D9D9D9; stroke-linecap: butt;' />
<polyline points='389.56,339.91 389.56,0.000000000000057 ' style='stroke-width: 0.87; stroke: #D9D9D9; stroke-linecap: butt;' />
<polyline points='482.98,339.91 482.98,0.000000000000057 ' style='stroke-width: 0.87; stroke: #D9D9D9; stroke-linecap: butt;' />
<polyline points='41.58,324.46 504.00,324.46 ' style='stroke-width: 1.75; stroke: #D9D9D9; stroke-linecap: butt;' />
<polyline points='41.58,247.20 504.00,247.20 ' style='stroke-width: 1.75; stroke: #D9D9D9; stroke-linecap: butt;' />
<polyline points='41.58,169.95 504.00,169.95 ' style='stroke-width: 1.75; stroke: #D9D9D9; stroke-linecap: butt;' />
<polyline points='41.58,92.70 504.00,92.70 ' style='stroke-width: 1.75; stroke: #D9D9D9; stroke-linecap: butt;' />
<polyline points='41.58,15.45 504.00,15.45 ' style='stroke-width: 1.75; stroke: #D9D9D9; stroke-linecap: butt;' />
<polyline points='62.60,339.91 62.60,0.000000000000057 ' style='stroke-width: 1.75; stroke: #D9D9D9; stroke-linecap: butt;' />
<polyline points='156.02,339.91 156.02,0.000000000000057 ' style='stroke-width: 1.75; stroke: #D9D9D9; stroke-linecap: butt;' />
<polyline points='249.43,339.91 249.43,0.000000000000057 ' style='stroke-width: 1.75; stroke: #D9D9D9; stroke-linecap: butt;' />
<polyline points='342.85,339.91 342.85,0.000000000000057 ' style='stroke-width: 1.75; stroke: #D9D9D9; stroke-linecap: butt;' />
<polyline points='436.27,339.91 436.27,0.000000000000057 ' style='stroke-width: 1.75; stroke: #D9D9D9; stroke-linecap: butt;' />
<polyline points='62.60,81.93 109.31,99.40 156.02,74.11 202.73,79.62 249.43,67.02 296.14,77.98 342.85,63.47 389.56,137.72 436.27,172.78 482.98,153.26 ' style='stroke-width: 2.13; stroke-linecap: butt;' />
<circle cx='62.60' cy='81.93' r='1.95' style='stroke-width: 0.71; fill: #000000;' />
<circle cx='109.31' cy='99.40' r='1.95' style='stroke-width: 0.71; fill: #000000;' />
<circle cx='156.02' cy='74.11' r='1.95' style='stroke-width: 0.71; fill: #000000;' />
<circle cx='202.73' cy='79.62' r='1.95' style='stroke-width: 0.71; fill: #000000;' />
<circle cx='249.43' cy='67.02' r='1.95' style='stroke-width: 0.71; fill: #000000;' />
<circle cx='296.14' cy='77.98' r='1.95' style='stroke-width: 0.71; fill: #000000;' />
<circle cx='342.85' cy='63.47' r='1.95' style='stroke-width: 0.71; fill: #000000;' />
<circle cx='389.56' cy='137.72' r='1.95' style='stroke-width: 0.71; fill: #000000;' />
<circle cx='436.27' cy='172.78' r='1.95' style='stroke-width: 0.71; fill: #000000;' />
<circle cx='482.98' cy='153.26' r='1.95' style='stroke-width: 0.71; fill: #000000;' />
</g>
<g clip-path='url(#cpMC4wMHw1MDQuMDB8MC4wMHwzNjAuMDA=)'>
<path d='M 16.44 321.81 L 16.44 321.81 L 16.73 321.82 L 17.00 321.85 L 17.26 321.90 L 17.50 321.97 L 17.73 322.05 L 17.95 322.16 L 18.16 322.28 L 18.35 322.42 L 18.53 322.58 L 18.69 322.76 L 18.69 322.76 L 18.84 322.96 L 18.98 323.17 L 19.10 323.40 L 19.21 323.64 L 19.30 323.90 L 19.37 324.18 L 19.43 324.47 L 19.47 324.78 L 19.49 325.10 L 19.50 325.44 L 19.50 325.44 L 19.49 325.79 L 19.46 326.12 L 19.42 326.44 L 19.36 326.74 L 19.29 327.03 L 19.20 327.29 L 19.09 327.55 L 18.96 327.78 L 18.82 328.00 L 18.66 328.21 L 18.66 328.21 L 18.49 328.39 L 18.30 328.55 L 18.10 328.70 L 17.88 328.82 L 17.65 328.93 L 17.41 329.02 L 17.15 329.09 L 16.88 329.13 L 16.60 329.16 L 16.30 329.17 L 16.30 329.17 L 16.01 329.16 L 15.74 329.13 L 15.48 329.09 L 15.23 329.02 L 15.00 328.94 L 14.78 328.84 L 14.57 328.71 L 14.37 328.57 L 14.19 328.41 L 14.03 328.24 L 14.03 328.24 L 13.88 328.04 L 13.74 327.83 L 13.62 327.60 L 13.52 327.36 L 13.43 327.11 L 13.36 326.83 L 13.30 326.54 L 13.27 326.24 L 13.24 325.92 L 13.23 325.59 L 13.23 325.59 L 13.24 325.23 L 13.27 324.89 L 13.31 324.57 L 13.37 324.27 L 13.44 323.98 L 13.53 323.71 L 13.64 323.46 L 13.77 323.22 L 13.91 323.00 L 14.07 322.79 L 14.07 322.79 L 14.24 322.61 L 14.43 322.44 L 14.63 322.29 L 14.85 322.17 L 15.08 322.06 L 15.33 321.97 L 15.58 321.90 L 15.86 321.85 L 16.14 321.82 L 16.44 321.81 ZM 16.34 322.86 L 16.34 322.86 L 16.13 322.87 L 15.93 322.89 L 15.74 322.92 L 15.55 322.97 L 15.38 323.03 L 15.22 323.10 L 15.07 323.19 L 14.93 323.29 L 14.81 323.40 L 14.69 323.53 L 14.69 323.53 L 14.58 323.67 L 14.49 323.82 L 14.41 323.98 L 14.34 324.16 L 14.28 324.35 L 14.23 324.56 L 14.19 324.77 L 14.16 325.00 L 14.15 325.24 L 14.14 325.50 L 14.14 325.50 L 14.15 325.76 L 14.16 326.00 L 14.19 326.24 L 14.23 326.46 L 14.28 326.66 L 14.34 326.86 L 14.42 327.04 L 14.50 327.20 L 14.60 327.36 L 14.70 327.50 L 14.70 327.50 L 14.82 327.63 L 14.95 327.74 L 15.09 327.84 L 15.24 327.93 L 15.40 328.00 L 15.57 328.06 L 15.75 328.10 L 15.94 328.14 L 16.14 328.16 L 16.36 328.16 L 16.36 328.16 L 16.57 328.16 L 16.77 328.14 L 16.97 328.11 L 17.15 328.06 L 17.32 328.00 L 17.48 327.93 L 17.63 327.85 L 17.77 327.75 L 17.90 327.64 L 18.01 327.52 L 18.01 327.52 L 18.12 327.38 L 18.22 327.23 L 18.31 327.06 L 18.38 326.89 L 18.45 326.70 L 18.50 326.50 L 18.54 326.29 L 18.57 326.06 L 18.58 325.82 L 18.59 325.57 L 18.59 325.57 L 18.58 325.31 L 18.57 325.06 L 18.54 324.83 L 18.50 324.61 L 18.45 324.40 L 18.38 324.20 L 18.31 324.02 L 18.22 323.85 L 18.12 323.70 L 18.01 323.56 L 18.01 323.56 L 17.90 323.42 L 17.77 323.31 L 17.63 323.20 L 17.48 323.11 L 17.32 323.04 L 17.14 322.98 L 16.96 322.93 L 16.77 322.89 L 16.56 322.87 L 16.34 322.86 Z' style='fill-rule: nonzero; fill: #343A40; stroke-width: 0.75; stroke: none;' />
<path d='M 30.92 319.60 L 31.00 319.80 L 24.21 330.38 L 23.70 330.09 L 23.63 329.92 L 30.41 319.31 L 30.92 319.60 ZM 24.41 319.77 L 24.41 319.77 L 24.60 319.78 L 24.78 319.79 L 24.95 319.83 L 25.12 319.87 L 25.27 319.93 L 25.42 320.00 L 25.55 320.09 L 25.68 320.18 L 25.80 320.29 L 25.91 320.42 L 25.91 320.42 L 26.01 320.55 L 26.10 320.69 L 26.18 320.85 L 26.25 321.01 L 26.31 321.19 L 26.35 321.38 L 26.39 321.58 L 26.42 321.79 L 26.43 322.01 L 26.44 322.25 L 26.44 322.25 L 26.43 322.50 L 26.42 322.73 L 26.39 322.96 L 26.35 323.17 L 26.30 323.38 L 26.24 323.57 L 26.16 323.74 L 26.08 323.91 L 25.98 324.06 L 25.88 324.20 L 25.88 324.20 L 25.76 324.33 L 25.63 324.44 L 25.50 324.54 L 25.35 324.63 L 25.19 324.70 L 25.03 324.76 L 24.85 324.81 L 24.66 324.84 L 24.47 324.86 L 24.26 324.87 L 24.26 324.87 L 24.07 324.86 L 23.89 324.84 L 23.72 324.81 L 23.55 324.77 L 23.40 324.71 L 23.25 324.64 L 23.11 324.56 L 22.98 324.46 L 22.86 324.35 L 22.75 324.23 L 22.75 324.23 L 22.65 324.10 L 22.56 323.95 L 22.48 323.79 L 22.41 323.62 L 22.35 323.44 L 22.30 323.25 L 22.27 323.05 L 22.24 322.84 L 22.22 322.61 L 22.22 322.38 L 22.22 322.38 L 22.22 322.13 L 22.24 321.89 L 22.27 321.67 L 22.31 321.46 L 22.36 321.26 L 22.42 321.07 L 22.49 320.90 L 22.58 320.73 L 22.67 320.58 L 22.78 320.45 L 22.78 320.45 L 22.90 320.32 L 23.03 320.20 L 23.16 320.10 L 23.31 320.01 L 23.47 319.94 L 23.64 319.88 L 23.81 319.83 L 24.00 319.80 L 24.20 319.78 L 24.41 319.77 ZM 24.32 320.62 L 24.32 320.62 L 24.08 320.64 L 23.86 320.69 L 23.66 320.77 L 23.49 320.89 L 23.35 321.04 L 23.23 321.22 L 23.14 321.44 L 23.08 321.70 L 23.04 321.98 L 23.03 322.30 L 23.03 322.30 L 23.04 322.64 L 23.08 322.94 L 23.14 323.21 L 23.24 323.44 L 23.35 323.63 L 23.50 323.79 L 23.67 323.91 L 23.86 324.00 L 24.09 324.06 L 24.34 324.07 L 24.34 324.07 L 24.58 324.06 L 24.81 324.01 L 25.00 323.92 L 25.17 323.80 L 25.32 323.65 L 25.44 323.46 L 25.53 323.24 L 25.59 322.99 L 25.63 322.70 L 25.65 322.38 L 25.65 322.38 L 25.63 322.04 L 25.59 321.74 L 25.53 321.48 L 25.43 321.25 L 25.32 321.06 L 25.17 320.90 L 25.00 320.78 L 24.80 320.69 L 24.57 320.64 L 24.32 320.62 ZM 30.89 324.05 L 30.89 324.05 L 31.08 324.05 L 31.26 324.07 L 31.43 324.10 L 31.60 324.15 L 31.75 324.20 L 31.90 324.27 L 32.03 324.36 L 32.16 324.45 L 32.28 324.56 L 32.39 324.68 L 32.39 324.68 L 32.49 324.81 L 32.58 324.96 L 32.66 325.11 L 32.73 325.28 L 32.79 325.45 L 32.83 325.64 L 32.87 325.84 L 32.90 326.05 L 32.91 326.27 L 32.92 326.51 L 32.92 326.51 L 32.91 326.76 L 32.90 327.00 L 32.87 327.22 L 32.83 327.44 L 32.78 327.64 L 32.72 327.83 L 32.64 328.01 L 32.56 328.17 L 32.46 328.32 L 32.36 328.47 L 32.36 328.47 L 32.24 328.59 L 32.12 328.70 L 31.98 328.80 L 31.84 328.89 L 31.68 328.96 L 31.51 329.02 L 31.34 329.07 L 31.15 329.10 L 30.95 329.12 L 30.74 329.13 L 30.74 329.13 L 30.55 329.12 L 30.37 329.10 L 30.20 329.07 L 30.03 329.03 L 29.88 328.97 L 29.73 328.90 L 29.59 328.82 L 29.46 328.72 L 29.34 328.62 L 29.23 328.50 L 29.23 328.50 L 29.13 328.36 L 29.04 328.21 L 28.96 328.06 L 28.89 327.89 L 28.83 327.71 L 28.78 327.52 L 28.75 327.32 L 28.72 327.11 L 28.70 326.89 L 28.70 326.65 L 28.70 326.65 L 28.70 326.40 L 28.72 326.17 L 28.75 325.95 L 28.79 325.73 L 28.84 325.54 L 28.90 325.35 L 28.97 325.17 L 29.06 325.01 L 29.15 324.86 L 29.26 324.72 L 29.26 324.72 L 29.38 324.59 L 29.51 324.48 L 29.64 324.38 L 29.79 324.29 L 29.95 324.21 L 30.12 324.15 L 30.29 324.11 L 30.48 324.07 L 30.68 324.05 L 30.89 324.05 ZM 30.80 324.88 L 30.80 324.88 L 30.56 324.90 L 30.34 324.95 L 30.14 325.03 L 29.97 325.15 L 29.83 325.31 L 29.71 325.49 L 29.62 325.71 L 29.56 325.97 L 29.52 326.26 L 29.51 326.58 L 29.51 326.58 L 29.52 326.91 L 29.56 327.21 L 29.62 327.48 L 29.72 327.70 L 29.83 327.90 L 29.98 328.06 L 30.15 328.18 L 30.34 328.27 L 30.57 328.32 L 30.82 328.34 L 30.82 328.34 L 31.06 328.32 L 31.29 328.27 L 31.48 328.18 L 31.65 328.06 L 31.80 327.91 L 31.92 327.73 L 32.01 327.50 L 32.07 327.25 L 32.11 326.96 L 32.13 326.64 L 32.13 326.64 L 32.11 326.30 L 32.07 326.01 L 32.01 325.74 L 31.91 325.51 L 31.80 325.32 L 31.65 325.16 L 31.48 325.04 L 31.28 324.95 L 31.05 324.90 L 30.80 324.88 Z' style='fill-rule: nonzero; fill: #343A40; stroke-width: 0.75; stroke: none;' />
<path d='M 10.90 244.59 L 10.90 244.59 L 11.07 244.60 L 11.23 244.61 L 11.39 244.63 L 11.54 244.66 L 11.69 244.70 L 11.82 244.75 L 11.96 244.81 L 12.08 244.88 L 12.20 244.95 L 12.31 245.04 L 12.31 245.04 L 12.42 245.13 L 12.51 245.22 L 12.60 245.32 L 12.67 245.43 L 12.73 245.54 L 12.78 245.66 L 12.82 245.78 L 12.85 245.91 L 12.87 246.05 L 12.87 246.19 L 12.87 246.19 L 12.87 246.31 L 12.86 246.43 L 12.84 246.55 L 12.81 246.67 L 12.77 246.80 L 12.73 246.93 L 12.68 247.07 L 12.62 247.20 L 12.55 247.34 L 12.47 247.49 L 12.47 247.49 L 12.39 247.63 L 12.29 247.78 L 12.19 247.94 L 12.07 248.10 L 11.95 248.27 L 11.82 248.45 L 11.67 248.63 L 11.52 248.82 L 11.36 249.01 L 11.19 249.21 L 9.73 250.87 L 9.76 250.93 L 12.43 250.93 L 13.64 250.84 L 13.72 250.91 L 13.56 251.88 L 12.10 251.82 L 8.87 251.82 L 8.34 251.85 L 8.27 251.79 L 8.27 251.07 L 10.27 248.90 L 10.27 248.90 L 10.42 248.73 L 10.56 248.56 L 10.70 248.41 L 10.82 248.25 L 10.94 248.11 L 11.05 247.97 L 11.15 247.84 L 11.24 247.71 L 11.33 247.59 L 11.40 247.47 L 11.40 247.47 L 11.47 247.36 L 11.53 247.25 L 11.59 247.14 L 11.64 247.03 L 11.67 246.93 L 11.71 246.83 L 11.73 246.74 L 11.75 246.64 L 11.76 246.55 L 11.76 246.46 L 11.76 246.46 L 11.76 246.39 L 11.75 246.31 L 11.74 246.24 L 11.72 246.17 L 11.69 246.11 L 11.66 246.05 L 11.62 245.99 L 11.58 245.93 L 11.53 245.88 L 11.48 245.83 L 11.48 245.83 L 11.42 245.78 L 11.35 245.74 L 11.28 245.70 L 11.21 245.66 L 11.13 245.63 L 11.05 245.61 L 10.96 245.59 L 10.87 245.58 L 10.77 245.57 L 10.67 245.57 L 10.67 245.57 L 10.57 245.57 L 10.46 245.58 L 10.36 245.59 L 10.26 245.61 L 10.15 245.63 L 10.05 245.66 L 9.94 245.70 L 9.84 245.74 L 9.74 245.78 L 9.63 245.83 L 9.63 245.83 L 9.53 245.88 L 9.44 245.94 L 9.34 246.00 L 9.24 246.07 L 9.15 246.14 L 9.06 246.21 L 8.97 246.29 L 8.88 246.37 L 8.80 246.46 L 8.71 246.55 L 8.57 246.55 L 8.38 245.67 L 8.38 245.67 L 8.49 245.57 L 8.61 245.47 L 8.73 245.38 L 8.84 245.30 L 8.96 245.21 L 9.09 245.14 L 9.21 245.07 L 9.33 245.00 L 9.46 244.94 L 9.59 244.88 L 9.59 244.88 L 9.72 244.82 L 9.85 244.78 L 9.98 244.73 L 10.11 244.69 L 10.24 244.66 L 10.37 244.64 L 10.50 244.62 L 10.64 244.60 L 10.77 244.59 L 10.90 244.59 Z' style='fill-rule: nonzero; fill: #343A40; stroke-width: 0.75; stroke: none;' />
<path d='M 19.54 244.68 L 19.43 245.58 L 19.34 245.67 L 18.29 245.58 L 16.16 245.58 L 16.10 247.83 L 17.01 248.02 L 17.01 248.02 L 17.27 248.08 L 17.51 248.14 L 17.74 248.21 L 17.95 248.29 L 18.15 248.37 L 18.33 248.46 L 18.50 248.55 L 18.65 248.64 L 18.79 248.75 L 18.91 248.85 L 18.91 248.85 L 19.01 248.97 L 19.11 249.09 L 19.19 249.21 L 19.27 249.35 L 19.33 249.49 L 19.38 249.63 L 19.42 249.79 L 19.45 249.95 L 19.46 250.12 L 19.47 250.29 L 19.47 250.29 L 19.46 250.46 L 19.45 250.63 L 19.43 250.79 L 19.40 250.95 L 19.36 251.11 L 19.31 251.26 L 19.25 251.40 L 19.18 251.55 L 19.11 251.69 L 19.02 251.82 L 19.02 251.82 L 18.93 251.95 L 18.84 252.07 L 18.73 252.19 L 18.62 252.30 L 18.50 252.41 L 18.37 252.51 L 18.24 252.61 L 18.10 252.70 L 17.95 252.78 L 17.80 252.86 L 17.80 252.86 L 17.64 252.93 L 17.48 252.99 L 17.31 253.05 L 17.14 253.10 L 16.97 253.14 L 16.79 253.17 L 16.60 253.20 L 16.42 253.22 L 16.22 253.23 L 16.03 253.23 L 16.03 253.23 L 15.90 253.23 L 15.78 253.23 L 15.65 253.22 L 15.52 253.21 L 15.39 253.19 L 15.25 253.18 L 15.11 253.16 L 14.97 253.14 L 14.82 253.11 L 14.67 253.09 L 14.59 252.08 L 14.69 251.98 L 14.69 251.98 L 14.85 252.04 L 15.01 252.10 L 15.17 252.15 L 15.33 252.20 L 15.48 252.24 L 15.64 252.27 L 15.80 252.29 L 15.95 252.31 L 16.10 252.32 L 16.26 252.32 L 16.26 252.32 L 16.45 252.32 L 16.63 252.30 L 16.81 252.28 L 16.98 252.24 L 17.14 252.20 L 17.29 252.14 L 17.43 252.08 L 17.57 252.00 L 17.69 251.92 L 17.81 251.82 L 17.81 251.82 L 17.92 251.71 L 18.02 251.60 L 18.11 251.48 L 18.18 251.36 L 18.24 251.23 L 18.30 251.09 L 18.34 250.95 L 18.37 250.80 L 18.38 250.64 L 18.39 250.48 L 18.39 250.48 L 18.38 250.35 L 18.37 250.23 L 18.35 250.12 L 18.32 250.00 L 18.28 249.90 L 18.23 249.80 L 18.17 249.70 L 18.10 249.61 L 18.03 249.52 L 17.94 249.44 L 17.94 249.44 L 17.85 249.37 L 17.75 249.30 L 17.63 249.23 L 17.51 249.16 L 17.37 249.11 L 17.22 249.05 L 17.06 249.00 L 16.89 248.95 L 16.71 248.91 L 16.52 248.87 L 15.29 248.64 L 15.19 248.54 L 15.26 244.78 L 15.45 244.62 L 16.21 244.65 L 18.16 244.65 L 19.48 244.59 L 19.54 244.68 Z' style='fill-rule: nonzero; fill: #343A40; stroke-width: 0.75; stroke: none;' />
<path d='M 30.92 242.34 L 31.00 242.55 L 24.21 253.13 L 23.70 252.84 L 23.63 252.67 L 30.41 242.06 L 30.92 242.34 ZM 24.41 242.52 L 24.41 242.52 L 24.60 242.52 L 24.78 242.54 L 24.95 242.58 L 25.12 242.62 L 25.27 242.68 L 25.42 242.75 L 25.55 242.83 L 25.68 242.93 L 25.80 243.04 L 25.91 243.17 L 25.91 243.17 L 26.01 243.30 L 26.10 243.44 L 26.18 243.60 L 26.25 243.76 L 26.31 243.94 L 26.35 244.13 L 26.39 244.33 L 26.42 244.54 L 26.43 244.76 L 26.44 244.99 L 26.44 244.99 L 26.43 245.24 L 26.42 245.48 L 26.39 245.71 L 26.35 245.92 L 26.30 246.12 L 26.24 246.31 L 26.16 246.49 L 26.08 246.66 L 25.98 246.81 L 25.88 246.95 L 25.88 246.95 L 25.76 247.08 L 25.63 247.19 L 25.50 247.29 L 25.35 247.38 L 25.19 247.45 L 25.03 247.51 L 24.85 247.56 L 24.66 247.59 L 24.47 247.61 L 24.26 247.61 L 24.26 247.61 L 24.07 247.61 L 23.89 247.59 L 23.72 247.56 L 23.55 247.51 L 23.40 247.46 L 23.25 247.39 L 23.11 247.30 L 22.98 247.21 L 22.86 247.10 L 22.75 246.98 L 22.75 246.98 L 22.65 246.85 L 22.56 246.70 L 22.48 246.54 L 22.41 246.37 L 22.35 246.19 L 22.30 246.00 L 22.27 245.80 L 22.24 245.59 L 22.22 245.36 L 22.22 245.12 L 22.22 245.12 L 22.22 244.88 L 22.24 244.64 L 22.27 244.42 L 22.31 244.21 L 22.36 244.01 L 22.42 243.82 L 22.49 243.65 L 22.58 243.48 L 22.67 243.33 L 22.78 243.19 L 22.78 243.19 L 22.90 243.07 L 23.03 242.95 L 23.16 242.85 L 23.31 242.76 L 23.47 242.69 L 23.64 242.63 L 23.81 242.58 L 24.00 242.54 L 24.20 242.52 L 24.41 242.52 ZM 24.32 243.37 L 24.32 243.37 L 24.08 243.38 L 23.86 243.43 L 23.66 243.52 L 23.49 243.64 L 23.35 243.79 L 23.23 243.97 L 23.14 244.19 L 23.08 244.45 L 23.04 244.73 L 23.03 245.05 L 23.03 245.05 L 23.04 245.39 L 23.08 245.69 L 23.14 245.96 L 23.24 246.19 L 23.35 246.38 L 23.50 246.54 L 23.67 246.66 L 23.86 246.75 L 24.09 246.81 L 24.34 246.82 L 24.34 246.82 L 24.58 246.81 L 24.81 246.75 L 25.00 246.67 L 25.17 246.55 L 25.32 246.40 L 25.44 246.21 L 25.53 245.99 L 25.59 245.74 L 25.63 245.45 L 25.65 245.12 L 25.65 245.12 L 25.63 244.79 L 25.59 244.49 L 25.53 244.23 L 25.43 244.00 L 25.32 243.81 L 25.17 243.65 L 25.00 243.53 L 24.80 243.44 L 24.57 243.38 L 24.32 243.37 ZM 30.89 246.79 L 30.89 246.79 L 31.08 246.80 L 31.26 246.82 L 31.43 246.85 L 31.60 246.90 L 31.75 246.95 L 31.90 247.02 L 32.03 247.10 L 32.16 247.20 L 32.28 247.31 L 32.39 247.43 L 32.39 247.43 L 32.49 247.56 L 32.58 247.70 L 32.66 247.86 L 32.73 248.02 L 32.79 248.20 L 32.83 248.39 L 32.87 248.59 L 32.90 248.80 L 32.91 249.02 L 32.92 249.26 L 32.92 249.26 L 32.91 249.51 L 32.90 249.75 L 32.87 249.97 L 32.83 250.19 L 32.78 250.39 L 32.72 250.58 L 32.64 250.75 L 32.56 250.92 L 32.46 251.07 L 32.36 251.21 L 32.36 251.21 L 32.24 251.34 L 32.12 251.45 L 31.98 251.55 L 31.84 251.64 L 31.68 251.71 L 31.51 251.77 L 31.34 251.82 L 31.15 251.85 L 30.95 251.87 L 30.74 251.88 L 30.74 251.88 L 30.55 251.87 L 30.37 251.85 L 30.20 251.82 L 30.03 251.78 L 29.88 251.72 L 29.73 251.65 L 29.59 251.57 L 29.46 251.47 L 29.34 251.36 L 29.23 251.24 L 29.23 251.24 L 29.13 251.11 L 29.04 250.96 L 28.96 250.81 L 28.89 250.64 L 28.83 250.46 L 28.78 250.27 L 28.75 250.07 L 28.72 249.86 L 28.70 249.63 L 28.70 249.40 L 28.70 249.40 L 28.70 249.15 L 28.72 248.92 L 28.75 248.69 L 28.79 248.48 L 28.84 248.28 L 28.90 248.10 L 28.97 247.92 L 29.06 247.76 L 29.15 247.61 L 29.26 247.47 L 29.26 247.47 L 29.38 247.34 L 29.51 247.23 L 29.64 247.13 L 29.79 247.04 L 29.95 246.96 L 30.12 246.90 L 30.29 246.86 L 30.48 246.82 L 30.68 246.80 L 30.89 246.79 ZM 30.80 247.63 L 30.80 247.63 L 30.56 247.65 L 30.34 247.70 L 30.14 247.78 L 29.97 247.90 L 29.83 248.05 L 29.71 248.24 L 29.62 248.46 L 29.56 248.72 L 29.52 249.01 L 29.51 249.33 L 29.51 249.33 L 29.52 249.66 L 29.56 249.96 L 29.62 250.22 L 29.72 250.45 L 29.83 250.65 L 29.98 250.80 L 30.15 250.93 L 30.34 251.02 L 30.57 251.07 L 30.82 251.09 L 30.82 251.09 L 31.06 251.07 L 31.29 251.02 L 31.48 250.93 L 31.65 250.81 L 31.80 250.66 L 31.92 250.47 L 32.01 250.25 L 32.07 250.00 L 32.11 249.71 L 32.13 249.39 L 32.13 249.39 L 32.11 249.05 L 32.07 248.75 L 32.01 248.49 L 31.91 248.26 L 31.80 248.07 L 31.65 247.91 L 31.48 247.79 L 31.28 247.70 L 31.05 247.65 L 30.80 247.63 Z' style='fill-rule: nonzero; fill: #343A40; stroke-width: 0.75; stroke: none;' />
<path d='M 11.94 167.43 L 11.82 168.33 L 11.74 168.42 L 10.68 168.33 L 8.55 168.33 L 8.50 170.58 L 9.40 170.77 L 9.40 170.77 L 9.66 170.83 L 9.91 170.89 L 10.14 170.96 L 10.35 171.04 L 10.55 171.12 L 10.73 171.21 L 10.90 171.30 L 11.05 171.39 L 11.18 171.50 L 11.30 171.60 L 11.30 171.60 L 11.41 171.71 L 11.51 171.83 L 11.59 171.96 L 11.66 172.09 L 11.73 172.24 L 11.78 172.38 L 11.82 172.54 L 11.84 172.70 L 11.86 172.87 L 11.87 173.04 L 11.87 173.04 L 11.86 173.21 L 11.85 173.38 L 11.83 173.54 L 11.79 173.70 L 11.75 173.86 L 11.70 174.01 L 11.65 174.15 L 11.58 174.30 L 11.50 174.43 L 11.42 174.57 L 11.42 174.57 L 11.33 174.70 L 11.23 174.82 L 11.13 174.94 L 11.02 175.05 L 10.90 175.16 L 10.77 175.26 L 10.64 175.35 L 10.50 175.44 L 10.35 175.53 L 10.20 175.61 L 10.20 175.61 L 10.04 175.68 L 9.88 175.74 L 9.71 175.80 L 9.54 175.84 L 9.36 175.89 L 9.18 175.92 L 9.00 175.95 L 8.81 175.96 L 8.62 175.98 L 8.42 175.98 L 8.42 175.98 L 8.30 175.98 L 8.18 175.97 L 8.05 175.97 L 7.92 175.96 L 7.78 175.94 L 7.65 175.93 L 7.51 175.91 L 7.36 175.89 L 7.22 175.86 L 7.07 175.84 L 6.98 174.83 L 7.08 174.73 L 7.08 174.73 L 7.25 174.79 L 7.41 174.85 L 7.56 174.90 L 7.72 174.95 L 7.88 174.99 L 8.04 175.02 L 8.19 175.04 L 8.35 175.06 L 8.50 175.07 L 8.65 175.07 L 8.65 175.07 L 8.85 175.07 L 9.03 175.05 L 9.21 175.03 L 9.37 174.99 L 9.53 174.95 L 9.68 174.89 L 9.83 174.83 L 9.96 174.75 L 10.09 174.66 L 10.21 174.57 L 10.21 174.57 L 10.32 174.46 L 10.42 174.35 L 10.50 174.23 L 10.58 174.11 L 10.64 173.97 L 10.69 173.84 L 10.73 173.69 L 10.76 173.55 L 10.78 173.39 L 10.79 173.23 L 10.79 173.23 L 10.78 173.10 L 10.77 172.98 L 10.75 172.86 L 10.71 172.75 L 10.67 172.65 L 10.62 172.54 L 10.57 172.45 L 10.50 172.36 L 10.42 172.27 L 10.34 172.19 L 10.34 172.19 L 10.25 172.12 L 10.14 172.04 L 10.03 171.98 L 9.90 171.91 L 9.77 171.85 L 9.62 171.80 L 9.46 171.75 L 9.29 171.70 L 9.11 171.66 L 8.91 171.62 L 7.69 171.39 L 7.59 171.29 L 7.66 167.53 L 7.85 167.37 L 8.61 167.40 L 10.56 167.40 L 11.88 167.34 L 11.94 167.43 Z' style='fill-rule: nonzero; fill: #343A40; stroke-width: 0.75; stroke: none;' />
<path d='M 16.44 167.31 L 16.44 167.31 L 16.73 167.32 L 17.00 167.35 L 17.26 167.40 L 17.50 167.46 L 17.73 167.55 L 17.95 167.65 L 18.16 167.78 L 18.35 167.92 L 18.53 168.08 L 18.69 168.26 L 18.69 168.26 L 18.84 168.46 L 18.98 168.67 L 19.10 168.90 L 19.21 169.14 L 19.30 169.40 L 19.37 169.67 L 19.43 169.97 L 19.47 170.27 L 19.49 170.60 L 19.50 170.94 L 19.50 170.94 L 19.49 171.29 L 19.46 171.62 L 19.42 171.94 L 19.36 172.24 L 19.29 172.52 L 19.20 172.79 L 19.09 173.04 L 18.96 173.28 L 18.82 173.50 L 18.66 173.70 L 18.66 173.70 L 18.49 173.89 L 18.30 174.05 L 18.10 174.20 L 17.88 174.32 L 17.65 174.43 L 17.41 174.51 L 17.15 174.58 L 16.88 174.63 L 16.60 174.66 L 16.30 174.67 L 16.30 174.67 L 16.01 174.66 L 15.74 174.63 L 15.48 174.58 L 15.23 174.52 L 15.00 174.44 L 14.78 174.33 L 14.57 174.21 L 14.37 174.07 L 14.19 173.91 L 14.03 173.73 L 14.03 173.73 L 13.88 173.54 L 13.74 173.33 L 13.62 173.10 L 13.52 172.86 L 13.43 172.60 L 13.36 172.33 L 13.30 172.04 L 13.27 171.74 L 13.24 171.42 L 13.23 171.08 L 13.23 171.08 L 13.24 170.73 L 13.27 170.39 L 13.31 170.07 L 13.37 169.77 L 13.44 169.48 L 13.53 169.21 L 13.64 168.95 L 13.77 168.72 L 13.91 168.49 L 14.07 168.29 L 14.07 168.29 L 14.24 168.10 L 14.43 167.94 L 14.63 167.79 L 14.85 167.66 L 15.08 167.56 L 15.33 167.47 L 15.58 167.40 L 15.86 167.35 L 16.14 167.32 L 16.44 167.31 ZM 16.34 168.36 L 16.34 168.36 L 16.13 168.37 L 15.93 168.39 L 15.74 168.42 L 15.55 168.47 L 15.38 168.53 L 15.22 168.60 L 15.07 168.69 L 14.93 168.79 L 14.81 168.90 L 14.69 169.02 L 14.69 169.02 L 14.58 169.16 L 14.49 169.32 L 14.41 169.48 L 14.34 169.66 L 14.28 169.85 L 14.23 170.05 L 14.19 170.27 L 14.16 170.50 L 14.15 170.74 L 14.14 171.00 L 14.14 171.00 L 14.15 171.26 L 14.16 171.50 L 14.19 171.73 L 14.23 171.95 L 14.28 172.16 L 14.34 172.35 L 14.42 172.53 L 14.50 172.70 L 14.60 172.86 L 14.70 173.00 L 14.70 173.00 L 14.82 173.12 L 14.95 173.24 L 15.09 173.34 L 15.24 173.42 L 15.40 173.50 L 15.57 173.56 L 15.75 173.60 L 15.94 173.63 L 16.14 173.65 L 16.36 173.66 L 16.36 173.66 L 16.57 173.65 L 16.77 173.64 L 16.97 173.60 L 17.15 173.56 L 17.32 173.50 L 17.48 173.43 L 17.63 173.34 L 17.77 173.25 L 17.90 173.14 L 18.01 173.01 L 18.01 173.01 L 18.12 172.87 L 18.22 172.72 L 18.31 172.56 L 18.38 172.38 L 18.45 172.20 L 18.50 172.00 L 18.54 171.78 L 18.57 171.56 L 18.58 171.32 L 18.59 171.07 L 18.59 171.07 L 18.58 170.81 L 18.57 170.56 L 18.54 170.33 L 18.50 170.10 L 18.45 169.90 L 18.38 169.70 L 18.31 169.52 L 18.22 169.35 L 18.12 169.20 L 18.01 169.05 L 18.01 169.05 L 17.90 168.92 L 17.77 168.80 L 17.63 168.70 L 17.48 168.61 L 17.32 168.53 L 17.14 168.47 L 16.96 168.42 L 16.77 168.39 L 16.56 168.37 L 16.34 168.36 Z' style='fill-rule: nonzero; fill: #343A40; stroke-width: 0.75; stroke: none;' />
<path d='M 30.92 165.09 L 31.00 165.29 L 24.21 175.88 L 23.70 175.59 L 23.63 175.42 L 30.41 164.81 L 30.92 165.09 ZM 24.41 165.27 L 24.41 165.27 L 24.60 165.27 L 24.78 165.29 L 24.95 165.32 L 25.12 165.37 L 25.27 165.43 L 25.42 165.50 L 25.55 165.58 L 25.68 165.68 L 25.80 165.79 L 25.91 165.91 L 25.91 165.91 L 26.01 166.05 L 26.10 166.19 L 26.18 166.34 L 26.25 166.51 L 26.31 166.69 L 26.35 166.88 L 26.39 167.08 L 26.42 167.29 L 26.43 167.51 L 26.44 167.74 L 26.44 167.74 L 26.43 167.99 L 26.42 168.23 L 26.39 168.46 L 26.35 168.67 L 26.30 168.87 L 26.24 169.06 L 26.16 169.24 L 26.08 169.41 L 25.98 169.56 L 25.88 169.70 L 25.88 169.70 L 25.76 169.83 L 25.63 169.94 L 25.50 170.04 L 25.35 170.13 L 25.19 170.20 L 25.03 170.26 L 24.85 170.30 L 24.66 170.34 L 24.47 170.36 L 24.26 170.36 L 24.26 170.36 L 24.07 170.36 L 23.89 170.34 L 23.72 170.31 L 23.55 170.26 L 23.40 170.21 L 23.25 170.14 L 23.11 170.05 L 22.98 169.96 L 22.86 169.85 L 22.75 169.73 L 22.75 169.73 L 22.65 169.59 L 22.56 169.45 L 22.48 169.29 L 22.41 169.12 L 22.35 168.94 L 22.30 168.75 L 22.27 168.55 L 22.24 168.33 L 22.22 168.11 L 22.22 167.87 L 22.22 167.87 L 22.22 167.62 L 22.24 167.39 L 22.27 167.17 L 22.31 166.96 L 22.36 166.76 L 22.42 166.57 L 22.49 166.39 L 22.58 166.23 L 22.67 166.08 L 22.78 165.94 L 22.78 165.94 L 22.90 165.81 L 23.03 165.70 L 23.16 165.60 L 23.31 165.51 L 23.47 165.44 L 23.64 165.37 L 23.81 165.33 L 24.00 165.29 L 24.20 165.27 L 24.41 165.27 ZM 24.32 166.12 L 24.32 166.12 L 24.08 166.13 L 23.86 166.18 L 23.66 166.27 L 23.49 166.39 L 23.35 166.54 L 23.23 166.72 L 23.14 166.94 L 23.08 167.19 L 23.04 167.48 L 23.03 167.80 L 23.03 167.80 L 23.04 168.14 L 23.08 168.44 L 23.14 168.70 L 23.24 168.93 L 23.35 169.13 L 23.50 169.29 L 23.67 169.41 L 23.86 169.50 L 24.09 169.55 L 24.34 169.57 L 24.34 169.57 L 24.58 169.55 L 24.81 169.50 L 25.00 169.42 L 25.17 169.30 L 25.32 169.15 L 25.44 168.96 L 25.53 168.74 L 25.59 168.48 L 25.63 168.20 L 25.65 167.87 L 25.65 167.87 L 25.63 167.54 L 25.59 167.24 L 25.53 166.98 L 25.43 166.75 L 25.32 166.55 L 25.17 166.40 L 25.00 166.27 L 24.80 166.19 L 24.57 166.13 L 24.32 166.12 ZM 30.89 169.54 L 30.89 169.54 L 31.08 169.55 L 31.26 169.57 L 31.43 169.60 L 31.60 169.64 L 31.75 169.70 L 31.90 169.77 L 32.03 169.85 L 32.16 169.95 L 32.28 170.06 L 32.39 170.18 L 32.39 170.18 L 32.49 170.31 L 32.58 170.45 L 32.66 170.61 L 32.73 170.77 L 32.79 170.95 L 32.83 171.14 L 32.87 171.34 L 32.90 171.55 L 32.91 171.77 L 32.92 172.01 L 32.92 172.01 L 32.91 172.26 L 32.90 172.49 L 32.87 172.72 L 32.83 172.93 L 32.78 173.14 L 32.72 173.33 L 32.64 173.50 L 32.56 173.67 L 32.46 173.82 L 32.36 173.96 L 32.36 173.96 L 32.24 174.09 L 32.12 174.20 L 31.98 174.30 L 31.84 174.39 L 31.68 174.46 L 31.51 174.52 L 31.34 174.57 L 31.15 174.60 L 30.95 174.62 L 30.74 174.63 L 30.74 174.63 L 30.55 174.62 L 30.37 174.60 L 30.20 174.57 L 30.03 174.52 L 29.88 174.47 L 29.73 174.40 L 29.59 174.32 L 29.46 174.22 L 29.34 174.11 L 29.23 173.99 L 29.23 173.99 L 29.13 173.86 L 29.04 173.71 L 28.96 173.55 L 28.89 173.39 L 28.83 173.21 L 28.78 173.02 L 28.75 172.82 L 28.72 172.61 L 28.70 172.38 L 28.70 172.15 L 28.70 172.15 L 28.70 171.90 L 28.72 171.67 L 28.75 171.44 L 28.79 171.23 L 28.84 171.03 L 28.90 170.85 L 28.97 170.67 L 29.06 170.51 L 29.15 170.36 L 29.26 170.22 L 29.26 170.22 L 29.38 170.09 L 29.51 169.98 L 29.64 169.87 L 29.79 169.79 L 29.95 169.71 L 30.12 169.65 L 30.29 169.60 L 30.48 169.57 L 30.68 169.55 L 30.89 169.54 ZM 30.80 170.38 L 30.80 170.38 L 30.56 170.39 L 30.34 170.45 L 30.14 170.53 L 29.97 170.65 L 29.83 170.80 L 29.71 170.99 L 29.62 171.21 L 29.56 171.47 L 29.52 171.75 L 29.51 172.08 L 29.51 172.08 L 29.52 172.41 L 29.56 172.71 L 29.62 172.97 L 29.72 173.20 L 29.83 173.39 L 29.98 173.55 L 30.15 173.68 L 30.34 173.76 L 30.57 173.82 L 30.82 173.83 L 30.82 173.83 L 31.06 173.82 L 31.29 173.77 L 31.48 173.68 L 31.65 173.56 L 31.80 173.41 L 31.92 173.22 L 32.01 173.00 L 32.07 172.75 L 32.11 172.46 L 32.13 172.13 L 32.13 172.13 L 32.11 171.80 L 32.07 171.50 L 32.01 171.24 L 31.91 171.01 L 31.80 170.82 L 31.65 170.66 L 31.48 170.54 L 31.28 170.45 L 31.05 170.40 L 30.80 170.38 Z' style='fill-rule: nonzero; fill: #343A40; stroke-width: 0.75; stroke: none;' />
<path d='M 9.82 90.15 L 13.12 90.15 L 13.72 90.12 L 13.74 90.97 L 10.94 97.07 L 10.30 98.79 L 9.37 98.53 L 9.30 98.34 L 12.66 91.10 L 9.62 91.10 L 8.52 91.21 L 8.45 91.08 L 8.52 90.10 L 9.82 90.15 Z' style='fill-rule: nonzero; fill: #343A40; stroke-width: 0.75; stroke: none;' />
<path d='M 19.54 90.17 L 19.43 91.08 L 19.34 91.17 L 18.29 91.08 L 16.16 91.08 L 16.10 93.33 L 17.01 93.52 L 17.01 93.52 L 17.27 93.58 L 17.51 93.64 L 17.74 93.71 L 17.95 93.79 L 18.15 93.87 L 18.33 93.95 L 18.50 94.05 L 18.65 94.14 L 18.79 94.24 L 18.91 94.35 L 18.91 94.35 L 19.01 94.46 L 19.11 94.58 L 19.19 94.71 L 19.27 94.84 L 19.33 94.98 L 19.38 95.13 L 19.42 95.29 L 19.45 95.45 L 19.46 95.62 L 19.47 95.79 L 19.47 95.79 L 19.46 95.96 L 19.45 96.13 L 19.43 96.29 L 19.40 96.45 L 19.36 96.60 L 19.31 96.75 L 19.25 96.90 L 19.18 97.04 L 19.11 97.18 L 19.02 97.32 L 19.02 97.32 L 18.93 97.45 L 18.84 97.57 L 18.73 97.69 L 18.62 97.80 L 18.50 97.91 L 18.37 98.01 L 18.24 98.10 L 18.10 98.19 L 17.95 98.28 L 17.80 98.35 L 17.80 98.35 L 17.64 98.42 L 17.48 98.49 L 17.31 98.54 L 17.14 98.59 L 16.97 98.63 L 16.79 98.67 L 16.60 98.69 L 16.42 98.71 L 16.22 98.72 L 16.03 98.73 L 16.03 98.73 L 15.90 98.73 L 15.78 98.72 L 15.65 98.72 L 15.52 98.71 L 15.39 98.69 L 15.25 98.68 L 15.11 98.66 L 14.97 98.64 L 14.82 98.61 L 14.67 98.58 L 14.59 97.58 L 14.69 97.48 L 14.69 97.48 L 14.85 97.54 L 15.01 97.60 L 15.17 97.65 L 15.33 97.70 L 15.48 97.73 L 15.64 97.77 L 15.80 97.79 L 15.95 97.81 L 16.10 97.82 L 16.26 97.82 L 16.26 97.82 L 16.45 97.82 L 16.63 97.80 L 16.81 97.78 L 16.98 97.74 L 17.14 97.69 L 17.29 97.64 L 17.43 97.57 L 17.57 97.50 L 17.69 97.41 L 17.81 97.32 L 17.81 97.32 L 17.92 97.21 L 18.02 97.10 L 18.11 96.98 L 18.18 96.85 L 18.24 96.72 L 18.30 96.59 L 18.34 96.44 L 18.37 96.29 L 18.38 96.14 L 18.39 95.98 L 18.39 95.98 L 18.38 95.85 L 18.37 95.73 L 18.35 95.61 L 18.32 95.50 L 18.28 95.39 L 18.23 95.29 L 18.17 95.20 L 18.10 95.11 L 18.03 95.02 L 17.94 94.94 L 17.94 94.94 L 17.85 94.87 L 17.75 94.79 L 17.63 94.73 L 17.51 94.66 L 17.37 94.60 L 17.22 94.55 L 17.06 94.50 L 16.89 94.45 L 16.71 94.40 L 16.52 94.36 L 15.29 94.13 L 15.19 94.03 L 15.26 90.28 L 15.45 90.12 L 16.21 90.15 L 18.16 90.15 L 19.48 90.09 L 19.54 90.17 Z' style='fill-rule: nonzero; fill: #343A40; stroke-width: 0.75; stroke: none;' />
<path d='M 30.92 87.84 L 31.00 88.04 L 24.21 98.63 L 23.70 98.34 L 23.63 98.17 L 30.41 87.55 L 30.92 87.84 ZM 24.41 88.01 L 24.41 88.01 L 24.60 88.02 L 24.78 88.04 L 24.95 88.07 L 25.12 88.12 L 25.27 88.18 L 25.42 88.25 L 25.55 88.33 L 25.68 88.43 L 25.80 88.54 L 25.91 88.66 L 25.91 88.66 L 26.01 88.79 L 26.10 88.94 L 26.18 89.09 L 26.25 89.26 L 26.31 89.44 L 26.35 89.63 L 26.39 89.82 L 26.42 90.04 L 26.43 90.26 L 26.44 90.49 L 26.44 90.49 L 26.43 90.74 L 26.42 90.98 L 26.39 91.21 L 26.35 91.42 L 26.30 91.62 L 26.24 91.81 L 26.16 91.99 L 26.08 92.15 L 25.98 92.31 L 25.88 92.45 L 25.88 92.45 L 25.76 92.58 L 25.63 92.69 L 25.50 92.79 L 25.35 92.87 L 25.19 92.95 L 25.03 93.01 L 24.85 93.05 L 24.66 93.09 L 24.47 93.11 L 24.26 93.11 L 24.26 93.11 L 24.07 93.11 L 23.89 93.09 L 23.72 93.06 L 23.55 93.01 L 23.40 92.95 L 23.25 92.88 L 23.11 92.80 L 22.98 92.71 L 22.86 92.60 L 22.75 92.48 L 22.75 92.48 L 22.65 92.34 L 22.56 92.20 L 22.48 92.04 L 22.41 91.87 L 22.35 91.69 L 22.30 91.50 L 22.27 91.30 L 22.24 91.08 L 22.22 90.86 L 22.22 90.62 L 22.22 90.62 L 22.22 90.37 L 22.24 90.14 L 22.27 89.92 L 22.31 89.70 L 22.36 89.50 L 22.42 89.32 L 22.49 89.14 L 22.58 88.98 L 22.67 88.83 L 22.78 88.69 L 22.78 88.69 L 22.90 88.56 L 23.03 88.45 L 23.16 88.35 L 23.31 88.26 L 23.47 88.18 L 23.64 88.12 L 23.81 88.08 L 24.00 88.04 L 24.20 88.02 L 24.41 88.01 ZM 24.32 88.86 L 24.32 88.86 L 24.08 88.88 L 23.86 88.93 L 23.66 89.02 L 23.49 89.13 L 23.35 89.29 L 23.23 89.47 L 23.14 89.69 L 23.08 89.94 L 23.04 90.23 L 23.03 90.55 L 23.03 90.55 L 23.04 90.89 L 23.08 91.19 L 23.14 91.45 L 23.24 91.68 L 23.35 91.88 L 23.50 92.04 L 23.67 92.16 L 23.86 92.25 L 24.09 92.30 L 24.34 92.32 L 24.34 92.32 L 24.58 92.30 L 24.81 92.25 L 25.00 92.17 L 25.17 92.05 L 25.32 91.90 L 25.44 91.71 L 25.53 91.49 L 25.59 91.23 L 25.63 90.94 L 25.65 90.62 L 25.65 90.62 L 25.63 90.29 L 25.59 89.99 L 25.53 89.72 L 25.43 89.50 L 25.32 89.30 L 25.17 89.15 L 25.00 89.02 L 24.80 88.93 L 24.57 88.88 L 24.32 88.86 ZM 30.89 92.29 L 30.89 92.29 L 31.08 92.30 L 31.26 92.32 L 31.43 92.35 L 31.60 92.39 L 31.75 92.45 L 31.90 92.52 L 32.03 92.60 L 32.16 92.70 L 32.28 92.80 L 32.39 92.92 L 32.39 92.92 L 32.49 93.06 L 32.58 93.20 L 32.66 93.36 L 32.73 93.52 L 32.79 93.70 L 32.83 93.89 L 32.87 94.09 L 32.90 94.30 L 32.91 94.52 L 32.92 94.75 L 32.92 94.75 L 32.91 95.00 L 32.90 95.24 L 32.87 95.47 L 32.83 95.68 L 32.78 95.88 L 32.72 96.07 L 32.64 96.25 L 32.56 96.42 L 32.46 96.57 L 32.36 96.71 L 32.36 96.71 L 32.24 96.84 L 32.12 96.95 L 31.98 97.05 L 31.84 97.14 L 31.68 97.21 L 31.51 97.27 L 31.34 97.31 L 31.15 97.35 L 30.95 97.37 L 30.74 97.37 L 30.74 97.37 L 30.55 97.37 L 30.37 97.35 L 30.20 97.32 L 30.03 97.27 L 29.88 97.22 L 29.73 97.15 L 29.59 97.06 L 29.46 96.97 L 29.34 96.86 L 29.23 96.74 L 29.23 96.74 L 29.13 96.61 L 29.04 96.46 L 28.96 96.30 L 28.89 96.13 L 28.83 95.96 L 28.78 95.77 L 28.75 95.57 L 28.72 95.35 L 28.70 95.13 L 28.70 94.90 L 28.70 94.90 L 28.70 94.65 L 28.72 94.42 L 28.75 94.19 L 28.79 93.98 L 28.84 93.78 L 28.90 93.59 L 28.97 93.42 L 29.06 93.26 L 29.15 93.11 L 29.26 92.97 L 29.26 92.97 L 29.38 92.84 L 29.51 92.72 L 29.64 92.62 L 29.79 92.53 L 29.95 92.46 L 30.12 92.40 L 30.29 92.35 L 30.48 92.32 L 30.68 92.30 L 30.89 92.29 ZM 30.80 93.13 L 30.80 93.13 L 30.56 93.14 L 30.34 93.19 L 30.14 93.28 L 29.97 93.40 L 29.83 93.55 L 29.71 93.74 L 29.62 93.96 L 29.56 94.21 L 29.52 94.50 L 29.51 94.83 L 29.51 94.83 L 29.52 95.16 L 29.56 95.46 L 29.62 95.72 L 29.72 95.95 L 29.83 96.14 L 29.98 96.30 L 30.15 96.42 L 30.34 96.51 L 30.57 96.56 L 30.82 96.58 L 30.82 96.58 L 31.06 96.57 L 31.29 96.51 L 31.48 96.43 L 31.65 96.31 L 31.80 96.16 L 31.92 95.97 L 32.01 95.75 L 32.07 95.50 L 32.11 95.21 L 32.13 94.88 L 32.13 94.88 L 32.11 94.55 L 32.07 94.25 L 32.01 93.99 L 31.91 93.76 L 31.80 93.57 L 31.65 93.41 L 31.48 93.28 L 31.28 93.20 L 31.05 93.14 L 30.80 93.13 Z' style='fill-rule: nonzero; fill: #343A40; stroke-width: 0.75; stroke: none;' />
<path d='M 3.24 12.95 L 3.17 17.08 L 3.23 20.07 L 2.07 20.07 L 2.15 17.23 L 2.13 14.15 L 0.27 14.67 L 0.16 14.61 L 0.16 13.70 L 3.07 12.84 L 3.24 12.95 Z' style='fill-rule: nonzero; fill: #343A40; stroke-width: 0.75; stroke: none;' />
<path d='M 8.84 12.81 L 8.84 12.81 L 9.13 12.82 L 9.40 12.85 L 9.65 12.89 L 9.90 12.96 L 10.13 13.05 L 10.35 13.15 L 10.55 13.27 L 10.74 13.42 L 10.92 13.58 L 11.09 13.76 L 11.09 13.76 L 11.24 13.95 L 11.38 14.16 L 11.50 14.39 L 11.60 14.64 L 11.69 14.90 L 11.77 15.17 L 11.82 15.46 L 11.86 15.77 L 11.89 16.10 L 11.89 16.44 L 11.89 16.44 L 11.89 16.79 L 11.86 17.12 L 11.82 17.44 L 11.76 17.74 L 11.69 18.02 L 11.59 18.29 L 11.49 18.54 L 11.36 18.78 L 11.22 19.00 L 11.06 19.20 L 11.06 19.20 L 10.89 19.38 L 10.70 19.55 L 10.50 19.69 L 10.28 19.82 L 10.05 19.93 L 9.81 20.01 L 9.55 20.08 L 9.28 20.13 L 9.00 20.16 L 8.70 20.17 L 8.70 20.17 L 8.41 20.16 L 8.14 20.13 L 7.88 20.08 L 7.63 20.02 L 7.39 19.93 L 7.17 19.83 L 6.97 19.71 L 6.77 19.57 L 6.59 19.41 L 6.42 19.23 L 6.42 19.23 L 6.27 19.04 L 6.14 18.82 L 6.02 18.60 L 5.92 18.36 L 5.83 18.10 L 5.76 17.83 L 5.70 17.54 L 5.66 17.24 L 5.64 16.92 L 5.63 16.58 L 5.63 16.58 L 5.64 16.23 L 5.66 15.89 L 5.71 15.57 L 5.76 15.26 L 5.84 14.98 L 5.93 14.70 L 6.04 14.45 L 6.16 14.21 L 6.31 13.99 L 6.47 13.79 L 6.47 13.79 L 6.64 13.60 L 6.83 13.43 L 7.03 13.29 L 7.25 13.16 L 7.48 13.05 L 7.72 12.96 L 7.98 12.90 L 8.25 12.85 L 8.54 12.82 L 8.84 12.81 ZM 8.74 13.86 L 8.74 13.86 L 8.53 13.87 L 8.32 13.89 L 8.13 13.92 L 7.95 13.97 L 7.78 14.02 L 7.62 14.10 L 7.47 14.18 L 7.33 14.28 L 7.20 14.40 L 7.08 14.52 L 7.08 14.52 L 6.98 14.66 L 6.89 14.81 L 6.81 14.98 L 6.73 15.16 L 6.67 15.35 L 6.63 15.55 L 6.59 15.77 L 6.56 16.00 L 6.54 16.24 L 6.54 16.49 L 6.54 16.49 L 6.54 16.75 L 6.56 17.00 L 6.59 17.23 L 6.63 17.45 L 6.68 17.66 L 6.74 17.85 L 6.81 18.03 L 6.90 18.20 L 6.99 18.35 L 7.10 18.50 L 7.10 18.50 L 7.22 18.62 L 7.35 18.73 L 7.48 18.83 L 7.63 18.92 L 7.79 18.99 L 7.96 19.05 L 8.15 19.10 L 8.34 19.13 L 8.54 19.15 L 8.76 19.16 L 8.76 19.16 L 8.97 19.15 L 9.17 19.13 L 9.36 19.10 L 9.55 19.05 L 9.72 19.00 L 9.88 18.93 L 10.03 18.84 L 10.17 18.74 L 10.29 18.63 L 10.41 18.51 L 10.41 18.51 L 10.52 18.37 L 10.62 18.22 L 10.70 18.06 L 10.78 17.88 L 10.84 17.69 L 10.90 17.49 L 10.94 17.28 L 10.96 17.05 L 10.98 16.82 L 10.99 16.57 L 10.99 16.57 L 10.98 16.31 L 10.96 16.06 L 10.94 15.82 L 10.90 15.60 L 10.84 15.39 L 10.78 15.20 L 10.70 15.02 L 10.62 14.85 L 10.52 14.69 L 10.41 14.55 L 10.41 14.55 L 10.29 14.42 L 10.16 14.30 L 10.02 14.20 L 9.87 14.11 L 9.71 14.03 L 9.54 13.97 L 9.36 13.92 L 9.16 13.89 L 8.96 13.87 L 8.74 13.86 Z' style='fill-rule: nonzero; fill: #343A40; stroke-width: 0.75; stroke: none;' />
<path d='M 16.44 12.81 L 16.44 12.81 L 16.73 12.82 L 17.00 12.85 L 17.26 12.89 L 17.50 12.96 L 17.73 13.05 L 17.95 13.15 L 18.16 13.27 L 18.35 13.42 L 18.53 13.58 L 18.69 13.76 L 18.69 13.76 L 18.84 13.95 L 18.98 14.16 L 19.10 14.39 L 19.21 14.64 L 19.30 14.90 L 19.37 15.17 L 19.43 15.46 L 19.47 15.77 L 19.49 16.10 L 19.50 16.44 L 19.50 16.44 L 19.49 16.79 L 19.46 17.12 L 19.42 17.44 L 19.36 17.74 L 19.29 18.02 L 19.20 18.29 L 19.09 18.54 L 18.96 18.78 L 18.82 19.00 L 18.66 19.20 L 18.66 19.20 L 18.49 19.38 L 18.30 19.55 L 18.10 19.69 L 17.88 19.82 L 17.65 19.93 L 17.41 20.01 L 17.15 20.08 L 16.88 20.13 L 16.60 20.16 L 16.30 20.17 L 16.30 20.17 L 16.01 20.16 L 15.74 20.13 L 15.48 20.08 L 15.23 20.02 L 15.00 19.93 L 14.78 19.83 L 14.57 19.71 L 14.37 19.57 L 14.19 19.41 L 14.03 19.23 L 14.03 19.23 L 13.88 19.04 L 13.74 18.82 L 13.62 18.60 L 13.52 18.36 L 13.43 18.10 L 13.36 17.83 L 13.30 17.54 L 13.27 17.24 L 13.24 16.92 L 13.23 16.58 L 13.23 16.58 L 13.24 16.23 L 13.27 15.89 L 13.31 15.57 L 13.37 15.26 L 13.44 14.98 L 13.53 14.70 L 13.64 14.45 L 13.77 14.21 L 13.91 13.99 L 14.07 13.79 L 14.07 13.79 L 14.24 13.60 L 14.43 13.43 L 14.63 13.29 L 14.85 13.16 L 15.08 13.05 L 15.33 12.96 L 15.58 12.90 L 15.86 12.85 L 16.14 12.82 L 16.44 12.81 ZM 16.34 13.86 L 16.34 13.86 L 16.13 13.87 L 15.93 13.89 L 15.74 13.92 L 15.55 13.97 L 15.38 14.02 L 15.22 14.10 L 15.07 14.18 L 14.93 14.28 L 14.81 14.40 L 14.69 14.52 L 14.69 14.52 L 14.58 14.66 L 14.49 14.81 L 14.41 14.98 L 14.34 15.16 L 14.28 15.35 L 14.23 15.55 L 14.19 15.77 L 14.16 16.00 L 14.15 16.24 L 14.14 16.49 L 14.14 16.49 L 14.15 16.75 L 14.16 17.00 L 14.19 17.23 L 14.23 17.45 L 14.28 17.66 L 14.34 17.85 L 14.42 18.03 L 14.50 18.20 L 14.60 18.35 L 14.70 18.50 L 14.70 18.50 L 14.82 18.62 L 14.95 18.73 L 15.09 18.83 L 15.24 18.92 L 15.40 18.99 L 15.57 19.05 L 15.75 19.10 L 15.94 19.13 L 16.14 19.15 L 16.36 19.16 L 16.36 19.16 L 16.57 19.15 L 16.77 19.13 L 16.97 19.10 L 17.15 19.05 L 17.32 19.00 L 17.48 18.93 L 17.63 18.84 L 17.77 18.74 L 17.90 18.63 L 18.01 18.51 L 18.01 18.51 L 18.12 18.37 L 18.22 18.22 L 18.31 18.06 L 18.38 17.88 L 18.45 17.69 L 18.50 17.49 L 18.54 17.28 L 18.57 17.05 L 18.58 16.82 L 18.59 16.57 L 18.59 16.57 L 18.58 16.31 L 18.57 16.06 L 18.54 15.82 L 18.50 15.60 L 18.45 15.39 L 18.38 15.20 L 18.31 15.02 L 18.22 14.85 L 18.12 14.69 L 18.01 14.55 L 18.01 14.55 L 17.90 14.42 L 17.77 14.30 L 17.63 14.20 L 17.48 14.11 L 17.32 14.03 L 17.14 13.97 L 16.96 13.92 L 16.77 13.89 L 16.56 13.87 L 16.34 13.86 Z' style='fill-rule: nonzero; fill: #343A40; stroke-width: 0.75; stroke: none;' />
<path d='M 30.92 10.59 L 31.00 10.79 L 24.21 21.38 L 23.70 21.09 L 23.63 20.92 L 30.41 10.30 L 30.92 10.59 ZM 24.41 10.76 L 24.41 10.76 L 24.60 10.77 L 24.78 10.79 L 24.95 10.82 L 25.12 10.87 L 25.27 10.93 L 25.42 11.00 L 25.55 11.08 L 25.68 11.18 L 25.80 11.29 L 25.91 11.41 L 25.91 11.41 L 26.01 11.54 L 26.10 11.69 L 26.18 11.84 L 26.25 12.01 L 26.31 12.19 L 26.35 12.37 L 26.39 12.57 L 26.42 12.78 L 26.43 13.01 L 26.44 13.24 L 26.44 13.24 L 26.43 13.49 L 26.42 13.73 L 26.39 13.95 L 26.35 14.17 L 26.30 14.37 L 26.24 14.56 L 26.16 14.74 L 26.08 14.90 L 25.98 15.06 L 25.88 15.20 L 25.88 15.20 L 25.76 15.32 L 25.63 15.44 L 25.50 15.54 L 25.35 15.62 L 25.19 15.70 L 25.03 15.75 L 24.85 15.80 L 24.66 15.83 L 24.47 15.85 L 24.26 15.86 L 24.26 15.86 L 24.07 15.85 L 23.89 15.84 L 23.72 15.80 L 23.55 15.76 L 23.40 15.70 L 23.25 15.63 L 23.11 15.55 L 22.98 15.46 L 22.86 15.35 L 22.75 15.23 L 22.75 15.23 L 22.65 15.09 L 22.56 14.95 L 22.48 14.79 L 22.41 14.62 L 22.35 14.44 L 22.30 14.25 L 22.27 14.04 L 22.24 13.83 L 22.22 13.61 L 22.22 13.37 L 22.22 13.37 L 22.22 13.12 L 22.24 12.89 L 22.27 12.66 L 22.31 12.45 L 22.36 12.25 L 22.42 12.07 L 22.49 11.89 L 22.58 11.73 L 22.67 11.58 L 22.78 11.44 L 22.78 11.44 L 22.90 11.31 L 23.03 11.20 L 23.16 11.09 L 23.31 11.01 L 23.47 10.93 L 23.64 10.87 L 23.81 10.82 L 24.00 10.79 L 24.20 10.77 L 24.41 10.76 ZM 24.32 11.61 L 24.32 11.61 L 24.08 11.63 L 23.86 11.68 L 23.66 11.76 L 23.49 11.88 L 23.35 12.03 L 23.23 12.22 L 23.14 12.44 L 23.08 12.69 L 23.04 12.98 L 23.03 13.30 L 23.03 13.30 L 23.04 13.63 L 23.08 13.94 L 23.14 14.20 L 23.24 14.43 L 23.35 14.63 L 23.50 14.79 L 23.67 14.91 L 23.86 15.00 L 24.09 15.05 L 24.34 15.07 L 24.34 15.07 L 24.58 15.05 L 24.81 15.00 L 25.00 14.92 L 25.17 14.80 L 25.32 14.64 L 25.44 14.46 L 25.53 14.24 L 25.59 13.98 L 25.63 13.69 L 25.65 13.37 L 25.65 13.37 L 25.63 13.04 L 25.59 12.74 L 25.53 12.47 L 25.43 12.25 L 25.32 12.05 L 25.17 11.89 L 25.00 11.77 L 24.80 11.68 L 24.57 11.63 L 24.32 11.61 ZM 30.89 15.04 L 30.89 15.04 L 31.08 15.05 L 31.26 15.07 L 31.43 15.10 L 31.60 15.14 L 31.75 15.20 L 31.90 15.27 L 32.03 15.35 L 32.16 15.45 L 32.28 15.55 L 32.39 15.67 L 32.39 15.67 L 32.49 15.81 L 32.58 15.95 L 32.66 16.10 L 32.73 16.27 L 32.79 16.45 L 32.83 16.64 L 32.87 16.84 L 32.90 17.05 L 32.91 17.27 L 32.92 17.50 L 32.92 17.50 L 32.91 17.75 L 32.90 17.99 L 32.87 18.22 L 32.83 18.43 L 32.78 18.63 L 32.72 18.82 L 32.64 19.00 L 32.56 19.17 L 32.46 19.32 L 32.36 19.46 L 32.36 19.46 L 32.24 19.59 L 32.12 19.70 L 31.98 19.80 L 31.84 19.88 L 31.68 19.96 L 31.51 20.02 L 31.34 20.06 L 31.15 20.10 L 30.95 20.12 L 30.74 20.12 L 30.74 20.12 L 30.55 20.12 L 30.37 20.10 L 30.20 20.07 L 30.03 20.02 L 29.88 19.96 L 29.73 19.89 L 29.59 19.81 L 29.46 19.72 L 29.34 19.61 L 29.23 19.49 L 29.23 19.49 L 29.13 19.35 L 29.04 19.21 L 28.96 19.05 L 28.89 18.88 L 28.83 18.70 L 28.78 18.51 L 28.75 18.31 L 28.72 18.10 L 28.70 17.88 L 28.70 17.65 L 28.70 17.65 L 28.70 17.40 L 28.72 17.16 L 28.75 16.94 L 28.79 16.73 L 28.84 16.53 L 28.90 16.34 L 28.97 16.17 L 29.06 16.01 L 29.15 15.86 L 29.26 15.72 L 29.26 15.72 L 29.38 15.59 L 29.51 15.47 L 29.64 15.37 L 29.79 15.28 L 29.95 15.21 L 30.12 15.15 L 30.29 15.10 L 30.48 15.07 L 30.68 15.05 L 30.89 15.04 ZM 30.80 15.88 L 30.80 15.88 L 30.56 15.89 L 30.34 15.94 L 30.14 16.03 L 29.97 16.15 L 29.83 16.30 L 29.71 16.49 L 29.62 16.71 L 29.56 16.96 L 29.52 17.25 L 29.51 17.57 L 29.51 17.57 L 29.52 17.91 L 29.56 18.21 L 29.62 18.47 L 29.72 18.70 L 29.83 18.89 L 29.98 19.05 L 30.15 19.17 L 30.34 19.26 L 30.57 19.31 L 30.82 19.33 L 30.82 19.33 L 31.06 19.31 L 31.29 19.26 L 31.48 19.18 L 31.65 19.06 L 31.80 18.91 L 31.92 18.72 L 32.01 18.50 L 32.07 18.24 L 32.11 17.95 L 32.13 17.63 L 32.13 17.63 L 32.11 17.30 L 32.07 17.00 L 32.01 16.74 L 31.91 16.51 L 31.80 16.31 L 31.65 16.16 L 31.48 16.03 L 31.28 15.95 L 31.05 15.89 L 30.80 15.88 Z' style='fill-rule: nonzero; fill: #343A40; stroke-width: 0.75; stroke: none;' />
<path d='M 52.90 350.09 L 52.83 354.23 L 52.88 357.21 L 51.73 357.21 L 51.80 354.37 L 51.79 351.29 L 49.93 351.81 L 49.82 351.75 L 49.82 350.84 L 52.73 349.98 L 52.90 350.09 Z' style='fill-rule: nonzero; fill: #343A40; stroke-width: 0.75; stroke: none;' />
<path d='M 57.54 355.05 L 57.54 355.05 L 57.32 355.04 L 57.12 355.02 L 56.93 354.99 L 56.75 354.94 L 56.57 354.88 L 56.41 354.81 L 56.25 354.72 L 56.10 354.62 L 55.97 354.51 L 55.84 354.38 L 55.84 354.38 L 55.72 354.25 L 55.62 354.10 L 55.53 353.95 L 55.45 353.78 L 55.38 353.61 L 55.33 353.43 L 55.29 353.24 L 55.26 353.04 L 55.24 352.83 L 55.23 352.61 L 55.23 352.61 L 55.24 352.38 L 55.26 352.15 L 55.30 351.94 L 55.35 351.73 L 55.42 351.53 L 55.50 351.34 L 55.60 351.16 L 55.71 350.99 L 55.84 350.82 L 55.98 350.67 L 55.98 350.67 L 56.14 350.52 L 56.30 350.39 L 56.48 350.28 L 56.67 350.18 L 56.87 350.10 L 57.08 350.03 L 57.30 349.97 L 57.54 349.94 L 57.78 349.91 L 58.04 349.91 L 58.04 349.91 L 58.30 349.91 L 58.54 349.94 L 58.78 349.98 L 59.00 350.04 L 59.20 350.11 L 59.40 350.20 L 59.58 350.31 L 59.75 350.43 L 59.90 350.57 L 60.04 350.73 L 60.04 350.73 L 60.17 350.90 L 60.29 351.08 L 60.39 351.28 L 60.47 351.49 L 60.55 351.72 L 60.61 351.96 L 60.66 352.21 L 60.69 352.48 L 60.71 352.76 L 60.72 353.06 L 60.72 353.06 L 60.71 353.42 L 60.67 353.78 L 60.62 354.12 L 60.54 354.46 L 60.44 354.79 L 60.31 355.11 L 60.17 355.43 L 60.00 355.74 L 59.81 356.04 L 59.60 356.33 L 59.60 356.33 L 59.36 356.61 L 59.11 356.88 L 58.85 357.13 L 58.56 357.38 L 58.26 357.61 L 57.93 357.83 L 57.59 358.03 L 57.23 358.23 L 56.85 358.41 L 56.46 358.57 L 56.38 358.57 L 55.49 358.06 L 55.49 357.94 L 55.49 357.94 L 55.83 357.82 L 56.15 357.69 L 56.46 357.56 L 56.75 357.42 L 57.03 357.28 L 57.29 357.13 L 57.54 356.98 L 57.77 356.83 L 57.98 356.67 L 58.18 356.50 L 58.18 356.50 L 58.37 356.33 L 58.55 356.15 L 58.71 355.97 L 58.86 355.78 L 59.00 355.59 L 59.13 355.38 L 59.24 355.18 L 59.34 354.96 L 59.42 354.74 L 59.49 354.51 L 59.41 354.41 L 59.41 354.41 L 59.23 354.53 L 59.06 354.64 L 58.88 354.74 L 58.69 354.82 L 58.51 354.89 L 58.32 354.95 L 58.13 354.99 L 57.93 355.02 L 57.74 355.04 L 57.54 355.05 ZM 57.95 350.70 L 57.95 350.70 L 57.80 350.70 L 57.65 350.72 L 57.50 350.74 L 57.37 350.77 L 57.24 350.81 L 57.12 350.86 L 57.00 350.92 L 56.89 350.99 L 56.79 351.07 L 56.70 351.16 L 56.70 351.16 L 56.62 351.25 L 56.54 351.35 L 56.47 351.46 L 56.42 351.58 L 56.37 351.71 L 56.33 351.84 L 56.29 351.98 L 56.27 352.13 L 56.26 352.29 L 56.25 352.45 L 56.25 352.45 L 56.26 352.62 L 56.27 352.77 L 56.29 352.92 L 56.32 353.06 L 56.36 353.20 L 56.40 353.32 L 56.46 353.44 L 56.52 353.55 L 56.59 353.65 L 56.67 353.75 L 56.67 353.75 L 56.76 353.84 L 56.85 353.91 L 56.95 353.98 L 57.06 354.04 L 57.18 354.09 L 57.30 354.13 L 57.43 354.16 L 57.56 354.18 L 57.70 354.19 L 57.85 354.20 L 57.85 354.20 L 58.04 354.19 L 58.23 354.17 L 58.42 354.13 L 58.60 354.08 L 58.78 354.01 L 58.96 353.93 L 59.14 353.83 L 59.32 353.72 L 59.49 353.59 L 59.67 353.45 L 59.67 353.45 L 59.67 353.42 L 59.67 353.39 L 59.67 353.36 L 59.68 353.32 L 59.68 353.29 L 59.68 353.25 L 59.68 353.20 L 59.68 353.16 L 59.68 353.11 L 59.68 353.06 L 59.68 353.06 L 59.68 352.83 L 59.66 352.61 L 59.64 352.40 L 59.61 352.21 L 59.58 352.03 L 59.53 351.85 L 59.48 351.70 L 59.41 351.55 L 59.34 351.41 L 59.26 351.29 L 59.26 351.29 L 59.18 351.18 L 59.08 351.08 L 58.97 350.99 L 58.85 350.91 L 58.73 350.85 L 58.59 350.79 L 58.45 350.75 L 58.29 350.72 L 58.13 350.70 L 57.95 350.70 Z' style='fill-rule: nonzero; fill: #343A40; stroke-width: 0.75; stroke: none;' />
<path d='M 64.69 349.98 L 64.69 349.98 L 64.86 349.98 L 65.03 350.00 L 65.18 350.02 L 65.33 350.05 L 65.48 350.09 L 65.62 350.14 L 65.75 350.20 L 65.87 350.26 L 65.99 350.34 L 66.10 350.42 L 66.10 350.42 L 66.21 350.51 L 66.31 350.61 L 66.39 350.71 L 66.46 350.82 L 66.53 350.93 L 66.58 351.05 L 66.62 351.17 L 66.64 351.30 L 66.66 351.43 L 66.67 351.58 L 66.67 351.58 L 66.66 351.69 L 66.65 351.81 L 66.63 351.93 L 66.60 352.06 L 66.56 352.19 L 66.52 352.32 L 66.47 352.45 L 66.41 352.59 L 66.34 352.73 L 66.26 352.87 L 66.26 352.87 L 66.18 353.02 L 66.08 353.17 L 65.98 353.32 L 65.86 353.49 L 65.74 353.66 L 65.61 353.83 L 65.47 354.02 L 65.31 354.20 L 65.15 354.40 L 64.98 354.60 L 63.53 356.26 L 63.56 356.31 L 66.22 356.31 L 67.43 356.23 L 67.52 356.30 L 67.36 357.26 L 65.89 357.21 L 62.66 357.21 L 62.13 357.24 L 62.06 357.18 L 62.06 356.46 L 64.06 354.28 L 64.06 354.28 L 64.21 354.11 L 64.35 353.95 L 64.49 353.79 L 64.61 353.64 L 64.73 353.49 L 64.84 353.36 L 64.94 353.22 L 65.04 353.09 L 65.12 352.97 L 65.20 352.86 L 65.20 352.86 L 65.27 352.74 L 65.33 352.63 L 65.38 352.52 L 65.43 352.42 L 65.47 352.32 L 65.50 352.22 L 65.52 352.12 L 65.54 352.03 L 65.55 351.94 L 65.56 351.85 L 65.56 351.85 L 65.55 351.77 L 65.55 351.70 L 65.53 351.63 L 65.51 351.56 L 65.48 351.50 L 65.45 351.43 L 65.42 351.38 L 65.37 351.32 L 65.32 351.27 L 65.27 351.22 L 65.27 351.22 L 65.21 351.17 L 65.14 351.12 L 65.08 351.08 L 65.00 351.05 L 64.92 351.02 L 64.84 351.00 L 64.75 350.98 L 64.66 350.97 L 64.56 350.96 L 64.46 350.96 L 64.46 350.96 L 64.36 350.96 L 64.26 350.97 L 64.15 350.98 L 64.05 351.00 L 63.94 351.02 L 63.84 351.05 L 63.74 351.08 L 63.63 351.12 L 63.53 351.17 L 63.43 351.22 L 63.43 351.22 L 63.33 351.27 L 63.23 351.33 L 63.13 351.39 L 63.04 351.46 L 62.94 351.53 L 62.85 351.60 L 62.76 351.68 L 62.67 351.76 L 62.59 351.85 L 62.50 351.94 L 62.36 351.94 L 62.17 351.06 L 62.17 351.06 L 62.29 350.96 L 62.40 350.86 L 62.52 350.77 L 62.64 350.68 L 62.76 350.60 L 62.88 350.52 L 63.00 350.45 L 63.13 350.38 L 63.25 350.32 L 63.38 350.27 L 63.38 350.27 L 63.51 350.21 L 63.64 350.16 L 63.77 350.12 L 63.90 350.08 L 64.03 350.05 L 64.17 350.02 L 64.30 350.00 L 64.43 349.99 L 64.56 349.98 L 64.69 349.98 Z' style='fill-rule: nonzero; fill: #343A40; stroke-width: 0.75; stroke: none;' />
<path d='M 71.82 349.95 L 71.82 349.95 L 72.11 349.96 L 72.38 349.99 L 72.63 350.03 L 72.88 350.10 L 73.11 350.19 L 73.33 350.29 L 73.53 350.41 L 73.72 350.56 L 73.90 350.72 L 74.07 350.90 L 74.07 350.90 L 74.22 351.09 L 74.36 351.31 L 74.48 351.53 L 74.58 351.78 L 74.67 352.04 L 74.74 352.31 L 74.80 352.60 L 74.84 352.91 L 74.87 353.24 L 74.87 353.58 L 74.87 353.58 L 74.87 353.93 L 74.84 354.26 L 74.80 354.58 L 74.74 354.88 L 74.66 355.16 L 74.57 355.43 L 74.46 355.68 L 74.34 355.92 L 74.20 356.14 L 74.04 356.34 L 74.04 356.34 L 73.86 356.53 L 73.68 356.69 L 73.48 356.83 L 73.26 356.96 L 73.03 357.07 L 72.79 357.15 L 72.53 357.22 L 72.26 357.27 L 71.98 357.30 L 71.68 357.31 L 71.68 357.31 L 71.39 357.30 L 71.12 357.27 L 70.86 357.22 L 70.61 357.16 L 70.37 357.07 L 70.15 356.97 L 69.95 356.85 L 69.75 356.71 L 69.57 356.55 L 69.40 356.37 L 69.40 356.37 L 69.25 356.18 L 69.12 355.97 L 69.00 355.74 L 68.89 355.50 L 68.81 355.24 L 68.74 354.97 L 68.68 354.68 L 68.64 354.38 L 68.62 354.06 L 68.61 353.72 L 68.61 353.72 L 68.62 353.37 L 68.64 353.03 L 68.68 352.71 L 68.74 352.40 L 68.82 352.12 L 68.91 351.84 L 69.02 351.59 L 69.14 351.35 L 69.29 351.13 L 69.44 350.93 L 69.44 350.93 L 69.62 350.74 L 69.81 350.58 L 70.01 350.43 L 70.23 350.30 L 70.46 350.19 L 70.70 350.11 L 70.96 350.04 L 71.23 349.99 L 71.52 349.96 L 71.82 349.95 ZM 71.72 351.00 L 71.72 351.00 L 71.51 351.01 L 71.30 351.03 L 71.11 351.06 L 70.93 351.11 L 70.76 351.17 L 70.60 351.24 L 70.45 351.32 L 70.31 351.42 L 70.18 351.54 L 70.06 351.66 L 70.06 351.66 L 69.96 351.80 L 69.87 351.95 L 69.79 352.12 L 69.71 352.30 L 69.65 352.49 L 69.60 352.69 L 69.57 352.91 L 69.54 353.14 L 69.52 353.38 L 69.52 353.64 L 69.52 353.64 L 69.52 353.89 L 69.54 354.14 L 69.57 354.37 L 69.61 354.59 L 69.66 354.80 L 69.72 354.99 L 69.79 355.17 L 69.88 355.34 L 69.97 355.49 L 70.08 355.64 L 70.08 355.64 L 70.20 355.76 L 70.32 355.88 L 70.46 355.97 L 70.61 356.06 L 70.77 356.13 L 70.94 356.19 L 71.13 356.24 L 71.32 356.27 L 71.52 356.29 L 71.73 356.30 L 71.73 356.30 L 71.95 356.29 L 72.15 356.27 L 72.34 356.24 L 72.52 356.20 L 72.70 356.14 L 72.86 356.07 L 73.01 355.98 L 73.14 355.88 L 73.27 355.77 L 73.39 355.65 L 73.39 355.65 L 73.50 355.51 L 73.60 355.36 L 73.68 355.20 L 73.76 355.02 L 73.82 354.83 L 73.87 354.63 L 73.91 354.42 L 73.94 354.20 L 73.96 353.96 L 73.97 353.71 L 73.97 353.71 L 73.96 353.45 L 73.94 353.20 L 73.91 352.96 L 73.87 352.74 L 73.82 352.53 L 73.76 352.34 L 73.68 352.16 L 73.60 351.99 L 73.50 351.83 L 73.39 351.69 L 73.39 351.69 L 73.27 351.56 L 73.14 351.44 L 73.00 351.34 L 72.85 351.25 L 72.69 351.17 L 72.52 351.11 L 72.34 351.06 L 72.14 351.03 L 71.94 351.01 L 71.72 351.00 Z' style='fill-rule: nonzero; fill: #343A40; stroke-width: 0.75; stroke: none;' />
<path d='M 146.13 350.09 L 146.06 354.23 L 146.12 357.21 L 144.96 357.21 L 145.04 354.37 L 145.02 351.29 L 143.16 351.81 L 143.05 351.75 L 143.05 350.84 L 145.96 349.98 L 146.13 350.09 Z' style='fill-rule: nonzero; fill: #343A40; stroke-width: 0.75; stroke: none;' />
<path d='M 150.77 355.05 L 150.77 355.05 L 150.56 355.04 L 150.35 355.02 L 150.16 354.99 L 149.98 354.94 L 149.80 354.88 L 149.64 354.81 L 149.48 354.72 L 149.33 354.62 L 149.20 354.51 L 149.07 354.38 L 149.07 354.38 L 148.95 354.25 L 148.85 354.10 L 148.76 353.95 L 148.68 353.78 L 148.61 353.61 L 148.56 353.43 L 148.52 353.24 L 148.49 353.04 L 148.47 352.83 L 148.46 352.61 L 148.46 352.61 L 148.47 352.38 L 148.49 352.15 L 148.53 351.94 L 148.58 351.73 L 148.65 351.53 L 148.73 351.34 L 148.83 351.16 L 148.94 350.99 L 149.07 350.82 L 149.21 350.67 L 149.21 350.67 L 149.37 350.52 L 149.53 350.39 L 149.71 350.28 L 149.90 350.18 L 150.10 350.10 L 150.31 350.03 L 150.54 349.97 L 150.77 349.94 L 151.01 349.91 L 151.27 349.91 L 151.27 349.91 L 151.53 349.91 L 151.78 349.94 L 152.01 349.98 L 152.23 350.04 L 152.43 350.11 L 152.63 350.20 L 152.81 350.31 L 152.98 350.43 L 153.13 350.57 L 153.27 350.73 L 153.27 350.73 L 153.40 350.90 L 153.52 351.08 L 153.62 351.28 L 153.71 351.49 L 153.78 351.72 L 153.84 351.96 L 153.89 352.21 L 153.92 352.48 L 153.94 352.76 L 153.95 353.06 L 153.95 353.06 L 153.94 353.42 L 153.90 353.78 L 153.85 354.12 L 153.77 354.46 L 153.67 354.79 L 153.55 355.11 L 153.40 355.43 L 153.23 355.74 L 153.04 356.04 L 152.83 356.33 L 152.83 356.33 L 152.60 356.61 L 152.35 356.88 L 152.08 357.13 L 151.79 357.38 L 151.49 357.61 L 151.16 357.83 L 150.82 358.03 L 150.46 358.23 L 150.08 358.41 L 149.69 358.57 L 149.62 358.57 L 148.72 358.06 L 148.72 357.94 L 148.72 357.94 L 149.06 357.82 L 149.38 357.69 L 149.69 357.56 L 149.98 357.42 L 150.26 357.28 L 150.52 357.13 L 150.77 356.98 L 151.00 356.83 L 151.21 356.67 L 151.42 356.50 L 151.42 356.50 L 151.60 356.33 L 151.78 356.15 L 151.94 355.97 L 152.10 355.78 L 152.23 355.59 L 152.36 355.38 L 152.47 355.18 L 152.57 354.96 L 152.65 354.74 L 152.73 354.51 L 152.64 354.41 L 152.64 354.41 L 152.47 354.53 L 152.29 354.64 L 152.11 354.74 L 151.93 354.82 L 151.74 354.89 L 151.55 354.95 L 151.36 354.99 L 151.16 355.02 L 150.97 355.04 L 150.77 355.05 ZM 151.18 350.70 L 151.18 350.70 L 151.03 350.70 L 150.88 350.72 L 150.73 350.74 L 150.60 350.77 L 150.47 350.81 L 150.35 350.86 L 150.23 350.92 L 150.13 350.99 L 150.03 351.07 L 149.93 351.16 L 149.93 351.16 L 149.85 351.25 L 149.77 351.35 L 149.70 351.46 L 149.65 351.58 L 149.60 351.71 L 149.56 351.84 L 149.53 351.98 L 149.50 352.13 L 149.49 352.29 L 149.49 352.45 L 149.49 352.45 L 149.49 352.62 L 149.50 352.77 L 149.52 352.92 L 149.55 353.06 L 149.59 353.20 L 149.64 353.32 L 149.69 353.44 L 149.75 353.55 L 149.82 353.65 L 149.90 353.75 L 149.90 353.75 L 149.99 353.84 L 150.08 353.91 L 150.19 353.98 L 150.29 354.04 L 150.41 354.09 L 150.53 354.13 L 150.66 354.16 L 150.79 354.18 L 150.93 354.19 L 151.08 354.20 L 151.08 354.20 L 151.27 354.19 L 151.46 354.17 L 151.65 354.13 L 151.83 354.08 L 152.01 354.01 L 152.19 353.93 L 152.37 353.83 L 152.55 353.72 L 152.72 353.59 L 152.90 353.45 L 152.90 353.45 L 152.90 353.42 L 152.90 353.39 L 152.91 353.36 L 152.91 353.32 L 152.91 353.29 L 152.91 353.25 L 152.91 353.20 L 152.91 353.16 L 152.91 353.11 L 152.91 353.06 L 152.91 353.06 L 152.91 352.83 L 152.90 352.61 L 152.88 352.40 L 152.85 352.21 L 152.81 352.03 L 152.76 351.85 L 152.71 351.70 L 152.65 351.55 L 152.57 351.41 L 152.50 351.29 L 152.50 351.29 L 152.41 351.18 L 152.31 351.08 L 152.20 350.99 L 152.09 350.91 L 151.96 350.85 L 151.82 350.79 L 151.68 350.75 L 151.52 350.72 L 151.36 350.70 L 151.18 350.70 Z' style='fill-rule: nonzero; fill: #343A40; stroke-width: 0.75; stroke: none;' />
<path d='M 159.68 356.10 L 159.65 356.10 L 159.70 358.44 L 159.62 358.53 L 158.76 358.60 L 158.69 358.52 L 158.72 356.10 L 156.02 356.10 L 155.07 356.13 L 155.00 356.01 L 155.00 355.28 L 158.62 350.04 L 159.67 350.04 L 159.64 355.20 L 160.99 355.20 L 161.08 355.32 L 161.01 356.13 L 159.68 356.10 ZM 158.73 355.20 L 158.73 351.42 L 158.63 351.42 L 156.01 355.20 L 158.73 355.20 Z' style='fill-rule: nonzero; fill: #343A40; stroke-width: 0.75; stroke: none;' />
<path d='M 165.43 349.95 L 165.43 349.95 L 165.71 349.96 L 165.98 349.99 L 166.24 350.03 L 166.48 350.10 L 166.72 350.19 L 166.93 350.29 L 167.14 350.41 L 167.33 350.56 L 167.51 350.72 L 167.67 350.90 L 167.67 350.90 L 167.83 351.09 L 167.96 351.31 L 168.08 351.53 L 168.19 351.78 L 168.28 352.04 L 168.35 352.31 L 168.41 352.60 L 168.45 352.91 L 168.47 353.24 L 168.48 353.58 L 168.48 353.58 L 168.47 353.93 L 168.45 354.26 L 168.40 354.58 L 168.35 354.88 L 168.27 355.16 L 168.18 355.43 L 168.07 355.68 L 167.94 355.92 L 167.80 356.14 L 167.64 356.34 L 167.64 356.34 L 167.47 356.53 L 167.28 356.69 L 167.08 356.83 L 166.87 356.96 L 166.64 357.07 L 166.39 357.15 L 166.14 357.22 L 165.87 357.27 L 165.58 357.30 L 165.28 357.31 L 165.28 357.31 L 165.00 357.30 L 164.72 357.27 L 164.46 357.22 L 164.21 357.16 L 163.98 357.07 L 163.76 356.97 L 163.55 356.85 L 163.36 356.71 L 163.18 356.55 L 163.01 356.37 L 163.01 356.37 L 162.86 356.18 L 162.72 355.97 L 162.60 355.74 L 162.50 355.50 L 162.41 355.24 L 162.34 354.97 L 162.29 354.68 L 162.25 354.38 L 162.22 354.06 L 162.22 353.72 L 162.22 353.72 L 162.22 353.37 L 162.25 353.03 L 162.29 352.71 L 162.35 352.40 L 162.42 352.12 L 162.52 351.84 L 162.62 351.59 L 162.75 351.35 L 162.89 351.13 L 163.05 350.93 L 163.05 350.93 L 163.22 350.74 L 163.41 350.58 L 163.62 350.43 L 163.83 350.30 L 164.06 350.19 L 164.31 350.11 L 164.57 350.04 L 164.84 349.99 L 165.13 349.96 L 165.43 349.95 ZM 165.33 351.00 L 165.33 351.00 L 165.11 351.01 L 164.91 351.03 L 164.72 351.06 L 164.54 351.11 L 164.36 351.17 L 164.20 351.24 L 164.05 351.32 L 163.92 351.42 L 163.79 351.54 L 163.67 351.66 L 163.67 351.66 L 163.57 351.80 L 163.47 351.95 L 163.39 352.12 L 163.32 352.30 L 163.26 352.49 L 163.21 352.69 L 163.17 352.91 L 163.14 353.14 L 163.13 353.38 L 163.12 353.64 L 163.12 353.64 L 163.13 353.89 L 163.15 354.14 L 163.17 354.37 L 163.21 354.59 L 163.26 354.80 L 163.32 354.99 L 163.40 355.17 L 163.48 355.34 L 163.58 355.49 L 163.68 355.64 L 163.68 355.64 L 163.80 355.76 L 163.93 355.88 L 164.07 355.97 L 164.22 356.06 L 164.38 356.13 L 164.55 356.19 L 164.73 356.24 L 164.92 356.27 L 165.13 356.29 L 165.34 356.30 L 165.34 356.30 L 165.55 356.29 L 165.76 356.27 L 165.95 356.24 L 166.13 356.20 L 166.30 356.14 L 166.46 356.07 L 166.61 355.98 L 166.75 355.88 L 166.88 355.77 L 167.00 355.65 L 167.00 355.65 L 167.11 355.51 L 167.20 355.36 L 167.29 355.20 L 167.36 355.02 L 167.43 354.83 L 167.48 354.63 L 167.52 354.42 L 167.55 354.20 L 167.57 353.96 L 167.57 353.71 L 167.57 353.71 L 167.57 353.45 L 167.55 353.20 L 167.52 352.96 L 167.48 352.74 L 167.43 352.53 L 167.36 352.34 L 167.29 352.16 L 167.20 351.99 L 167.11 351.83 L 167.00 351.69 L 167.00 351.69 L 166.88 351.56 L 166.75 351.44 L 166.61 351.34 L 166.46 351.25 L 166.30 351.17 L 166.13 351.11 L 165.94 351.06 L 165.75 351.03 L 165.54 351.01 L 165.33 351.00 Z' style='fill-rule: nonzero; fill: #343A40; stroke-width: 0.75; stroke: none;' />
<path d='M 239.63 350.09 L 239.56 354.23 L 239.61 357.21 L 238.46 357.21 L 238.53 354.37 L 238.52 351.29 L 236.66 351.81 L 236.55 351.75 L 236.55 350.84 L 239.46 349.98 L 239.63 350.09 Z' style='fill-rule: nonzero; fill: #343A40; stroke-width: 0.75; stroke: none;' />
<path d='M 244.27 355.05 L 244.27 355.05 L 244.05 355.04 L 243.85 355.02 L 243.66 354.99 L 243.47 354.94 L 243.30 354.88 L 243.13 354.81 L 242.98 354.72 L 242.83 354.62 L 242.69 354.51 L 242.57 354.38 L 242.57 354.38 L 242.45 354.25 L 242.35 354.10 L 242.26 353.95 L 242.18 353.78 L 242.11 353.61 L 242.06 353.43 L 242.02 353.24 L 241.99 353.04 L 241.97 352.83 L 241.96 352.61 L 241.96 352.61 L 241.97 352.38 L 241.99 352.15 L 242.03 351.94 L 242.08 351.73 L 242.15 351.53 L 242.23 351.34 L 242.33 351.16 L 242.44 350.99 L 242.57 350.82 L 242.71 350.67 L 242.71 350.67 L 242.87 350.52 L 243.03 350.39 L 243.21 350.28 L 243.40 350.18 L 243.60 350.10 L 243.81 350.03 L 244.03 349.97 L 244.27 349.94 L 244.51 349.91 L 244.77 349.91 L 244.77 349.91 L 245.03 349.91 L 245.27 349.94 L 245.51 349.98 L 245.73 350.04 L 245.93 350.11 L 246.13 350.20 L 246.31 350.31 L 246.47 350.43 L 246.63 350.57 L 246.77 350.73 L 246.77 350.73 L 246.90 350.90 L 247.01 351.08 L 247.12 351.28 L 247.20 351.49 L 247.28 351.72 L 247.34 351.96 L 247.39 352.21 L 247.42 352.48 L 247.44 352.76 L 247.45 353.06 L 247.45 353.06 L 247.44 353.42 L 247.40 353.78 L 247.35 354.12 L 247.27 354.46 L 247.17 354.79 L 247.04 355.11 L 246.90 355.43 L 246.73 355.74 L 246.54 356.04 L 246.32 356.33 L 246.32 356.33 L 246.09 356.61 L 245.84 356.88 L 245.58 357.13 L 245.29 357.38 L 244.99 357.61 L 244.66 357.83 L 244.32 358.03 L 243.96 358.23 L 243.58 358.41 L 243.19 358.57 L 243.11 358.57 L 242.22 358.06 L 242.22 357.94 L 242.22 357.94 L 242.56 357.82 L 242.88 357.69 L 243.19 357.56 L 243.48 357.42 L 243.76 357.28 L 244.02 357.13 L 244.27 356.98 L 244.50 356.83 L 244.71 356.67 L 244.91 356.50 L 244.91 356.50 L 245.10 356.33 L 245.28 356.15 L 245.44 355.97 L 245.59 355.78 L 245.73 355.59 L 245.85 355.38 L 245.97 355.18 L 246.07 354.96 L 246.15 354.74 L 246.22 354.51 L 246.14 354.41 L 246.14 354.41 L 245.96 354.53 L 245.79 354.64 L 245.61 354.74 L 245.42 354.82 L 245.24 354.89 L 245.05 354.95 L 244.86 354.99 L 244.66 355.02 L 244.47 355.04 L 244.27 355.05 ZM 244.68 350.70 L 244.68 350.70 L 244.52 350.70 L 244.37 350.72 L 244.23 350.74 L 244.10 350.77 L 243.97 350.81 L 243.84 350.86 L 243.73 350.92 L 243.62 350.99 L 243.52 351.07 L 243.43 351.16 L 243.43 351.16 L 243.35 351.25 L 243.27 351.35 L 243.20 351.46 L 243.14 351.58 L 243.10 351.71 L 243.05 351.84 L 243.02 351.98 L 243.00 352.13 L 242.99 352.29 L 242.98 352.45 L 242.98 352.45 L 242.99 352.62 L 243.00 352.77 L 243.02 352.92 L 243.05 353.06 L 243.09 353.20 L 243.13 353.32 L 243.19 353.44 L 243.25 353.55 L 243.32 353.65 L 243.40 353.75 L 243.40 353.75 L 243.49 353.84 L 243.58 353.91 L 243.68 353.98 L 243.79 354.04 L 243.91 354.09 L 244.03 354.13 L 244.16 354.16 L 244.29 354.18 L 244.43 354.19 L 244.58 354.20 L 244.58 354.20 L 244.77 354.19 L 244.96 354.17 L 245.14 354.13 L 245.33 354.08 L 245.51 354.01 L 245.69 353.93 L 245.87 353.83 L 246.05 353.72 L 246.22 353.59 L 246.40 353.45 L 246.40 353.45 L 246.40 353.42 L 246.40 353.39 L 246.40 353.36 L 246.41 353.32 L 246.41 353.29 L 246.41 353.25 L 246.41 353.20 L 246.41 353.16 L 246.41 353.11 L 246.41 353.06 L 246.41 353.06 L 246.41 352.83 L 246.39 352.61 L 246.37 352.40 L 246.34 352.21 L 246.31 352.03 L 246.26 351.85 L 246.21 351.70 L 246.14 351.55 L 246.07 351.41 L 245.99 351.29 L 245.99 351.29 L 245.90 351.18 L 245.81 351.08 L 245.70 350.99 L 245.58 350.91 L 245.46 350.85 L 245.32 350.79 L 245.18 350.75 L 245.02 350.72 L 244.86 350.70 L 244.68 350.70 Z' style='fill-rule: nonzero; fill: #343A40; stroke-width: 0.75; stroke: none;' />
<path d='M 251.95 352.18 L 251.95 352.18 L 252.17 352.19 L 252.37 352.21 L 252.56 352.24 L 252.74 352.29 L 252.92 352.35 L 253.08 352.42 L 253.23 352.51 L 253.38 352.60 L 253.51 352.72 L 253.64 352.84 L 253.64 352.84 L 253.76 352.98 L 253.86 353.13 L 253.96 353.28 L 254.04 353.44 L 254.10 353.62 L 254.16 353.80 L 254.20 353.99 L 254.23 354.19 L 254.25 354.40 L 254.26 354.61 L 254.26 354.61 L 254.25 354.85 L 254.23 355.08 L 254.19 355.29 L 254.14 355.50 L 254.07 355.70 L 253.99 355.89 L 253.89 356.08 L 253.78 356.25 L 253.65 356.42 L 253.51 356.57 L 253.51 356.57 L 253.35 356.72 L 253.19 356.84 L 253.01 356.95 L 252.82 357.05 L 252.62 357.13 L 252.41 357.20 L 252.19 357.25 L 251.95 357.29 L 251.71 357.31 L 251.45 357.32 L 251.45 357.32 L 251.19 357.31 L 250.95 357.29 L 250.71 357.25 L 250.49 357.19 L 250.29 357.12 L 250.09 357.03 L 249.91 356.92 L 249.75 356.80 L 249.59 356.66 L 249.45 356.50 L 249.45 356.50 L 249.32 356.33 L 249.21 356.14 L 249.10 355.95 L 249.02 355.73 L 248.94 355.51 L 248.88 355.27 L 248.83 355.01 L 248.80 354.75 L 248.78 354.46 L 248.77 354.17 L 248.77 354.17 L 248.78 353.81 L 248.82 353.45 L 248.87 353.11 L 248.95 352.77 L 249.05 352.44 L 249.17 352.11 L 249.32 351.80 L 249.48 351.49 L 249.67 351.19 L 249.88 350.90 L 249.88 350.90 L 250.11 350.62 L 250.37 350.35 L 250.64 350.09 L 250.92 349.85 L 251.23 349.62 L 251.56 349.40 L 251.90 349.19 L 252.26 349.00 L 252.64 348.82 L 253.03 348.65 L 253.11 348.65 L 254.00 349.17 L 254.00 349.29 L 254.00 349.29 L 253.66 349.41 L 253.34 349.54 L 253.03 349.67 L 252.74 349.81 L 252.46 349.95 L 252.20 350.10 L 251.95 350.25 L 251.71 350.40 L 251.50 350.56 L 251.29 350.73 L 251.29 350.73 L 251.11 350.90 L 250.93 351.07 L 250.77 351.26 L 250.62 351.45 L 250.49 351.64 L 250.36 351.84 L 250.25 352.05 L 250.15 352.27 L 250.07 352.49 L 250.00 352.71 L 250.08 352.81 L 250.08 352.81 L 250.26 352.69 L 250.43 352.59 L 250.61 352.49 L 250.80 352.41 L 250.98 352.34 L 251.17 352.28 L 251.36 352.24 L 251.56 352.21 L 251.75 352.19 L 251.95 352.18 ZM 251.54 356.53 L 251.54 356.53 L 251.69 356.53 L 251.85 356.51 L 251.99 356.49 L 252.12 356.46 L 252.25 356.42 L 252.38 356.37 L 252.49 356.31 L 252.60 356.24 L 252.70 356.17 L 252.79 356.08 L 252.79 356.08 L 252.87 355.99 L 252.95 355.88 L 253.02 355.77 L 253.08 355.65 L 253.12 355.53 L 253.16 355.39 L 253.20 355.25 L 253.22 355.10 L 253.23 354.94 L 253.24 354.77 L 253.24 354.77 L 253.23 354.61 L 253.22 354.45 L 253.20 354.31 L 253.17 354.17 L 253.13 354.03 L 253.09 353.91 L 253.03 353.79 L 252.97 353.69 L 252.90 353.58 L 252.82 353.49 L 252.82 353.49 L 252.73 353.40 L 252.64 353.33 L 252.54 353.26 L 252.43 353.20 L 252.31 353.15 L 252.19 353.10 L 252.06 353.07 L 251.93 353.05 L 251.79 353.04 L 251.64 353.03 L 251.64 353.03 L 251.45 353.04 L 251.26 353.06 L 251.08 353.10 L 250.89 353.15 L 250.71 353.22 L 250.53 353.30 L 250.35 353.40 L 250.17 353.51 L 250.00 353.64 L 249.82 353.78 L 249.82 353.78 L 249.82 353.81 L 249.82 353.84 L 249.82 353.87 L 249.81 353.90 L 249.81 353.94 L 249.81 353.98 L 249.81 354.02 L 249.81 354.07 L 249.81 354.12 L 249.81 354.17 L 249.81 354.17 L 249.81 354.40 L 249.83 354.62 L 249.85 354.82 L 249.88 355.02 L 249.91 355.20 L 249.96 355.37 L 250.01 355.53 L 250.08 355.68 L 250.15 355.82 L 250.23 355.94 L 250.23 355.94 L 250.31 356.05 L 250.41 356.15 L 250.52 356.24 L 250.64 356.32 L 250.76 356.38 L 250.90 356.44 L 251.04 356.48 L 251.20 356.51 L 251.36 356.52 L 251.54 356.53 Z' style='fill-rule: nonzero; fill: #343A40; stroke-width: 0.75; stroke: none;' />
<path d='M 258.77 349.95 L 258.77 349.95 L 259.05 349.96 L 259.32 349.99 L 259.58 350.03 L 259.82 350.10 L 260.05 350.19 L 260.27 350.29 L 260.48 350.41 L 260.67 350.56 L 260.85 350.72 L 261.01 350.90 L 261.01 350.90 L 261.17 351.09 L 261.30 351.31 L 261.42 351.53 L 261.53 351.78 L 261.62 352.04 L 261.69 352.31 L 261.75 352.60 L 261.79 352.91 L 261.81 353.24 L 261.82 353.58 L 261.82 353.58 L 261.81 353.93 L 261.79 354.26 L 261.74 354.58 L 261.69 354.88 L 261.61 355.16 L 261.52 355.43 L 261.41 355.68 L 261.28 355.92 L 261.14 356.14 L 260.98 356.34 L 260.98 356.34 L 260.81 356.53 L 260.62 356.69 L 260.42 356.83 L 260.20 356.96 L 259.98 357.07 L 259.73 357.15 L 259.48 357.22 L 259.20 357.27 L 258.92 357.30 L 258.62 357.31 L 258.62 357.31 L 258.33 357.30 L 258.06 357.27 L 257.80 357.22 L 257.55 357.16 L 257.32 357.07 L 257.10 356.97 L 256.89 356.85 L 256.70 356.71 L 256.51 356.55 L 256.35 356.37 L 256.35 356.37 L 256.20 356.18 L 256.06 355.97 L 255.94 355.74 L 255.84 355.50 L 255.75 355.24 L 255.68 354.97 L 255.63 354.68 L 255.59 354.38 L 255.56 354.06 L 255.55 353.72 L 255.55 353.72 L 255.56 353.37 L 255.59 353.03 L 255.63 352.71 L 255.69 352.40 L 255.76 352.12 L 255.86 351.84 L 255.96 351.59 L 256.09 351.35 L 256.23 351.13 L 256.39 350.93 L 256.39 350.93 L 256.56 350.74 L 256.75 350.58 L 256.95 350.43 L 257.17 350.30 L 257.40 350.19 L 257.65 350.11 L 257.90 350.04 L 258.18 349.99 L 258.46 349.96 L 258.77 349.95 ZM 258.67 351.00 L 258.67 351.00 L 258.45 351.01 L 258.25 351.03 L 258.06 351.06 L 257.87 351.11 L 257.70 351.17 L 257.54 351.24 L 257.39 351.32 L 257.26 351.42 L 257.13 351.54 L 257.01 351.66 L 257.01 351.66 L 256.91 351.80 L 256.81 351.95 L 256.73 352.12 L 256.66 352.30 L 256.60 352.49 L 256.55 352.69 L 256.51 352.91 L 256.48 353.14 L 256.47 353.38 L 256.46 353.64 L 256.46 353.64 L 256.47 353.89 L 256.48 354.14 L 256.51 354.37 L 256.55 354.59 L 256.60 354.80 L 256.66 354.99 L 256.74 355.17 L 256.82 355.34 L 256.92 355.49 L 257.02 355.64 L 257.02 355.64 L 257.14 355.76 L 257.27 355.88 L 257.41 355.97 L 257.56 356.06 L 257.72 356.13 L 257.89 356.19 L 258.07 356.24 L 258.26 356.27 L 258.47 356.29 L 258.68 356.30 L 258.68 356.30 L 258.89 356.29 L 259.10 356.27 L 259.29 356.24 L 259.47 356.20 L 259.64 356.14 L 259.80 356.07 L 259.95 355.98 L 260.09 355.88 L 260.22 355.77 L 260.34 355.65 L 260.34 355.65 L 260.44 355.51 L 260.54 355.36 L 260.63 355.20 L 260.70 355.02 L 260.77 354.83 L 260.82 354.63 L 260.86 354.42 L 260.89 354.20 L 260.91 353.96 L 260.91 353.71 L 260.91 353.71 L 260.91 353.45 L 260.89 353.20 L 260.86 352.96 L 260.82 352.74 L 260.77 352.53 L 260.70 352.34 L 260.63 352.16 L 260.54 351.99 L 260.44 351.83 L 260.34 351.69 L 260.34 351.69 L 260.22 351.56 L 260.09 351.44 L 259.95 351.34 L 259.80 351.25 L 259.64 351.17 L 259.46 351.11 L 259.28 351.06 L 259.09 351.03 L 258.88 351.01 L 258.67 351.00 Z' style='fill-rule: nonzero; fill: #343A40; stroke-width: 0.75; stroke: none;' />
<path d='M 333.02 350.09 L 332.95 354.23 L 333.00 357.21 L 331.85 357.21 L 331.92 354.37 L 331.91 351.29 L 330.05 351.81 L 329.94 351.75 L 329.94 350.84 L 332.85 349.98 L 333.02 350.09 Z' style='fill-rule: nonzero; fill: #343A40; stroke-width: 0.75; stroke: none;' />
<path d='M 337.65 355.05 L 337.65 355.05 L 337.44 355.04 L 337.24 355.02 L 337.05 354.99 L 336.86 354.94 L 336.69 354.88 L 336.52 354.81 L 336.37 354.72 L 336.22 354.62 L 336.08 354.51 L 335.96 354.38 L 335.96 354.38 L 335.84 354.25 L 335.74 354.10 L 335.65 353.95 L 335.57 353.78 L 335.50 353.61 L 335.45 353.43 L 335.41 353.24 L 335.37 353.04 L 335.36 352.83 L 335.35 352.61 L 335.35 352.61 L 335.36 352.38 L 335.38 352.15 L 335.42 351.94 L 335.47 351.73 L 335.54 351.53 L 335.62 351.34 L 335.72 351.16 L 335.83 350.99 L 335.96 350.82 L 336.10 350.67 L 336.10 350.67 L 336.25 350.52 L 336.42 350.39 L 336.60 350.28 L 336.79 350.18 L 336.99 350.10 L 337.20 350.03 L 337.42 349.97 L 337.66 349.94 L 337.90 349.91 L 338.16 349.91 L 338.16 349.91 L 338.42 349.91 L 338.66 349.94 L 338.90 349.98 L 339.11 350.04 L 339.32 350.11 L 339.52 350.20 L 339.70 350.31 L 339.86 350.43 L 340.02 350.57 L 340.16 350.73 L 340.16 350.73 L 340.29 350.90 L 340.40 351.08 L 340.51 351.28 L 340.59 351.49 L 340.67 351.72 L 340.73 351.96 L 340.78 352.21 L 340.81 352.48 L 340.83 352.76 L 340.84 353.06 L 340.84 353.06 L 340.83 353.42 L 340.79 353.78 L 340.74 354.12 L 340.66 354.46 L 340.56 354.79 L 340.43 355.11 L 340.29 355.43 L 340.12 355.74 L 339.93 356.04 L 339.71 356.33 L 339.71 356.33 L 339.48 356.61 L 339.23 356.88 L 338.97 357.13 L 338.68 357.38 L 338.37 357.61 L 338.05 357.83 L 337.71 358.03 L 337.35 358.23 L 336.97 358.41 L 336.57 358.57 L 336.50 358.57 L 335.61 358.06 L 335.61 357.94 L 335.61 357.94 L 335.95 357.82 L 336.27 357.69 L 336.58 357.56 L 336.87 357.42 L 337.15 357.28 L 337.41 357.13 L 337.66 356.98 L 337.89 356.83 L 338.10 356.67 L 338.30 356.50 L 338.30 356.50 L 338.49 356.33 L 338.67 356.15 L 338.83 355.97 L 338.98 355.78 L 339.12 355.59 L 339.24 355.38 L 339.36 355.18 L 339.45 354.96 L 339.54 354.74 L 339.61 354.51 L 339.53 354.41 L 339.53 354.41 L 339.35 354.53 L 339.18 354.64 L 339.00 354.74 L 338.81 354.82 L 338.63 354.89 L 338.44 354.95 L 338.25 354.99 L 338.05 355.02 L 337.85 355.04 L 337.65 355.05 ZM 338.07 350.70 L 338.07 350.70 L 337.91 350.70 L 337.76 350.72 L 337.62 350.74 L 337.48 350.77 L 337.36 350.81 L 337.23 350.86 L 337.12 350.92 L 337.01 350.99 L 336.91 351.07 L 336.82 351.16 L 336.82 351.16 L 336.73 351.25 L 336.66 351.35 L 336.59 351.46 L 336.53 351.58 L 336.48 351.71 L 336.44 351.84 L 336.41 351.98 L 336.39 352.13 L 336.38 352.29 L 336.37 352.45 L 336.37 352.45 L 336.38 352.62 L 336.39 352.77 L 336.41 352.92 L 336.44 353.06 L 336.48 353.20 L 336.52 353.32 L 336.58 353.44 L 336.64 353.55 L 336.71 353.65 L 336.79 353.75 L 336.79 353.75 L 336.88 353.84 L 336.97 353.91 L 337.07 353.98 L 337.18 354.04 L 337.29 354.09 L 337.42 354.13 L 337.54 354.16 L 337.68 354.18 L 337.82 354.19 L 337.97 354.20 L 337.97 354.20 L 338.16 354.19 L 338.35 354.17 L 338.53 354.13 L 338.72 354.08 L 338.90 354.01 L 339.08 353.93 L 339.26 353.83 L 339.44 353.72 L 339.61 353.59 L 339.79 353.45 L 339.79 353.45 L 339.79 353.42 L 339.79 353.39 L 339.79 353.36 L 339.80 353.32 L 339.80 353.29 L 339.80 353.25 L 339.80 353.20 L 339.80 353.16 L 339.80 353.11 L 339.80 353.06 L 339.80 353.06 L 339.80 352.83 L 339.78 352.61 L 339.76 352.40 L 339.73 352.21 L 339.70 352.03 L 339.65 351.85 L 339.60 351.70 L 339.53 351.55 L 339.46 351.41 L 339.38 351.29 L 339.38 351.29 L 339.29 351.18 L 339.20 351.08 L 339.09 350.99 L 338.97 350.91 L 338.85 350.85 L 338.71 350.79 L 338.57 350.75 L 338.41 350.72 L 338.25 350.70 L 338.07 350.70 Z' style='fill-rule: nonzero; fill: #343A40; stroke-width: 0.75; stroke: none;' />
<path d='M 345.03 348.68 L 345.03 348.68 L 345.23 348.69 L 345.43 348.70 L 345.62 348.73 L 345.79 348.77 L 345.96 348.82 L 346.12 348.88 L 346.27 348.95 L 346.41 349.03 L 346.55 349.12 L 346.67 349.23 L 346.67 349.23 L 346.78 349.34 L 346.89 349.46 L 346.98 349.58 L 347.06 349.72 L 347.12 349.86 L 347.18 350.01 L 347.22 350.17 L 347.25 350.34 L 347.27 350.51 L 347.27 350.70 L 347.27 350.70 L 347.27 350.84 L 347.26 350.98 L 347.24 351.11 L 347.21 351.24 L 347.18 351.37 L 347.14 351.49 L 347.09 351.60 L 347.03 351.71 L 346.97 351.81 L 346.90 351.91 L 346.90 351.91 L 346.82 352.00 L 346.74 352.09 L 346.65 352.18 L 346.56 352.27 L 346.46 352.36 L 346.35 352.44 L 346.24 352.52 L 346.13 352.60 L 346.00 352.68 L 345.88 352.76 L 345.88 352.83 L 345.88 352.83 L 346.03 352.90 L 346.17 352.98 L 346.31 353.06 L 346.44 353.14 L 346.57 353.22 L 346.69 353.31 L 346.80 353.40 L 346.90 353.48 L 347.00 353.57 L 347.09 353.66 L 347.09 353.66 L 347.17 353.76 L 347.25 353.86 L 347.31 353.97 L 347.37 354.08 L 347.42 354.20 L 347.46 354.33 L 347.49 354.47 L 347.52 354.62 L 347.53 354.77 L 347.53 354.93 L 347.53 354.93 L 347.53 355.14 L 347.50 355.35 L 347.46 355.54 L 347.41 355.73 L 347.34 355.90 L 347.26 356.07 L 347.16 356.23 L 347.04 356.38 L 346.91 356.53 L 346.77 356.66 L 346.77 356.66 L 346.61 356.78 L 346.44 356.89 L 346.27 356.99 L 346.08 357.07 L 345.88 357.15 L 345.67 357.20 L 345.45 357.25 L 345.23 357.28 L 344.99 357.30 L 344.74 357.31 L 344.74 357.31 L 344.51 357.30 L 344.29 357.28 L 344.08 357.25 L 343.87 357.21 L 343.68 357.16 L 343.50 357.09 L 343.33 357.02 L 343.16 356.93 L 343.01 356.83 L 342.87 356.72 L 342.87 356.72 L 342.74 356.59 L 342.62 356.46 L 342.52 356.32 L 342.43 356.18 L 342.36 356.02 L 342.30 355.86 L 342.25 355.69 L 342.22 355.52 L 342.20 355.34 L 342.19 355.15 L 342.19 355.15 L 342.20 354.99 L 342.21 354.84 L 342.23 354.69 L 342.26 354.55 L 342.31 354.42 L 342.36 354.29 L 342.42 354.17 L 342.49 354.05 L 342.56 353.94 L 342.65 353.84 L 342.65 353.84 L 342.75 353.73 L 342.85 353.64 L 342.96 353.54 L 343.07 353.45 L 343.19 353.35 L 343.31 353.27 L 343.44 353.18 L 343.58 353.10 L 343.73 353.02 L 343.88 352.94 L 343.88 352.87 L 343.88 352.87 L 343.76 352.81 L 343.64 352.74 L 343.53 352.67 L 343.43 352.60 L 343.33 352.52 L 343.23 352.44 L 343.14 352.36 L 343.06 352.27 L 342.97 352.19 L 342.90 352.09 L 342.90 352.09 L 342.83 352.00 L 342.76 351.90 L 342.71 351.79 L 342.66 351.68 L 342.62 351.56 L 342.58 351.44 L 342.56 351.31 L 342.54 351.17 L 342.53 351.03 L 342.52 350.88 L 342.52 350.88 L 342.53 350.68 L 342.55 350.49 L 342.58 350.31 L 342.63 350.14 L 342.69 349.97 L 342.77 349.81 L 342.86 349.67 L 342.96 349.53 L 343.08 349.39 L 343.21 349.27 L 343.21 349.27 L 343.36 349.16 L 343.51 349.06 L 343.67 348.97 L 343.84 348.89 L 344.01 348.83 L 344.20 348.78 L 344.39 348.73 L 344.60 348.71 L 344.81 348.69 L 345.03 348.68 ZM 344.97 349.52 L 344.97 349.52 L 344.84 349.52 L 344.71 349.53 L 344.59 349.55 L 344.47 349.57 L 344.36 349.61 L 344.26 349.65 L 344.16 349.69 L 344.06 349.75 L 343.97 349.81 L 343.89 349.88 L 343.89 349.88 L 343.81 349.95 L 343.74 350.03 L 343.68 350.12 L 343.63 350.21 L 343.59 350.30 L 343.55 350.40 L 343.52 350.51 L 343.50 350.62 L 343.49 350.73 L 343.49 350.86 L 343.49 350.86 L 343.49 350.98 L 343.50 351.09 L 343.52 351.20 L 343.55 351.31 L 343.58 351.41 L 343.62 351.50 L 343.67 351.59 L 343.73 351.67 L 343.79 351.75 L 343.86 351.82 L 343.86 351.82 L 343.94 351.89 L 344.03 351.95 L 344.12 352.02 L 344.23 352.08 L 344.33 352.14 L 344.45 352.20 L 344.57 352.26 L 344.70 352.32 L 344.83 352.38 L 344.97 352.44 L 344.97 352.44 L 345.10 352.38 L 345.22 352.33 L 345.33 352.27 L 345.44 352.21 L 345.55 352.14 L 345.64 352.08 L 345.74 352.01 L 345.82 351.95 L 345.90 351.88 L 345.98 351.81 L 345.98 351.81 L 346.05 351.73 L 346.11 351.65 L 346.17 351.56 L 346.22 351.47 L 346.26 351.37 L 346.29 351.26 L 346.32 351.16 L 346.34 351.04 L 346.35 350.92 L 346.35 350.80 L 346.35 350.80 L 346.35 350.68 L 346.34 350.57 L 346.32 350.46 L 346.29 350.36 L 346.26 350.26 L 346.22 350.17 L 346.17 350.09 L 346.11 350.01 L 346.05 349.93 L 345.98 349.86 L 345.98 349.86 L 345.90 349.80 L 345.82 349.74 L 345.74 349.69 L 345.64 349.64 L 345.55 349.60 L 345.44 349.57 L 345.33 349.55 L 345.22 349.53 L 345.10 349.52 L 344.97 349.52 ZM 344.77 353.30 L 344.77 353.30 L 344.62 353.36 L 344.49 353.41 L 344.35 353.47 L 344.23 353.53 L 344.11 353.60 L 344.00 353.66 L 343.89 353.73 L 343.79 353.80 L 343.69 353.88 L 343.60 353.95 L 343.60 353.95 L 343.52 354.03 L 343.45 354.12 L 343.38 354.21 L 343.33 354.31 L 343.28 354.42 L 343.24 354.53 L 343.21 354.64 L 343.19 354.77 L 343.17 354.90 L 343.17 355.03 L 343.17 355.03 L 343.17 355.16 L 343.19 355.28 L 343.21 355.40 L 343.24 355.51 L 343.28 355.62 L 343.33 355.72 L 343.39 355.82 L 343.46 355.91 L 343.53 356.00 L 343.62 356.08 L 343.62 356.08 L 343.71 356.16 L 343.81 356.23 L 343.92 356.29 L 344.03 356.34 L 344.15 356.39 L 344.28 356.42 L 344.41 356.45 L 344.55 356.47 L 344.69 356.48 L 344.84 356.49 L 344.84 356.49 L 345.00 356.48 L 345.14 356.47 L 345.29 356.45 L 345.42 356.42 L 345.55 356.39 L 345.67 356.34 L 345.79 356.29 L 345.90 356.23 L 346.00 356.16 L 346.09 356.08 L 346.09 356.08 L 346.18 356.00 L 346.26 355.91 L 346.34 355.81 L 346.40 355.71 L 346.45 355.60 L 346.49 355.49 L 346.53 355.38 L 346.55 355.26 L 346.56 355.13 L 346.57 355.00 L 346.57 355.00 L 346.57 354.91 L 346.56 354.83 L 346.55 354.74 L 346.53 354.66 L 346.51 354.58 L 346.48 354.51 L 346.45 354.44 L 346.41 354.37 L 346.37 354.30 L 346.32 354.24 L 346.32 354.24 L 346.27 354.18 L 346.22 354.12 L 346.17 354.06 L 346.11 354.01 L 346.05 353.96 L 345.99 353.91 L 345.93 353.87 L 345.87 353.83 L 345.80 353.79 L 345.73 353.75 L 345.73 353.75 L 345.66 353.71 L 345.59 353.67 L 345.51 353.63 L 345.42 353.59 L 345.33 353.55 L 345.23 353.50 L 345.12 353.45 L 345.01 353.40 L 344.89 353.36 L 344.77 353.30 Z' style='fill-rule: nonzero; fill: #343A40; stroke-width: 0.75; stroke: none;' />
<path d='M 352.21 349.95 L 352.21 349.95 L 352.50 349.96 L 352.77 349.99 L 353.03 350.03 L 353.27 350.10 L 353.50 350.19 L 353.72 350.29 L 353.92 350.41 L 354.12 350.56 L 354.29 350.72 L 354.46 350.90 L 354.46 350.90 L 354.61 351.09 L 354.75 351.31 L 354.87 351.53 L 354.98 351.78 L 355.06 352.04 L 355.14 352.31 L 355.19 352.60 L 355.23 352.91 L 355.26 353.24 L 355.27 353.58 L 355.27 353.58 L 355.26 353.93 L 355.23 354.26 L 355.19 354.58 L 355.13 354.88 L 355.06 355.16 L 354.97 355.43 L 354.86 355.68 L 354.73 355.92 L 354.59 356.14 L 354.43 356.34 L 354.43 356.34 L 354.26 356.53 L 354.07 356.69 L 353.87 356.83 L 353.65 356.96 L 353.42 357.07 L 353.18 357.15 L 352.92 357.22 L 352.65 357.27 L 352.37 357.30 L 352.07 357.31 L 352.07 357.31 L 351.78 357.30 L 351.51 357.27 L 351.25 357.22 L 351.00 357.16 L 350.77 357.07 L 350.55 356.97 L 350.34 356.85 L 350.14 356.71 L 349.96 356.55 L 349.79 356.37 L 349.79 356.37 L 349.64 356.18 L 349.51 355.97 L 349.39 355.74 L 349.29 355.50 L 349.20 355.24 L 349.13 354.97 L 349.07 354.68 L 349.03 354.38 L 349.01 354.06 L 349.00 353.72 L 349.00 353.72 L 349.01 353.37 L 349.04 353.03 L 349.08 352.71 L 349.14 352.40 L 349.21 352.12 L 349.30 351.84 L 349.41 351.59 L 349.54 351.35 L 349.68 351.13 L 349.84 350.93 L 349.84 350.93 L 350.01 350.74 L 350.20 350.58 L 350.40 350.43 L 350.62 350.30 L 350.85 350.19 L 351.09 350.11 L 351.35 350.04 L 351.63 349.99 L 351.91 349.96 L 352.21 349.95 ZM 352.11 351.00 L 352.11 351.00 L 351.90 351.01 L 351.70 351.03 L 351.50 351.06 L 351.32 351.11 L 351.15 351.17 L 350.99 351.24 L 350.84 351.32 L 350.70 351.42 L 350.57 351.54 L 350.46 351.66 L 350.46 351.66 L 350.35 351.80 L 350.26 351.95 L 350.18 352.12 L 350.11 352.30 L 350.05 352.49 L 350.00 352.69 L 349.96 352.91 L 349.93 353.14 L 349.91 353.38 L 349.91 353.64 L 349.91 353.64 L 349.91 353.89 L 349.93 354.14 L 349.96 354.37 L 350.00 354.59 L 350.05 354.80 L 350.11 354.99 L 350.18 355.17 L 350.27 355.34 L 350.36 355.49 L 350.47 355.64 L 350.47 355.64 L 350.59 355.76 L 350.72 355.88 L 350.86 355.97 L 351.01 356.06 L 351.17 356.13 L 351.34 356.19 L 351.52 356.24 L 351.71 356.27 L 351.91 356.29 L 352.13 356.30 L 352.13 356.30 L 352.34 356.29 L 352.54 356.27 L 352.74 356.24 L 352.92 356.20 L 353.09 356.14 L 353.25 356.07 L 353.40 355.98 L 353.54 355.88 L 353.67 355.77 L 353.78 355.65 L 353.78 355.65 L 353.89 355.51 L 353.99 355.36 L 354.08 355.20 L 354.15 355.02 L 354.21 354.83 L 354.27 354.63 L 354.31 354.42 L 354.34 354.20 L 354.35 353.96 L 354.36 353.71 L 354.36 353.71 L 354.35 353.45 L 354.34 353.20 L 354.31 352.96 L 354.27 352.74 L 354.21 352.53 L 354.15 352.34 L 354.08 352.16 L 353.99 351.99 L 353.89 351.83 L 353.78 351.69 L 353.78 351.69 L 353.66 351.56 L 353.54 351.44 L 353.40 351.34 L 353.25 351.25 L 353.08 351.17 L 352.91 351.11 L 352.73 351.06 L 352.53 351.03 L 352.33 351.01 L 352.11 351.00 Z' style='fill-rule: nonzero; fill: #343A40; stroke-width: 0.75; stroke: none;' />
<path d='M 424.90 349.98 L 424.90 349.98 L 425.07 349.98 L 425.24 350.00 L 425.39 350.02 L 425.54 350.05 L 425.69 350.09 L 425.83 350.14 L 425.96 350.20 L 426.08 350.26 L 426.20 350.34 L 426.31 350.42 L 426.31 350.42 L 426.42 350.51 L 426.52 350.61 L 426.60 350.71 L 426.67 350.82 L 426.74 350.93 L 426.79 351.05 L 426.83 351.17 L 426.85 351.30 L 426.87 351.43 L 426.88 351.58 L 426.88 351.58 L 426.87 351.69 L 426.86 351.81 L 426.84 351.93 L 426.81 352.06 L 426.77 352.19 L 426.73 352.32 L 426.68 352.45 L 426.62 352.59 L 426.55 352.73 L 426.47 352.87 L 426.47 352.87 L 426.39 353.02 L 426.29 353.17 L 426.19 353.32 L 426.07 353.49 L 425.95 353.66 L 425.82 353.83 L 425.68 354.02 L 425.52 354.20 L 425.36 354.40 L 425.19 354.60 L 423.74 356.26 L 423.77 356.31 L 426.43 356.31 L 427.64 356.23 L 427.73 356.30 L 427.57 357.26 L 426.10 357.21 L 422.87 357.21 L 422.34 357.24 L 422.27 357.18 L 422.27 356.46 L 424.27 354.28 L 424.27 354.28 L 424.42 354.11 L 424.56 353.95 L 424.70 353.79 L 424.82 353.64 L 424.94 353.49 L 425.05 353.36 L 425.15 353.22 L 425.25 353.09 L 425.33 352.97 L 425.41 352.86 L 425.41 352.86 L 425.48 352.74 L 425.54 352.63 L 425.59 352.52 L 425.64 352.42 L 425.68 352.32 L 425.71 352.22 L 425.73 352.12 L 425.75 352.03 L 425.76 351.94 L 425.77 351.85 L 425.77 351.85 L 425.76 351.77 L 425.76 351.70 L 425.74 351.63 L 425.72 351.56 L 425.69 351.50 L 425.66 351.43 L 425.63 351.38 L 425.58 351.32 L 425.53 351.27 L 425.48 351.22 L 425.48 351.22 L 425.42 351.17 L 425.35 351.12 L 425.29 351.08 L 425.21 351.05 L 425.13 351.02 L 425.05 351.00 L 424.96 350.98 L 424.87 350.97 L 424.77 350.96 L 424.67 350.96 L 424.67 350.96 L 424.57 350.96 L 424.47 350.97 L 424.36 350.98 L 424.26 351.00 L 424.15 351.02 L 424.05 351.05 L 423.95 351.08 L 423.84 351.12 L 423.74 351.17 L 423.64 351.22 L 423.64 351.22 L 423.54 351.27 L 423.44 351.33 L 423.34 351.39 L 423.25 351.46 L 423.15 351.53 L 423.06 351.60 L 422.97 351.68 L 422.88 351.76 L 422.80 351.85 L 422.71 351.94 L 422.57 351.94 L 422.38 351.06 L 422.38 351.06 L 422.50 350.96 L 422.61 350.86 L 422.73 350.77 L 422.85 350.68 L 422.97 350.60 L 423.09 350.52 L 423.21 350.45 L 423.34 350.38 L 423.46 350.32 L 423.59 350.27 L 423.59 350.27 L 423.72 350.21 L 423.85 350.16 L 423.98 350.12 L 424.11 350.08 L 424.24 350.05 L 424.38 350.02 L 424.51 350.00 L 424.64 349.99 L 424.77 349.98 L 424.90 349.98 Z' style='fill-rule: nonzero; fill: #343A40; stroke-width: 0.75; stroke: none;' />
<path d='M 432.03 349.95 L 432.03 349.95 L 432.32 349.96 L 432.59 349.99 L 432.84 350.03 L 433.09 350.10 L 433.32 350.19 L 433.54 350.29 L 433.74 350.41 L 433.93 350.56 L 434.11 350.72 L 434.28 350.90 L 434.28 350.90 L 434.43 351.09 L 434.57 351.31 L 434.69 351.53 L 434.79 351.78 L 434.88 352.04 L 434.95 352.31 L 435.01 352.60 L 435.05 352.91 L 435.08 353.24 L 435.08 353.58 L 435.08 353.58 L 435.08 353.93 L 435.05 354.26 L 435.01 354.58 L 434.95 354.88 L 434.87 355.16 L 434.78 355.43 L 434.67 355.68 L 434.55 355.92 L 434.41 356.14 L 434.25 356.34 L 434.25 356.34 L 434.07 356.53 L 433.89 356.69 L 433.69 356.83 L 433.47 356.96 L 433.24 357.07 L 433.00 357.15 L 432.74 357.22 L 432.47 357.27 L 432.19 357.30 L 431.89 357.31 L 431.89 357.31 L 431.60 357.30 L 431.33 357.27 L 431.07 357.22 L 430.82 357.16 L 430.58 357.07 L 430.36 356.97 L 430.16 356.85 L 429.96 356.71 L 429.78 356.55 L 429.61 356.37 L 429.61 356.37 L 429.46 356.18 L 429.33 355.97 L 429.21 355.74 L 429.10 355.50 L 429.02 355.24 L 428.95 354.97 L 428.89 354.68 L 428.85 354.38 L 428.83 354.06 L 428.82 353.72 L 428.82 353.72 L 428.83 353.37 L 428.85 353.03 L 428.89 352.71 L 428.95 352.40 L 429.03 352.12 L 429.12 351.84 L 429.23 351.59 L 429.35 351.35 L 429.50 351.13 L 429.65 350.93 L 429.65 350.93 L 429.83 350.74 L 430.02 350.58 L 430.22 350.43 L 430.44 350.30 L 430.67 350.19 L 430.91 350.11 L 431.17 350.04 L 431.44 349.99 L 431.73 349.96 L 432.03 349.95 ZM 431.93 351.00 L 431.93 351.00 L 431.72 351.01 L 431.51 351.03 L 431.32 351.06 L 431.14 351.11 L 430.97 351.17 L 430.81 351.24 L 430.66 351.32 L 430.52 351.42 L 430.39 351.54 L 430.27 351.66 L 430.27 351.66 L 430.17 351.80 L 430.08 351.95 L 429.99 352.12 L 429.92 352.30 L 429.86 352.49 L 429.81 352.69 L 429.78 352.91 L 429.75 353.14 L 429.73 353.38 L 429.73 353.64 L 429.73 353.64 L 429.73 353.89 L 429.75 354.14 L 429.78 354.37 L 429.82 354.59 L 429.87 354.80 L 429.93 354.99 L 430.00 355.17 L 430.09 355.34 L 430.18 355.49 L 430.29 355.64 L 430.29 355.64 L 430.41 355.76 L 430.53 355.88 L 430.67 355.97 L 430.82 356.06 L 430.98 356.13 L 431.15 356.19 L 431.34 356.24 L 431.53 356.27 L 431.73 356.29 L 431.94 356.30 L 431.94 356.30 L 432.16 356.29 L 432.36 356.27 L 432.55 356.24 L 432.73 356.20 L 432.91 356.14 L 433.07 356.07 L 433.22 355.98 L 433.35 355.88 L 433.48 355.77 L 433.60 355.65 L 433.60 355.65 L 433.71 355.51 L 433.81 355.36 L 433.89 355.20 L 433.97 355.02 L 434.03 354.83 L 434.08 354.63 L 434.12 354.42 L 434.15 354.20 L 434.17 353.96 L 434.18 353.71 L 434.18 353.71 L 434.17 353.45 L 434.15 353.20 L 434.12 352.96 L 434.08 352.74 L 434.03 352.53 L 433.97 352.34 L 433.89 352.16 L 433.81 351.99 L 433.71 351.83 L 433.60 351.69 L 433.60 351.69 L 433.48 351.56 L 433.35 351.44 L 433.21 351.34 L 433.06 351.25 L 432.90 351.17 L 432.73 351.11 L 432.55 351.06 L 432.35 351.03 L 432.15 351.01 L 431.93 351.00 Z' style='fill-rule: nonzero; fill: #343A40; stroke-width: 0.75; stroke: none;' />
<path d='M 439.63 349.95 L 439.63 349.95 L 439.92 349.96 L 440.19 349.99 L 440.45 350.03 L 440.69 350.10 L 440.92 350.19 L 441.14 350.29 L 441.35 350.41 L 441.54 350.56 L 441.72 350.72 L 441.88 350.90 L 441.88 350.90 L 442.03 351.09 L 442.17 351.31 L 442.29 351.53 L 442.40 351.78 L 442.49 352.04 L 442.56 352.31 L 442.61 352.60 L 442.65 352.91 L 442.68 353.24 L 442.69 353.58 L 442.69 353.58 L 442.68 353.93 L 442.65 354.26 L 442.61 354.58 L 442.55 354.88 L 442.48 355.16 L 442.39 355.43 L 442.28 355.68 L 442.15 355.92 L 442.01 356.14 L 441.85 356.34 L 441.85 356.34 L 441.68 356.53 L 441.49 356.69 L 441.29 356.83 L 441.07 356.96 L 440.84 357.07 L 440.60 357.15 L 440.34 357.22 L 440.07 357.27 L 439.79 357.30 L 439.49 357.31 L 439.49 357.31 L 439.20 357.30 L 438.93 357.27 L 438.67 357.22 L 438.42 357.16 L 438.19 357.07 L 437.97 356.97 L 437.76 356.85 L 437.56 356.71 L 437.38 356.55 L 437.21 356.37 L 437.21 356.37 L 437.06 356.18 L 436.93 355.97 L 436.81 355.74 L 436.71 355.50 L 436.62 355.24 L 436.55 354.97 L 436.49 354.68 L 436.45 354.38 L 436.43 354.06 L 436.42 353.72 L 436.42 353.72 L 436.43 353.37 L 436.46 353.03 L 436.50 352.71 L 436.56 352.40 L 436.63 352.12 L 436.72 351.84 L 436.83 351.59 L 436.96 351.35 L 437.10 351.13 L 437.26 350.93 L 437.26 350.93 L 437.43 350.74 L 437.62 350.58 L 437.82 350.43 L 438.04 350.30 L 438.27 350.19 L 438.51 350.11 L 438.77 350.04 L 439.05 349.99 L 439.33 349.96 L 439.63 349.95 ZM 439.53 351.00 L 439.53 351.00 L 439.32 351.01 L 439.12 351.03 L 438.92 351.06 L 438.74 351.11 L 438.57 351.17 L 438.41 351.24 L 438.26 351.32 L 438.12 351.42 L 437.99 351.54 L 437.88 351.66 L 437.88 351.66 L 437.77 351.80 L 437.68 351.95 L 437.60 352.12 L 437.53 352.30 L 437.47 352.49 L 437.42 352.69 L 437.38 352.91 L 437.35 353.14 L 437.34 353.38 L 437.33 353.64 L 437.33 353.64 L 437.34 353.89 L 437.35 354.14 L 437.38 354.37 L 437.42 354.59 L 437.47 354.80 L 437.53 354.99 L 437.61 355.17 L 437.69 355.34 L 437.78 355.49 L 437.89 355.64 L 437.89 355.64 L 438.01 355.76 L 438.14 355.88 L 438.28 355.97 L 438.43 356.06 L 438.59 356.13 L 438.76 356.19 L 438.94 356.24 L 439.13 356.27 L 439.33 356.29 L 439.55 356.30 L 439.55 356.30 L 439.76 356.29 L 439.96 356.27 L 440.16 356.24 L 440.34 356.20 L 440.51 356.14 L 440.67 356.07 L 440.82 355.98 L 440.96 355.88 L 441.09 355.77 L 441.20 355.65 L 441.20 355.65 L 441.31 355.51 L 441.41 355.36 L 441.50 355.20 L 441.57 355.02 L 441.64 354.83 L 441.69 354.63 L 441.73 354.42 L 441.76 354.20 L 441.77 353.96 L 441.78 353.71 L 441.78 353.71 L 441.77 353.45 L 441.76 353.20 L 441.73 352.96 L 441.69 352.74 L 441.64 352.53 L 441.57 352.34 L 441.50 352.16 L 441.41 351.99 L 441.31 351.83 L 441.20 351.69 L 441.20 351.69 L 441.09 351.56 L 440.96 351.44 L 440.82 351.34 L 440.67 351.25 L 440.51 351.17 L 440.33 351.11 L 440.15 351.06 L 439.95 351.03 L 439.75 351.01 L 439.53 351.00 Z' style='fill-rule: nonzero; fill: #343A40; stroke-width: 0.75; stroke: none;' />
<path d='M 447.24 349.95 L 447.24 349.95 L 447.52 349.96 L 447.79 349.99 L 448.05 350.03 L 448.29 350.10 L 448.53 350.19 L 448.74 350.29 L 448.95 350.41 L 449.14 350.56 L 449.32 350.72 L 449.48 350.90 L 449.48 350.90 L 449.64 351.09 L 449.77 351.31 L 449.89 351.53 L 450.00 351.78 L 450.09 352.04 L 450.16 352.31 L 450.22 352.60 L 450.26 352.91 L 450.28 353.24 L 450.29 353.58 L 450.29 353.58 L 450.28 353.93 L 450.26 354.26 L 450.21 354.58 L 450.16 354.88 L 450.08 355.16 L 449.99 355.43 L 449.88 355.68 L 449.76 355.92 L 449.61 356.14 L 449.45 356.34 L 449.45 356.34 L 449.28 356.53 L 449.09 356.69 L 448.89 356.83 L 448.68 356.96 L 448.45 357.07 L 448.20 357.15 L 447.95 357.22 L 447.68 357.27 L 447.39 357.30 L 447.09 357.31 L 447.09 357.31 L 446.81 357.30 L 446.53 357.27 L 446.27 357.22 L 446.02 357.16 L 445.79 357.07 L 445.57 356.97 L 445.36 356.85 L 445.17 356.71 L 444.99 356.55 L 444.82 356.37 L 444.82 356.37 L 444.67 356.18 L 444.53 355.97 L 444.41 355.74 L 444.31 355.50 L 444.22 355.24 L 444.15 354.97 L 444.10 354.68 L 444.06 354.38 L 444.03 354.06 L 444.03 353.72 L 444.03 353.72 L 444.03 353.37 L 444.06 353.03 L 444.10 352.71 L 444.16 352.40 L 444.23 352.12 L 444.33 351.84 L 444.44 351.59 L 444.56 351.35 L 444.70 351.13 L 444.86 350.93 L 444.86 350.93 L 445.04 350.74 L 445.22 350.58 L 445.43 350.43 L 445.64 350.30 L 445.87 350.19 L 446.12 350.11 L 446.38 350.04 L 446.65 349.99 L 446.94 349.96 L 447.24 349.95 ZM 447.14 351.00 L 447.14 351.00 L 446.92 351.01 L 446.72 351.03 L 446.53 351.06 L 446.35 351.11 L 446.18 351.17 L 446.01 351.24 L 445.87 351.32 L 445.73 351.42 L 445.60 351.54 L 445.48 351.66 L 445.48 351.66 L 445.38 351.80 L 445.28 351.95 L 445.20 352.12 L 445.13 352.30 L 445.07 352.49 L 445.02 352.69 L 444.98 352.91 L 444.96 353.14 L 444.94 353.38 L 444.93 353.64 L 444.93 353.64 L 444.94 353.89 L 444.96 354.14 L 444.98 354.37 L 445.02 354.59 L 445.07 354.80 L 445.14 354.99 L 445.21 355.17 L 445.29 355.34 L 445.39 355.49 L 445.49 355.64 L 445.49 355.64 L 445.61 355.76 L 445.74 355.88 L 445.88 355.97 L 446.03 356.06 L 446.19 356.13 L 446.36 356.19 L 446.54 356.24 L 446.73 356.27 L 446.94 356.29 L 447.15 356.30 L 447.15 356.30 L 447.36 356.29 L 447.57 356.27 L 447.76 356.24 L 447.94 356.20 L 448.11 356.14 L 448.27 356.07 L 448.42 355.98 L 448.56 355.88 L 448.69 355.77 L 448.81 355.65 L 448.81 355.65 L 448.92 355.51 L 449.01 355.36 L 449.10 355.20 L 449.18 355.02 L 449.24 354.83 L 449.29 354.63 L 449.33 354.42 L 449.36 354.20 L 449.38 353.96 L 449.38 353.71 L 449.38 353.71 L 449.38 353.45 L 449.36 353.20 L 449.33 352.96 L 449.29 352.74 L 449.24 352.53 L 449.18 352.34 L 449.10 352.16 L 449.01 351.99 L 448.92 351.83 L 448.81 351.69 L 448.81 351.69 L 448.69 351.56 L 448.56 351.44 L 448.42 351.34 L 448.27 351.25 L 448.11 351.17 L 447.94 351.11 L 447.75 351.06 L 447.56 351.03 L 447.35 351.01 L 447.14 351.00 Z' style='fill-rule: nonzero; fill: #343A40; stroke-width: 0.75; stroke: none;' />
</g>
</svg>
