<?xml version='1.0' encoding='UTF-8' ?>
<svg xmlns='http://www.w3.org/2000/svg' xmlns:xlink='http://www.w3.org/1999/xlink' class='svglite' width='504.00pt' height='360.00pt' viewBox='0 0 504.00 360.00'>
<defs>
  <style type='text/css'><![CDATA[
    .svglite line, .svglite polyline, .svglite polygon, .svglite path, .svglite rect, .svglite circle {
      fill: none;
      stroke: #000000;
      stroke-linecap: round;
      stroke-linejoin: round;
      stroke-miterlimit: 10.00;
    }
    .svglite text {
      white-space: pre;
    }
  ]]></style>
</defs>
<rect width='100%' height='100%' style='stroke: none; fill: #F2F2F2;'/>
<defs>
  <clipPath id='cpMC4wMHw1MDQuMDB8MC4wMHwzNjAuMDA='>
    <rect x='0.00' y='0.00' width='504.00' height='360.00' />
  </clipPath>
</defs>
<g clip-path='url(#cpMC4wMHw1MDQuMDB8MC4wMHwzNjAuMDA=)'>
<rect x='0.00' y='0.00' width='504.00' height='360.00' style='stroke-width: 1.75; stroke: none; fill: #F2F2F2;' />
</g>
<defs>
  <clipPath id='cpNDEuNTh8NTA0LjAwfDAuMDB8MzM5Ljkx'>
    <rect x='41.58' y='0.000000000000057' width='462.42' height='339.91' />
  </clipPath>
</defs>
<g clip-path='url(#cpNDEuNTh8NTA0LjAwfDAuMDB8MzM5Ljkx)'>
<rect x='41.58' y='0.00' width='462.42' height='339.91' style='stroke-width: 1.75; stroke: none; fill: #F2F2F2;' />
<polyline points='41.58,285.83 504.00,285.83 ' style='stroke-width: 0.87; stroke: #D9D9D9; stroke-linecap: butt;' />
<polyline points='41.58,208.58 504.00,208.58 ' style='stroke-width: 0.87; stroke: #D9D9D9; stroke-linecap: butt;' />
<polyline points='41.58,131.33 504.00,131.33 ' style='stroke-width: 0.87; stroke: #D9D9D9; stroke-linecap: butt;' />
<polyline points='41.58,54.08 504.00,54.08 ' style='stroke-width: 0.87; stroke: #D9D9D9; stroke-linecap: butt;' />
<polyline points='62.60,339.91 62.60,0.000000000000057 ' style='stroke-width: 0.87; stroke: #D9D9D9; stroke-linecap: butt;' />
<polyline points='146.67,339.91 146.67,0.000000000000057 ' style='stroke-width: 0.87; stroke: #D9D9D9; stroke-linecap: butt;' />
<polyline points='230.75,339.91 230.75,0.000000000000057 ' style='stroke-width: 0.87; stroke: #D9D9D9; stroke-linecap: butt;' />
<polyline points='314.83,339.91 314.83,0.000000000000057 ' style='stroke-width: 0.87; stroke: #D9D9D9; stroke-linecap: butt;' />
<polyline points='398.90,339.91 398.90,0.000000000000057 ' style='stroke-width: 0.87; stroke: #D9D9D9; stroke-linecap: butt;' />
<polyline points='482.98,339.91 482.98,0.000000000000057 ' style='stroke-width: 0.87; stroke: #D9D9D9; stroke-linecap: butt;' />
<polyline points='41.58,324.46 504.00,324.46 ' style='stroke-width: 1.75; stroke: #D9D9D9; stroke-linecap: butt;' />
<polyline points='41.58,247.20 504.00,247.20 ' style='stroke-width: 1.75; stroke: #D9D9D9; stroke-linecap: butt;' />
<polyline points='41.58,169.95 504.00,169.95 ' style='stroke-width: 1.75; stroke: #D9D9D9; stroke-linecap: butt;' />
<polyline points='41.58,92.70 504.00,92.70 ' style='stroke-width: 1.75; stroke: #D9D9D9; stroke-linecap: butt;' />
<polyline points='41.58,15.45 504.00,15.45 ' style='stroke-width: 1.75; stroke: #D9D9D9; stroke-linecap: butt;' />
<polyline points='104.64,339.91 104.64,0.000000000000057 ' style='stroke-width: 1.75; stroke: #D9D9D9; stroke-linecap: butt;' />
<polyline points='188.71,339.91 188.71,0.000000000000057 ' style='stroke-width: 1.75; stroke: #D9D9D9; stroke-linecap: butt;' />
<polyline points='272.79,339.91 272.79,0.000000000000057 ' style='stroke-width: 1.75; stroke: #D9D9D9; stroke-linecap: butt;' />
<polyline points='356.87,339.91 356.87,0.000000000000057 ' style='stroke-width: 1.75; stroke: #D9D9D9; stroke-linecap: butt;' />
<polyline points='440.94,339.91 440.94,0.000000000000057 ' style='stroke-width: 1.75; stroke: #D9D9D9; stroke-linecap: butt;' />
<polyline points='62.60,206.43 146.67,150.96 188.71,117.70 230.75,167.06 272.79,170.39 314.83,109.96 356.87,80.26 398.90,180.98 440.94,115.53 482.98,200.39 ' style='stroke-width: 2.13; stroke: #00008B; stroke-linecap: butt;' />
<polyline points='104.64,185.63 146.67,154.67 188.71,209.68 230.75,177.99 272.79,162.70 314.83,82.66 356.87,112.26 398.90,175.74 440.94,171.90 482.98,147.93 ' style='stroke-width: 2.13; stroke: #ADD8E6; stroke-linecap: butt;' />
<polyline points='188.71,172.19 230.75,101.78 272.79,307.69 314.83,37.78 356.87,51.80 398.90,133.35 440.94,68.61 482.98,268.49 ' style='stroke-width: 2.13; stroke: #A9A9A9; stroke-linecap: butt;' />
<circle cx='62.60' cy='206.43' r='1.95' style='stroke-width: 0.71; stroke: #00008B; fill: #00008B;' />
<circle cx='104.64' cy='185.63' r='1.95' style='stroke-width: 0.71; stroke: #ADD8E6; fill: #ADD8E6;' />
<circle cx='146.67' cy='150.96' r='1.95' style='stroke-width: 0.71; stroke: #00008B; fill: #00008B;' />
<circle cx='146.67' cy='154.67' r='1.95' style='stroke-width: 0.71; stroke: #ADD8E6; fill: #ADD8E6;' />
<circle cx='188.71' cy='117.70' r='1.95' style='stroke-width: 0.71; stroke: #00008B; fill: #00008B;' />
<circle cx='188.71' cy='209.68' r='1.95' style='stroke-width: 0.71; stroke: #ADD8E6; fill: #ADD8E6;' />
<circle cx='188.71' cy='172.19' r='1.95' style='stroke-width: 0.71; stroke: #A9A9A9; fill: #A9A9A9;' />
<circle cx='230.75' cy='167.06' r='1.95' style='stroke-width: 0.71; stroke: #00008B; fill: #00008B;' />
<circle cx='230.75' cy='177.99' r='1.95' style='stroke-width: 0.71; stroke: #ADD8E6; fill: #ADD8E6;' />
<circle cx='230.75' cy='101.78' r='1.95' style='stroke-width: 0.71; stroke: #A9A9A9; fill: #A9A9A9;' />
<circle cx='272.79' cy='170.39' r='1.95' style='stroke-width: 0.71; stroke: #00008B; fill: #00008B;' />
<circle cx='272.79' cy='162.70' r='1.95' style='stroke-width: 0.71; stroke: #ADD8E6; fill: #ADD8E6;' />
<circle cx='272.79' cy='307.69' r='1.95' style='stroke-width: 0.71; stroke: #A9A9A9; fill: #A9A9A9;' />
<circle cx='314.83' cy='109.96' r='1.95' style='stroke-width: 0.71; stroke: #00008B; fill: #00008B;' />
<circle cx='314.83' cy='82.66' r='1.95' style='stroke-width: 0.71; stroke: #ADD8E6; fill: #ADD8E6;' />
<circle cx='314.83' cy='37.78' r='1.95' style='stroke-width: 0.71; stroke: #A9A9A9; fill: #A9A9A9;' />
<circle cx='356.87' cy='80.26' r='1.95' style='stroke-width: 0.71; stroke: #00008B; fill: #00008B;' />
<circle cx='356.87' cy='112.26' r='1.95' style='stroke-width: 0.71; stroke: #ADD8E6; fill: #ADD8E6;' />
<circle cx='356.87' cy='51.80' r='1.95' style='stroke-width: 0.71; stroke: #A9A9A9; fill: #A9A9A9;' />
<circle cx='398.90' cy='180.98' r='1.95' style='stroke-width: 0.71; stroke: #00008B; fill: #00008B;' />
<circle cx='398.90' cy='175.74' r='1.95' style='stroke-width: 0.71; stroke: #ADD8E6; fill: #ADD8E6;' />
<circle cx='398.90' cy='133.35' r='1.95' style='stroke-width: 0.71; stroke: #A9A9A9; fill: #A9A9A9;' />
<circle cx='440.94' cy='115.53' r='1.95' style='stroke-width: 0.71; stroke: #00008B; fill: #00008B;' />
<circle cx='440.94' cy='171.90' r='1.95' style='stroke-width: 0.71; stroke: #ADD8E6; fill: #ADD8E6;' />
<circle cx='440.94' cy='68.61' r='1.95' style='stroke-width: 0.71; stroke: #A9A9A9; fill: #A9A9A9;' />
<circle cx='482.98' cy='200.39' r='1.95' style='stroke-width: 0.71; stroke: #00008B; fill: #00008B;' />
<circle cx='482.98' cy='147.93' r='1.95' style='stroke-width: 0.71; stroke: #ADD8E6; fill: #ADD8E6;' />
<circle cx='482.98' cy='268.49' r='1.95' style='stroke-width: 0.71; stroke: #A9A9A9; fill: #A9A9A9;' />
</g>
<g clip-path='url(#cpMC4wMHw1MDQuMDB8MC4wMHwzNjAuMDA=)'>
<path d='M 16.44 321.81 L 16.44 321.81 L 16.73 321.82 L 17.00 321.85 L 17.26 321.90 L 17.50 321.97 L 17.73 322.05 L 17.95 322.16 L 18.16 322.28 L 18.35 322.42 L 18.53 322.58 L 18.69 322.76 L 18.69 322.76 L 18.84 322.96 L 18.98 323.17 L 19.10 323.40 L 19.21 323.64 L 19.30 323.90 L 19.37 324.18 L 19.43 324.47 L 19.47 324.78 L 19.49 325.10 L 19.50 325.44 L 19.50 325.44 L 19.49 325.79 L 19.46 326.12 L 19.42 326.44 L 19.36 326.74 L 19.29 327.03 L 19.20 327.29 L 19.09 327.55 L 18.96 327.78 L 18.82 328.00 L 18.66 328.21 L 18.66 328.21 L 18.49 328.39 L 18.30 328.55 L 18.10 328.70 L 17.88 328.82 L 17.65 328.93 L 17.41 329.02 L 17.15 329.09 L 16.88 329.13 L 16.60 329.16 L 16.30 329.17 L 16.30 329.17 L 16.01 329.16 L 15.74 329.13 L 15.48 329.09 L 15.23 329.02 L 15.00 328.94 L 14.78 328.84 L 14.57 328.71 L 14.37 328.57 L 14.19 328.41 L 14.03 328.24 L 14.03 328.24 L 13.88 328.04 L 13.74 327.83 L 13.62 327.60 L 13.52 327.36 L 13.43 327.11 L 13.36 326.83 L 13.30 326.54 L 13.27 326.24 L 13.24 325.92 L 13.23 325.59 L 13.23 325.59 L 13.24 325.23 L 13.27 324.89 L 13.31 324.57 L 13.37 324.27 L 13.44 323.98 L 13.53 323.71 L 13.64 323.46 L 13.77 323.22 L 13.91 323.00 L 14.07 322.79 L 14.07 322.79 L 14.24 322.61 L 14.43 322.44 L 14.63 322.29 L 14.85 322.17 L 15.08 322.06 L 15.33 321.97 L 15.58 321.90 L 15.86 321.85 L 16.14 321.82 L 16.44 321.81 ZM 16.34 322.86 L 16.34 322.86 L 16.13 322.87 L 15.93 322.89 L 15.74 322.92 L 15.55 322.97 L 15.38 323.03 L 15.22 323.10 L 15.07 323.19 L 14.93 323.29 L 14.81 323.40 L 14.69 323.53 L 14.69 323.53 L 14.58 323.67 L 14.49 323.82 L 14.41 323.98 L 14.34 324.16 L 14.28 324.35 L 14.23 324.56 L 14.19 324.77 L 14.16 325.00 L 14.15 325.24 L 14.14 325.50 L 14.14 325.50 L 14.15 325.76 L 14.16 326.00 L 14.19 326.24 L 14.23 326.46 L 14.28 326.66 L 14.34 326.86 L 14.42 327.04 L 14.50 327.20 L 14.60 327.36 L 14.70 327.50 L 14.70 327.50 L 14.82 327.63 L 14.95 327.74 L 15.09 327.84 L 15.24 327.93 L 15.40 328.00 L 15.57 328.06 L 15.75 328.10 L 15.94 328.14 L 16.14 328.16 L 16.36 328.16 L 16.36 328.16 L 16.57 328.16 L 16.77 328.14 L 16.97 328.11 L 17.15 328.06 L 17.32 328.00 L 17.48 327.93 L 17.63 327.85 L 17.77 327.75 L 17.90 327.64 L 18.01 327.52 L 18.01 327.52 L 18.12 327.38 L 18.22 327.23 L 18.31 327.06 L 18.38 326.89 L 18.45 326.70 L 18.50 326.50 L 18.54 326.29 L 18.57 326.06 L 18.58 325.82 L 18.59 325.57 L 18.59 325.57 L 18.58 325.31 L 18.57 325.06 L 18.54 324.83 L 18.50 324.61 L 18.45 324.40 L 18.38 324.20 L 18.31 324.02 L 18.22 323.85 L 18.12 323.70 L 18.01 323.56 L 18.01 323.56 L 17.90 323.42 L 17.77 323.31 L 17.63 323.20 L 17.48 323.11 L 17.32 323.04 L 17.14 322.98 L 16.96 322.93 L 16.77 322.89 L 16.56 322.87 L 16.34 322.86 Z' style='fill-rule: nonzero; fill: #343A40; stroke-width: 0.75; stroke: none;' />
<path d='M 30.92 319.60 L 31.00 319.80 L 24.21 330.38 L 23.70 330.09 L 23.63 329.92 L 30.41 319.31 L 30.92 319.60 ZM 24.41 319.77 L 24.41 319.77 L 24.60 319.78 L 24.78 319.79 L 24.95 319.83 L 25.12 319.87 L 25.27 319.93 L 25.42 320.00 L 25.55 320.09 L 25.68 320.18 L 25.80 320.29 L 25.91 320.42 L 25.91 320.42 L 26.01 320.55 L 26.10 320.69 L 26.18 320.85 L 26.25 321.01 L 26.31 321.19 L 26.35 321.38 L 26.39 321.58 L 26.42 321.79 L 26.43 322.01 L 26.44 322.25 L 26.44 322.25 L 26.43 322.50 L 26.42 322.73 L 26.39 322.96 L 26.35 323.17 L 26.30 323.38 L 26.24 323.57 L 26.16 323.74 L 26.08 323.91 L 25.98 324.06 L 25.88 324.20 L 25.88 324.20 L 25.76 324.33 L 25.63 324.44 L 25.50 324.54 L 25.35 324.63 L 25.19 324.70 L 25.03 324.76 L 24.85 324.81 L 24.66 324.84 L 24.47 324.86 L 24.26 324.87 L 24.26 324.87 L 24.07 324.86 L 23.89 324.84 L 23.72 324.81 L 23.55 324.77 L 23.40 324.71 L 23.25 324.64 L 23.11 324.56 L 22.98 324.46 L 22.86 324.35 L 22.75 324.23 L 22.75 324.23 L 22.65 324.10 L 22.56 323.95 L 22.48 323.79 L 22.41 323.62 L 22.35 323.44 L 22.30 323.25 L 22.27 323.05 L 22.24 322.84 L 22.22 322.61 L 22.22 322.38 L 22.22 322.38 L 22.22 322.13 L 22.24 321.89 L 22.27 321.67 L 22.31 321.46 L 22.36 321.26 L 22.42 321.07 L 22.49 320.90 L 22.58 320.73 L 22.67 320.58 L 22.78 320.45 L 22.78 320.45 L 22.90 320.32 L 23.03 320.20 L 23.16 320.10 L 23.31 320.01 L 23.47 319.94 L 23.64 319.88 L 23.81 319.83 L 24.00 319.80 L 24.20 319.78 L 24.41 319.77 ZM 24.32 320.62 L 24.32 320.62 L 24.08 320.64 L 23.86 320.69 L 23.66 320.77 L 23.49 320.89 L 23.35 321.04 L 23.23 321.22 L 23.14 321.44 L 23.08 321.70 L 23.04 321.98 L 23.03 322.30 L 23.03 322.30 L 23.04 322.64 L 23.08 322.94 L 23.14 323.21 L 23.24 323.44 L 23.35 323.63 L 23.50 323.79 L 23.67 323.91 L 23.86 324.00 L 24.09 324.06 L 24.34 324.07 L 24.34 324.07 L 24.58 324.06 L 24.81 324.01 L 25.00 323.92 L 25.17 323.80 L 25.32 323.65 L 25.44 323.46 L 25.53 323.24 L 25.59 322.99 L 25.63 322.70 L 25.65 322.38 L 25.65 322.38 L 25.63 322.04 L 25.59 321.74 L 25.53 321.48 L 25.43 321.25 L 25.32 321.06 L 25.17 320.90 L 25.00 320.78 L 24.80 320.69 L 24.57 320.64 L 24.32 320.62 ZM 30.89 324.05 L 30.89 324.05 L 31.08 324.05 L 31.26 324.07 L 31.43 324.10 L 31.60 324.15 L 31.75 324.20 L 31.90 324.27 L 32.03 324.36 L 32.16 324.45 L 32.28 324.56 L 32.39 324.68 L 32.39 324.68 L 32.49 324.81 L 32.58 324.96 L 32.66 325.11 L 32.73 325.28 L 32.79 325.45 L 32.83 325.64 L 32.87 325.84 L 32.90 326.05 L 32.91 326.27 L 32.92 326.51 L 32.92 326.51 L 32.91 326.76 L 32.90 327.00 L 32.87 327.22 L 32.83 327.44 L 32.78 327.64 L 32.72 327.83 L 32.64 328.01 L 32.56 328.17 L 32.46 328.32 L 32.36 328.47 L 32.36 328.47 L 32.24 328.59 L 32.12 328.70 L 31.98 328.80 L 31.84 328.89 L 31.68 328.96 L 31.51 329.02 L 31.34 329.07 L 31.15 329.10 L 30.95 329.12 L 30.74 329.13 L 30.74 329.13 L 30.55 329.12 L 30.37 329.10 L 30.20 329.07 L 30.03 329.03 L 29.88 328.97 L 29.73 328.90 L 29.59 328.82 L 29.46 328.72 L 29.34 328.62 L 29.23 328.50 L 29.23 328.50 L 29.13 328.36 L 29.04 328.21 L 28.96 328.06 L 28.89 327.89 L 28.83 327.71 L 28.78 327.52 L 28.75 327.32 L 28.72 327.11 L 28.70 326.89 L 28.70 326.65 L 28.70 326.65 L 28.70 326.40 L 28.72 326.17 L 28.75 325.95 L 28.79 325.73 L 28.84 325.54 L 28.90 325.35 L 28.97 325.17 L 29.06 325.01 L 29.15 324.86 L 29.26 324.72 L 29.26 324.72 L 29.38 324.59 L 29.51 324.48 L 29.64 324.38 L 29.79 324.29 L 29.95 324.21 L 30.12 324.15 L 30.29 324.11 L 30.48 324.07 L 30.68 324.05 L 30.89 324.05 ZM 30.80 324.88 L 30.80 324.88 L 30.56 324.90 L 30.34 324.95 L 30.14 325.03 L 29.97 325.15 L 29.83 325.31 L 29.71 325.49 L 29.62 325.71 L 29.56 325.97 L 29.52 326.26 L 29.51 326.58 L 29.51 326.58 L 29.52 326.91 L 29.56 327.21 L 29.62 327.48 L 29.72 327.70 L 29.83 327.90 L 29.98 328.06 L 30.15 328.18 L 30.34 328.27 L 30.57 328.32 L 30.82 328.34 L 30.82 328.34 L 31.06 328.32 L 31.29 328.27 L 31.48 328.18 L 31.65 328.06 L 31.80 327.91 L 31.92 327.73 L 32.01 327.50 L 32.07 327.25 L 32.11 326.96 L 32.13 326.64 L 32.13 326.64 L 32.11 326.30 L 32.07 326.01 L 32.01 325.74 L 31.91 325.51 L 31.80 325.32 L 31.65 325.16 L 31.48 325.04 L 31.28 324.95 L 31.05 324.90 L 30.80 324.88 Z' style='fill-rule: nonzero; fill: #343A40; stroke-width: 0.75; stroke: none;' />
<path d='M 10.90 244.59 L 10.90 244.59 L 11.07 244.60 L 11.23 244.61 L 11.39 244.63 L 11.54 244.66 L 11.69 244.70 L 11.82 244.75 L 11.96 244.81 L 12.08 244.88 L 12.20 244.95 L 12.31 245.04 L 12.31 245.04 L 12.42 245.13 L 12.51 245.22 L 12.60 245.32 L 12.67 245.43 L 12.73 245.54 L 12.78 245.66 L 12.82 245.78 L 12.85 245.91 L 12.87 246.05 L 12.87 246.19 L 12.87 246.19 L 12.87 246.31 L 12.86 246.43 L 12.84 246.55 L 12.81 246.67 L 12.77 246.80 L 12.73 246.93 L 12.68 247.07 L 12.62 247.20 L 12.55 247.34 L 12.47 247.49 L 12.47 247.49 L 12.39 247.63 L 12.29 247.78 L 12.19 247.94 L 12.07 248.10 L 11.95 248.27 L 11.82 248.45 L 11.67 248.63 L 11.52 248.82 L 11.36 249.01 L 11.19 249.21 L 9.73 250.87 L 9.76 250.93 L 12.43 250.93 L 13.64 250.84 L 13.72 250.91 L 13.56 251.88 L 12.10 251.82 L 8.87 251.82 L 8.34 251.85 L 8.27 251.79 L 8.27 251.07 L 10.27 248.90 L 10.27 248.90 L 10.42 248.73 L 10.56 248.56 L 10.70 248.41 L 10.82 248.25 L 10.94 248.11 L 11.05 247.97 L 11.15 247.84 L 11.24 247.71 L 11.33 247.59 L 11.40 247.47 L 11.40 247.47 L 11.47 247.36 L 11.53 247.25 L 11.59 247.14 L 11.64 247.03 L 11.67 246.93 L 11.71 246.83 L 11.73 246.74 L 11.75 246.64 L 11.76 246.55 L 11.76 246.46 L 11.76 246.46 L 11.76 246.39 L 11.75 246.31 L 11.74 246.24 L 11.72 246.17 L 11.69 246.11 L 11.66 246.05 L 11.62 245.99 L 11.58 245.93 L 11.53 245.88 L 11.48 245.83 L 11.48 245.83 L 11.42 245.78 L 11.35 245.74 L 11.28 245.70 L 11.21 245.66 L 11.13 245.63 L 11.05 245.61 L 10.96 245.59 L 10.87 245.58 L 10.77 245.57 L 10.67 245.57 L 10.67 245.57 L 10.57 245.57 L 10.46 245.58 L 10.36 245.59 L 10.26 245.61 L 10.15 245.63 L 10.05 245.66 L 9.94 245.70 L 9.84 245.74 L 9.74 245.78 L 9.63 245.83 L 9.63 245.83 L 9.53 245.88 L 9.44 245.94 L 9.34 246.00 L 9.24 246.07 L 9.15 246.14 L 9.06 246.21 L 8.97 246.29 L 8.88 246.37 L 8.80 246.46 L 8.71 246.55 L 8.57 246.55 L 8.38 245.67 L 8.38 245.67 L 8.49 245.57 L 8.61 245.47 L 8.73 245.38 L 8.84 245.30 L 8.96 245.21 L 9.09 245.14 L 9.21 245.07 L 9.33 245.00 L 9.46 244.94 L 9.59 244.88 L 9.59 244.88 L 9.72 244.82 L 9.85 244.78 L 9.98 244.73 L 10.11 244.69 L 10.24 244.66 L 10.37 244.64 L 10.50 244.62 L 10.64 244.60 L 10.77 244.59 L 10.90 244.59 Z' style='fill-rule: nonzero; fill: #343A40; stroke-width: 0.75; stroke: none;' />
<path d='M 19.54 244.68 L 19.43 245.58 L 19.34 245.67 L 18.29 245.58 L 16.16 245.58 L 16.10 247.83 L 17.01 248.02 L 17.01 248.02 L 17.27 248.08 L 17.51 248.14 L 17.74 248.21 L 17.95 248.29 L 18.15 248.37 L 18.33 248.46 L 18.50 248.55 L 18.65 248.64 L 18.79 248.75 L 18.91 248.85 L 18.91 248.85 L 19.01 248.97 L 19.11 249.09 L 19.19 249.21 L 19.27 249.35 L 19.33 249.49 L 19.38 249.63 L 19.42 249.79 L 19.45 249.95 L 19.46 250.12 L 19.47 250.29 L 19.47 250.29 L 19.46 250.46 L 19.45 250.63 L 19.43 250.79 L 19.40 250.95 L 19.36 251.11 L 19.31 251.26 L 19.25 251.40 L 19.18 251.55 L 19.11 251.69 L 19.02 251.82 L 19.02 251.82 L 18.93 251.95 L 18.84 252.07 L 18.73 252.19 L 18.62 252.30 L 18.50 252.41 L 18.37 252.51 L 18.24 252.61 L 18.10 252.70 L 17.95 252.78 L 17.80 252.86 L 17.80 252.86 L 17.64 252.93 L 17.48 252.99 L 17.31 253.05 L 17.14 253.10 L 16.97 253.14 L 16.79 253.17 L 16.60 253.20 L 16.42 253.22 L 16.22 253.23 L 16.03 253.23 L 16.03 253.23 L 15.90 253.23 L 15.78 253.23 L 15.65 253.22 L 15.52 253.21 L 15.39 253.19 L 15.25 253.18 L 15.11 253.16 L 14.97 253.14 L 14.82 253.11 L 14.67 253.09 L 14.59 252.08 L 14.69 251.98 L 14.69 251.98 L 14.85 252.04 L 15.01 252.10 L 15.17 252.15 L 15.33 252.20 L 15.48 252.24 L 15.64 252.27 L 15.80 252.29 L 15.95 252.31 L 16.10 252.32 L 16.26 252.32 L 16.26 252.32 L 16.45 252.32 L 16.63 252.30 L 16.81 252.28 L 16.98 252.24 L 17.14 252.20 L 17.29 252.14 L 17.43 252.08 L 17.57 252.00 L 17.69 251.92 L 17.81 251.82 L 17.81 251.82 L 17.92 251.71 L 18.02 251.60 L 18.11 251.48 L 18.18 251.36 L 18.24 251.23 L 18.30 251.09 L 18.34 250.95 L 18.37 250.80 L 18.38 250.64 L 18.39 250.48 L 18.39 250.48 L 18.38 250.35 L 18.37 250.23 L 18.35 250.12 L 18.32 250.00 L 18.28 249.90 L 18.23 249.80 L 18.17 249.70 L 18.10 249.61 L 18.03 249.52 L 17.94 249.44 L 17.94 249.44 L 17.85 249.37 L 17.75 249.30 L 17.63 249.23 L 17.51 249.16 L 17.37 249.11 L 17.22 249.05 L 17.06 249.00 L 16.89 248.95 L 16.71 248.91 L 16.52 248.87 L 15.29 248.64 L 15.19 248.54 L 15.26 244.78 L 15.45 244.62 L 16.21 244.65 L 18.16 244.65 L 19.48 244.59 L 19.54 244.68 Z' style='fill-rule: nonzero; fill: #343A40; stroke-width: 0.75; stroke: none;' />
<path d='M 30.92 242.34 L 31.00 242.55 L 24.21 253.13 L 23.70 252.84 L 23.63 252.67 L 30.41 242.06 L 30.92 242.34 ZM 24.41 242.52 L 24.41 242.52 L 24.60 242.52 L 24.78 242.54 L 24.95 242.58 L 25.12 242.62 L 25.27 242.68 L 25.42 242.75 L 25.55 242.83 L 25.68 242.93 L 25.80 243.04 L 25.91 243.17 L 25.91 243.17 L 26.01 243.30 L 26.10 243.44 L 26.18 243.60 L 26.25 243.76 L 26.31 243.94 L 26.35 244.13 L 26.39 244.33 L 26.42 244.54 L 26.43 244.76 L 26.44 244.99 L 26.44 244.99 L 26.43 245.24 L 26.42 245.48 L 26.39 245.71 L 26.35 245.92 L 26.30 246.12 L 26.24 246.31 L 26.16 246.49 L 26.08 246.66 L 25.98 246.81 L 25.88 246.95 L 25.88 246.95 L 25.76 247.08 L 25.63 247.19 L 25.50 247.29 L 25.35 247.38 L 25.19 247.45 L 25.03 247.51 L 24.85 247.56 L 24.66 247.59 L 24.47 247.61 L 24.26 247.61 L 24.26 247.61 L 24.07 247.61 L 23.89 247.59 L 23.72 247.56 L 23.55 247.51 L 23.40 247.46 L 23.25 247.39 L 23.11 247.30 L 22.98 247.21 L 22.86 247.10 L 22.75 246.98 L 22.75 246.98 L 22.65 246.85 L 22.56 246.70 L 22.48 246.54 L 22.41 246.37 L 22.35 246.19 L 22.30 246.00 L 22.27 245.80 L 22.24 245.59 L 22.22 245.36 L 22.22 245.12 L 22.22 245.12 L 22.22 244.88 L 22.24 244.64 L 22.27 244.42 L 22.31 244.21 L 22.36 244.01 L 22.42 243.82 L 22.49 243.65 L 22.58 243.48 L 22.67 243.33 L 22.78 243.19 L 22.78 243.19 L 22.90 243.07 L 23.03 242.95 L 23.16 242.85 L 23.31 242.76 L 23.47 242.69 L 23.64 242.63 L 23.81 242.58 L 24.00 242.54 L 24.20 242.52 L 24.41 242.52 ZM 24.32 243.37 L 24.32 243.37 L 24.08 243.38 L 23.86 243.43 L 23.66 243.52 L 23.49 243.64 L 23.35 243.79 L 23.23 243.97 L 23.14 244.19 L 23.08 244.45 L 23.04 244.73 L 23.03 245.05 L 23.03 245.05 L 23.04 245.39 L 23.08 245.69 L 23.14 245.96 L 23.24 246.19 L 23.35 246.38 L 23.50 246.54 L 23.67 246.66 L 23.86 246.75 L 24.09 246.81 L 24.34 246.82 L 24.34 246.82 L 24.58 246.81 L 24.81 246.75 L 25.00 246.67 L 25.17 246.55 L 25.32 246.40 L 25.44 246.21 L 25.53 245.99 L 25.59 245.74 L 25.63 245.45 L 25.65 245.12 L 25.65 245.12 L 25.63 244.79 L 25.59 244.49 L 25.53 244.23 L 25.43 244.00 L 25.32 243.81 L 25.17 243.65 L 25.00 243.53 L 24.80 243.44 L 24.57 243.38 L 24.32 243.37 ZM 30.89 246.79 L 30.89 246.79 L 31.08 246.80 L 31.26 246.82 L 31.43 246.85 L 31.60 246.90 L 31.75 246.95 L 31.90 247.02 L 32.03 247.10 L 32.16 247.20 L 32.28 247.31 L 32.39 247.43 L 32.39 247.43 L 32.49 247.56 L 32.58 247.70 L 32.66 247.86 L 32.73 248.02 L 32.79 248.20 L 32.83 248.39 L 32.87 248.59 L 32.90 248.80 L 32.91 249.02 L 32.92 249.26 L 32.92 249.26 L 32.91 249.51 L 32.90 249.75 L 32.87 249.97 L 32.83 250.19 L 32.78 250.39 L 32.72 250.58 L 32.64 250.75 L 32.56 250.92 L 32.46 251.07 L 32.36 251.21 L 32.36 251.21 L 32.24 251.34 L 32.12 251.45 L 31.98 251.55 L 31.84 251.64 L 31.68 251.71 L 31.51 251.77 L 31.34 251.82 L 31.15 251.85 L 30.95 251.87 L 30.74 251.88 L 30.74 251.88 L 30.55 251.87 L 30.37 251.85 L 30.20 251.82 L 30.03 251.78 L 29.88 251.72 L 29.73 251.65 L 29.59 251.57 L 29.46 251.47 L 29.34 251.36 L 29.23 251.24 L 29.23 251.24 L 29.13 251.11 L 29.04 250.96 L 28.96 250.81 L 28.89 250.64 L 28.83 250.46 L 28.78 250.27 L 28.75 250.07 L 28.72 249.86 L 28.70 249.63 L 28.70 249.40 L 28.70 249.40 L 28.70 249.15 L 28.72 248.92 L 28.75 248.69 L 28.79 248.48 L 28.84 248.28 L 28.90 248.10 L 28.97 247.92 L 29.06 247.76 L 29.15 247.61 L 29.26 247.47 L 29.26 247.47 L 29.38 247.34 L 29.51 247.23 L 29.64 247.13 L 29.79 247.04 L 29.95 246.96 L 30.12 246.90 L 30.29 246.86 L 30.48 246.82 L 30.68 246.80 L 30.89 246.79 ZM 30.80 247.63 L 30.80 247.63 L 30.56 247.65 L 30.34 247.70 L 30.14 247.78 L 29.97 247.90 L 29.83 248.05 L 29.71 248.24 L 29.62 248.46 L 29.56 248.72 L 29.52 249.01 L 29.51 249.33 L 29.51 249.33 L 29.52 249.66 L 29.56 249.96 L 29.62 250.22 L 29.72 250.45 L 29.83 250.65 L 29.98 250.80 L 30.15 250.93 L 30.34 251.02 L 30.57 251.07 L 30.82 251.09 L 30.82 251.09 L 31.06 251.07 L 31.29 251.02 L 31.48 250.93 L 31.65 250.81 L 31.80 250.66 L 31.92 250.47 L 32.01 250.25 L 32.07 250.00 L 32.11 249.71 L 32.13 249.39 L 32.13 249.39 L 32.11 249.05 L 32.07 248.75 L 32.01 248.49 L 31.91 248.26 L 31.80 248.07 L 31.65 247.91 L 31.48 247.79 L 31.28 247.70 L 31.05 247.65 L 30.80 247.63 Z' style='fill-rule: nonzero; fill: #343A40; stroke-width: 0.75; stroke: none;' />
<path d='M 11.94 167.43 L 11.82 168.33 L 11.74 168.42 L 10.68 168.33 L 8.55 168.33 L 8.50 170.58 L 9.40 170.77 L 9.40 170.77 L 9.66 170.83 L 9.91 170.89 L 10.14 170.96 L 10.35 171.04 L 10.55 171.12 L 10.73 171.21 L 10.90 171.30 L 11.05 171.39 L 11.18 171.50 L 11.30 171.60 L 11.30 171.60 L 11.41 171.71 L 11.51 171.83 L 11.59 171.96 L 11.66 172.09 L 11.73 172.24 L 11.78 172.38 L 11.82 172.54 L 11.84 172.70 L 11.86 172.87 L 11.87 173.04 L 11.87 173.04 L 11.86 173.21 L 11.85 173.38 L 11.83 173.54 L 11.79 173.70 L 11.75 173.86 L 11.70 174.01 L 11.65 174.15 L 11.58 174.30 L 11.50 174.43 L 11.42 174.57 L 11.42 174.57 L 11.33 174.70 L 11.23 174.82 L 11.13 174.94 L 11.02 175.05 L 10.90 175.16 L 10.77 175.26 L 10.64 175.35 L 10.50 175.44 L 10.35 175.53 L 10.20 175.61 L 10.20 175.61 L 10.04 175.68 L 9.88 175.74 L 9.71 175.80 L 9.54 175.84 L 9.36 175.89 L 9.18 175.92 L 9.00 175.95 L 8.81 175.96 L 8.62 175.98 L 8.42 175.98 L 8.42 175.98 L 8.30 175.98 L 8.18 175.97 L 8.05 175.97 L 7.92 175.96 L 7.78 175.94 L 7.65 175.93 L 7.51 175.91 L 7.36 175.89 L 7.22 175.86 L 7.07 175.84 L 6.98 174.83 L 7.08 174.73 L 7.08 174.73 L 7.25 174.79 L 7.41 174.85 L 7.56 174.90 L 7.72 174.95 L 7.88 174.99 L 8.04 175.02 L 8.19 175.04 L 8.35 175.06 L 8.50 175.07 L 8.65 175.07 L 8.65 175.07 L 8.85 175.07 L 9.03 175.05 L 9.21 175.03 L 9.37 174.99 L 9.53 174.95 L 9.68 174.89 L 9.83 174.83 L 9.96 174.75 L 10.09 174.66 L 10.21 174.57 L 10.21 174.57 L 10.32 174.46 L 10.42 174.35 L 10.50 174.23 L 10.58 174.11 L 10.64 173.97 L 10.69 173.84 L 10.73 173.69 L 10.76 173.55 L 10.78 173.39 L 10.79 173.23 L 10.79 173.23 L 10.78 173.10 L 10.77 172.98 L 10.75 172.86 L 10.71 172.75 L 10.67 172.65 L 10.62 172.54 L 10.57 172.45 L 10.50 172.36 L 10.42 172.27 L 10.34 172.19 L 10.34 172.19 L 10.25 172.12 L 10.14 172.04 L 10.03 171.98 L 9.90 171.91 L 9.77 171.85 L 9.62 171.80 L 9.46 171.75 L 9.29 171.70 L 9.11 171.66 L 8.91 171.62 L 7.69 171.39 L 7.59 171.29 L 7.66 167.53 L 7.85 167.37 L 8.61 167.40 L 10.56 167.40 L 11.88 167.34 L 11.94 167.43 Z' style='fill-rule: nonzero; fill: #343A40; stroke-width: 0.75; stroke: none;' />
<path d='M 16.44 167.31 L 16.44 167.31 L 16.73 167.32 L 17.00 167.35 L 17.26 167.40 L 17.50 167.46 L 17.73 167.55 L 17.95 167.65 L 18.16 167.78 L 18.35 167.92 L 18.53 168.08 L 18.69 168.26 L 18.69 168.26 L 18.84 168.46 L 18.98 168.67 L 19.10 168.90 L 19.21 169.14 L 19.30 169.40 L 19.37 169.67 L 19.43 169.97 L 19.47 170.27 L 19.49 170.60 L 19.50 170.94 L 19.50 170.94 L 19.49 171.29 L 19.46 171.62 L 19.42 171.94 L 19.36 172.24 L 19.29 172.52 L 19.20 172.79 L 19.09 173.04 L 18.96 173.28 L 18.82 173.50 L 18.66 173.70 L 18.66 173.70 L 18.49 173.89 L 18.30 174.05 L 18.10 174.20 L 17.88 174.32 L 17.65 174.43 L 17.41 174.51 L 17.15 174.58 L 16.88 174.63 L 16.60 174.66 L 16.30 174.67 L 16.30 174.67 L 16.01 174.66 L 15.74 174.63 L 15.48 174.58 L 15.23 174.52 L 15.00 174.44 L 14.78 174.33 L 14.57 174.21 L 14.37 174.07 L 14.19 173.91 L 14.03 173.73 L 14.03 173.73 L 13.88 173.54 L 13.74 173.33 L 13.62 173.10 L 13.52 172.86 L 13.43 172.60 L 13.36 172.33 L 13.30 172.04 L 13.27 171.74 L 13.24 171.42 L 13.23 171.08 L 13.23 171.08 L 13.24 170.73 L 13.27 170.39 L 13.31 170.07 L 13.37 169.77 L 13.44 169.48 L 13.53 169.21 L 13.64 168.95 L 13.77 168.72 L 13.91 168.49 L 14.07 168.29 L 14.07 168.29 L 14.24 168.10 L 14.43 167.94 L 14.63 167.79 L 14.85 167.66 L 15.08 167.56 L 15.33 167.47 L 15.58 167.40 L 15.86 167.35 L 16.14 167.32 L 16.44 167.31 ZM 16.34 168.36 L 16.34 168.36 L 16.13 168.37 L 15.93 168.39 L 15.74 168.42 L 15.55 168.47 L 15.38 168.53 L 15.22 168.60 L 15.07 168.69 L 14.93 168.79 L 14.81 168.90 L 14.69 169.02 L 14.69 169.02 L 14.58 169.16 L 14.49 169.32 L 14.41 169.48 L 14.34 169.66 L 14.28 169.85 L 14.23 170.05 L 14.19 170.27 L 14.16 170.50 L 14.15 170.74 L 14.14 171.00 L 14.14 171.00 L 14.15 171.26 L 14.16 171.50 L 14.19 171.73 L 14.23 171.95 L 14.28 172.16 L 14.34 172.35 L 14.42 172.53 L 14.50 172.70 L 14.60 172.86 L 14.70 173.00 L 14.70 173.00 L 14.82 173.12 L 14.95 173.24 L 15.09 173.34 L 15.24 173.42 L 15.40 173.50 L 15.57 173.56 L 15.75 173.60 L 15.94 173.63 L 16.14 173.65 L 16.36 173.66 L 16.36 173.66 L 16.57 173.65 L 16.77 173.64 L 16.97 173.60 L 17.15 173.56 L 17.32 173.50 L 17.48 173.43 L 17.63 173.34 L 17.77 173.25 L 17.90 173.14 L 18.01 173.01 L 18.01 173.01 L 18.12 172.87 L 18.22 172.72 L 18.31 172.56 L 18.38 172.38 L 18.45 172.20 L 18.50 172.00 L 18.54 171.78 L 18.57 171.56 L 18.58 171.32 L 18.59 171.07 L 18.59 171.07 L 18.58 170.81 L 18.57 170.56 L 18.54 170.33 L 18.50 170.10 L 18.45 169.90 L 18.38 169.70 L 18.31 169.52 L 18.22 169.35 L 18.12 169.20 L 18.01 169.05 L 18.01 169.05 L 17.90 168.92 L 17.77 168.80 L 17.63 168.70 L 17.48 168.61 L 17.32 168.53 L 17.14 168.47 L 16.96 168.42 L 16.77 168.39 L 16.56 168.37 L 16.34 168.36 Z' style='fill-rule: nonzero; fill: #343A40; stroke-width: 0.75; stroke: none;' />
<path d='M 30.92 165.09 L 31.00 165.29 L 24.21 175.88 L 23.70 175.59 L 23.63 175.42 L 30.41 164.81 L 30.92 165.09 ZM 24.41 165.27 L 24.41 165.27 L 24.60 165.27 L 24.78 165.29 L 24.95 165.32 L 25.12 165.37 L 25.27 165.43 L 25.42 165.50 L 25.55 165.58 L 25.68 165.68 L 25.80 165.79 L 25.91 165.91 L 25.91 165.91 L 26.01 166.05 L 26.10 166.19 L 26.18 166.34 L 26.25 166.51 L 26.31 166.69 L 26.35 166.88 L 26.39 167.08 L 26.42 167.29 L 26.43 167.51 L 26.44 167.74 L 26.44 167.74 L 26.43 167.99 L 26.42 168.23 L 26.39 168.46 L 26.35 168.67 L 26.30 168.87 L 26.24 169.06 L 26.16 169.24 L 26.08 169.41 L 25.98 169.56 L 25.88 169.70 L 25.88 169.70 L 25.76 169.83 L 25.63 169.94 L 25.50 170.04 L 25.35 170.13 L 25.19 170.20 L 25.03 170.26 L 24.85 170.30 L 24.66 170.34 L 24.47 170.36 L 24.26 170.36 L 24.26 170.36 L 24.07 170.36 L 23.89 170.34 L 23.72 170.31 L 23.55 170.26 L 23.40 170.21 L 23.25 170.14 L 23.11 170.05 L 22.98 169.96 L 22.86 169.85 L 22.75 169.73 L 22.75 169.73 L 22.65 169.59 L 22.56 169.45 L 22.48 169.29 L 22.41 169.12 L 22.35 168.94 L 22.30 168.75 L 22.27 168.55 L 22.24 168.33 L 22.22 168.11 L 22.22 167.87 L 22.22 167.87 L 22.22 167.62 L 22.24 167.39 L 22.27 167.17 L 22.31 166.96 L 22.36 166.76 L 22.42 166.57 L 22.49 166.39 L 22.58 166.23 L 22.67 166.08 L 22.78 165.94 L 22.78 165.94 L 22.90 165.81 L 23.03 165.70 L 23.16 165.60 L 23.31 165.51 L 23.47 165.44 L 23.64 165.37 L 23.81 165.33 L 24.00 165.29 L 24.20 165.27 L 24.41 165.27 ZM 24.32 166.12 L 24.32 166.12 L 24.08 166.13 L 23.86 166.18 L 23.66 166.27 L 23.49 166.39 L 23.35 166.54 L 23.23 166.72 L 23.14 166.94 L 23.08 167.19 L 23.04 167.48 L 23.03 167.80 L 23.03 167.80 L 23.04 168.14 L 23.08 168.44 L 23.14 168.70 L 23.24 168.93 L 23.35 169.13 L 23.50 169.29 L 23.67 169.41 L 23.86 169.50 L 24.09 169.55 L 24.34 169.57 L 24.34 169.57 L 24.58 169.55 L 24.81 169.50 L 25.00 169.42 L 25.17 169.30 L 25.32 169.15 L 25.44 168.96 L 25.53 168.74 L 25.59 168.48 L 25.63 168.20 L 25.65 167.87 L 25.65 167.87 L 25.63 167.54 L 25.59 167.24 L 25.53 166.98 L 25.43 166.75 L 25.32 166.55 L 25.17 166.40 L 25.00 166.27 L 24.80 166.19 L 24.57 166.13 L 24.32 166.12 ZM 30.89 169.54 L 30.89 169.54 L 31.08 169.55 L 31.26 169.57 L 31.43 169.60 L 31.60 169.64 L 31.75 169.70 L 31.90 169.77 L 32.03 169.85 L 32.16 169.95 L 32.28 170.06 L 32.39 170.18 L 32.39 170.18 L 32.49 170.31 L 32.58 170.45 L 32.66 170.61 L 32.73 170.77 L 32.79 170.95 L 32.83 171.14 L 32.87 171.34 L 32.90 171.55 L 32.91 171.77 L 32.92 172.01 L 32.92 172.01 L 32.91 172.26 L 32.90 172.49 L 32.87 172.72 L 32.83 172.93 L 32.78 173.14 L 32.72 173.33 L 32.64 173.50 L 32.56 173.67 L 32.46 173.82 L 32.36 173.96 L 32.36 173.96 L 32.24 174.09 L 32.12 174.20 L 31.98 174.30 L 31.84 174.39 L 31.68 174.46 L 31.51 174.52 L 31.34 174.57 L 31.15 174.60 L 30.95 174.62 L 30.74 174.63 L 30.74 174.63 L 30.55 174.62 L 30.37 174.60 L 30.20 174.57 L 30.03 174.52 L 29.88 174.47 L 29.73 174.40 L 29.59 174.32 L 29.46 174.22 L 29.34 174.11 L 29.23 173.99 L 29.23 173.99 L 29.13 173.86 L 29.04 173.71 L 28.96 173.55 L 28.89 173.39 L 28.83 173.21 L 28.78 173.02 L 28.75 172.82 L 28.72 172.61 L 28.70 172.38 L 28.70 172.15 L 28.70 172.15 L 28.70 171.90 L 28.72 171.67 L 28.75 171.44 L 28.79 171.23 L 28.84 171.03 L 28.90 170.85 L 28.97 170.67 L 29.06 170.51 L 29.15 170.36 L 29.26 170.22 L 29.26 170.22 L 29.38 170.09 L 29.51 169.98 L 29.64 169.87 L 29.79 169.79 L 29.95 169.71 L 30.12 169.65 L 30.29 169.60 L 30.48 169.57 L 30.68 169.55 L 30.89 169.54 ZM 30.80 170.38 L 30.80 170.38 L 30.56 170.39 L 30.34 170.45 L 30.14 170.53 L 29.97 170.65 L 29.83 170.80 L 29.71 170.99 L 29.62 171.21 L 29.56 171.47 L 29.52 171.75 L 29.51 172.08 L 29.51 172.08 L 29.52 172.41 L 29.56 172.71 L 29.62 172.97 L 29.72 173.20 L 29.83 173.39 L 29.98 173.55 L 30.15 173.68 L 30.34 173.76 L 30.57 173.82 L 30.82 173.83 L 30.82 173.83 L 31.06 173.82 L 31.29 173.77 L 31.48 173.68 L 31.65 173.56 L 31.80 173.41 L 31.92 173.22 L 32.01 173.00 L 32.07 172.75 L 32.11 172.46 L 32.13 172.13 L 32.13 172.13 L 32.11 171.80 L 32.07 171.50 L 32.01 171.24 L 31.91 171.01 L 31.80 170.82 L 31.65 170.66 L 31.48 170.54 L 31.28 170.45 L 31.05 170.40 L 30.80 170.38 Z' style='fill-rule: nonzero; fill: #343A40; stroke-width: 0.75; stroke: none;' />
<path d='M 9.82 90.15 L 13.12 90.15 L 13.72 90.12 L 13.74 90.97 L 10.94 97.07 L 10.30 98.79 L 9.37 98.53 L 9.30 98.34 L 12.66 91.10 L 9.62 91.10 L 8.52 91.21 L 8.45 91.08 L 8.52 90.10 L 9.82 90.15 Z' style='fill-rule: nonzero; fill: #343A40; stroke-width: 0.75; stroke: none;' />
<path d='M 19.54 90.17 L 19.43 91.08 L 19.34 91.17 L 18.29 91.08 L 16.16 91.08 L 16.10 93.33 L 17.01 93.52 L 17.01 93.52 L 17.27 93.58 L 17.51 93.64 L 17.74 93.71 L 17.95 93.79 L 18.15 93.87 L 18.33 93.95 L 18.50 94.05 L 18.65 94.14 L 18.79 94.24 L 18.91 94.35 L 18.91 94.35 L 19.01 94.46 L 19.11 94.58 L 19.19 94.71 L 19.27 94.84 L 19.33 94.98 L 19.38 95.13 L 19.42 95.29 L 19.45 95.45 L 19.46 95.62 L 19.47 95.79 L 19.47 95.79 L 19.46 95.96 L 19.45 96.13 L 19.43 96.29 L 19.40 96.45 L 19.36 96.60 L 19.31 96.75 L 19.25 96.90 L 19.18 97.04 L 19.11 97.18 L 19.02 97.32 L 19.02 97.32 L 18.93 97.45 L 18.84 97.57 L 18.73 97.69 L 18.62 97.80 L 18.50 97.91 L 18.37 98.01 L 18.24 98.10 L 18.10 98.19 L 17.95 98.28 L 17.80 98.35 L 17.80 98.35 L 17.64 98.42 L 17.48 98.49 L 17.31 98.54 L 17.14 98.59 L 16.97 98.63 L 16.79 98.67 L 16.60 98.69 L 16.42 98.71 L 16.22 98.72 L 16.03 98.73 L 16.03 98.73 L 15.90 98.73 L 15.78 98.72 L 15.65 98.72 L 15.52 98.71 L 15.39 98.69 L 15.25 98.68 L 15.11 98.66 L 14.97 98.64 L 14.82 98.61 L 14.67 98.58 L 14.59 97.58 L 14.69 97.48 L 14.69 97.48 L 14.85 97.54 L 15.01 97.60 L 15.17 97.65 L 15.33 97.70 L 15.48 97.73 L 15.64 97.77 L 15.80 97.79 L 15.95 97.81 L 16.10 97.82 L 16.26 97.82 L 16.26 97.82 L 16.45 97.82 L 16.63 97.80 L 16.81 97.78 L 16.98 97.74 L 17.14 97.69 L 17.29 97.64 L 17.43 97.57 L 17.57 97.50 L 17.69 97.41 L 17.81 97.32 L 17.81 97.32 L 17.92 97.21 L 18.02 97.10 L 18.11 96.98 L 18.18 96.85 L 18.24 96.72 L 18.30 96.59 L 18.34 96.44 L 18.37 96.29 L 18.38 96.14 L 18.39 95.98 L 18.39 95.98 L 18.38 95.85 L 18.37 95.73 L 18.35 95.61 L 18.32 95.50 L 18.28 95.39 L 18.23 95.29 L 18.17 95.20 L 18.10 95.11 L 18.03 95.02 L 17.94 94.94 L 17.94 94.94 L 17.85 94.87 L 17.75 94.79 L 17.63 94.73 L 17.51 94.66 L 17.37 94.60 L 17.22 94.55 L 17.06 94.50 L 16.89 94.45 L 16.71 94.40 L 16.52 94.36 L 15.29 94.13 L 15.19 94.03 L 15.26 90.28 L 15.45 90.12 L 16.21 90.15 L 18.16 90.15 L 19.48 90.09 L 19.54 90.17 Z' style='fill-rule: nonzero; fill: #343A40; stroke-width: 0.75; stroke: none;' />
<path d='M 30.92 87.84 L 31.00 88.04 L 24.21 98.63 L 23.70 98.34 L 23.63 98.17 L 30.41 87.55 L 30.92 87.84 ZM 24.41 88.01 L 24.41 88.01 L 24.60 88.02 L 24.78 88.04 L 24.95 88.07 L 25.12 88.12 L 25.27 88.18 L 25.42 88.25 L 25.55 88.33 L 25.68 88.43 L 25.80 88.54 L 25.91 88.66 L 25.91 88.66 L 26.01 88.79 L 26.10 88.94 L 26.18 89.09 L 26.25 89.26 L 26.31 89.44 L 26.35 89.63 L 26.39 89.82 L 26.42 90.04 L 26.43 90.26 L 26.44 90.49 L 26.44 90.49 L 26.43 90.74 L 26.42 90.98 L 26.39 91.21 L 26.35 91.42 L 26.30 91.62 L 26.24 91.81 L 26.16 91.99 L 26.08 92.15 L 25.98 92.31 L 25.88 92.45 L 25.88 92.45 L 25.76 92.58 L 25.63 92.69 L 25.50 92.79 L 25.35 92.87 L 25.19 92.95 L 25.03 93.01 L 24.85 93.05 L 24.66 93.09 L 24.47 93.11 L 24.26 93.11 L 24.26 93.11 L 24.07 93.11 L 23.89 93.09 L 23.72 93.06 L 23.55 93.01 L 23.40 92.95 L 23.25 92.88 L 23.11 92.80 L 22.98 92.71 L 22.86 92.60 L 22.75 92.48 L 22.75 92.48 L 22.65 92.34 L 22.56 92.20 L 22.48 92.04 L 22.41 91.87 L 22.35 91.69 L 22.30 91.50 L 22.27 91.30 L 22.24 91.08 L 22.22 90.86 L 22.22 90.62 L 22.22 90.62 L 22.22 90.37 L 22.24 90.14 L 22.27 89.92 L 22.31 89.70 L 22.36 89.50 L 22.42 89.32 L 22.49 89.14 L 22.58 88.98 L 22.67 88.83 L 22.78 88.69 L 22.78 88.69 L 22.90 88.56 L 23.03 88.45 L 23.16 88.35 L 23.31 88.26 L 23.47 88.18 L 23.64 88.12 L 23.81 88.08 L 24.00 88.04 L 24.20 88.02 L 24.41 88.01 ZM 24.32 88.86 L 24.32 88.86 L 24.08 88.88 L 23.86 88.93 L 23.66 89.02 L 23.49 89.13 L 23.35 89.29 L 23.23 89.47 L 23.14 89.69 L 23.08 89.94 L 23.04 90.23 L 23.03 90.55 L 23.03 90.55 L 23.04 90.89 L 23.08 91.19 L 23.14 91.45 L 23.24 91.68 L 23.35 91.88 L 23.50 92.04 L 23.67 92.16 L 23.86 92.25 L 24.09 92.30 L 24.34 92.32 L 24.34 92.32 L 24.58 92.30 L 24.81 92.25 L 25.00 92.17 L 25.17 92.05 L 25.32 91.90 L 25.44 91.71 L 25.53 91.49 L 25.59 91.23 L 25.63 90.94 L 25.65 90.62 L 25.65 90.62 L 25.63 90.29 L 25.59 89.99 L 25.53 89.72 L 25.43 89.50 L 25.32 89.30 L 25.17 89.15 L 25.00 89.02 L 24.80 88.93 L 24.57 88.88 L 24.32 88.86 ZM 30.89 92.29 L 30.89 92.29 L 31.08 92.30 L 31.26 92.32 L 31.43 92.35 L 31.60 92.39 L 31.75 92.45 L 31.90 92.52 L 32.03 92.60 L 32.16 92.70 L 32.28 92.80 L 32.39 92.92 L 32.39 92.92 L 32.49 93.06 L 32.58 93.20 L 32.66 93.36 L 32.73 93.52 L 32.79 93.70 L 32.83 93.89 L 32.87 94.09 L 32.90 94.30 L 32.91 94.52 L 32.92 94.75 L 32.92 94.75 L 32.91 95.00 L 32.90 95.24 L 32.87 95.47 L 32.83 95.68 L 32.78 95.88 L 32.72 96.07 L 32.64 96.25 L 32.56 96.42 L 32.46 96.57 L 32.36 96.71 L 32.36 96.71 L 32.24 96.84 L 32.12 96.95 L 31.98 97.05 L 31.84 97.14 L 31.68 97.21 L 31.51 97.27 L 31.34 97.31 L 31.15 97.35 L 30.95 97.37 L 30.74 97.37 L 30.74 97.37 L 30.55 97.37 L 30.37 97.35 L 30.20 97.32 L 30.03 97.27 L 29.88 97.22 L 29.73 97.15 L 29.59 97.06 L 29.46 96.97 L 29.34 96.86 L 29.23 96.74 L 29.23 96.74 L 29.13 96.61 L 29.04 96.46 L 28.96 96.30 L 28.89 96.13 L 28.83 95.96 L 28.78 95.77 L 28.75 95.57 L 28.72 95.35 L 28.70 95.13 L 28.70 94.90 L 28.70 94.90 L 28.70 94.65 L 28.72 94.42 L 28.75 94.19 L 28.79 93.98 L 28.84 93.78 L 28.90 93.59 L 28.97 93.42 L 29.06 93.26 L 29.15 93.11 L 29.26 92.97 L 29.26 92.97 L 29.38 92.84 L 29.51 92.72 L 29.64 92.62 L 29.79 92.53 L 29.95 92.46 L 30.12 92.40 L 30.29 92.35 L 30.48 92.32 L 30.68 92.30 L 30.89 92.29 ZM 30.80 93.13 L 30.80 93.13 L 30.56 93.14 L 30.34 93.19 L 30.14 93.28 L 29.97 93.40 L 29.83 93.55 L 29.71 93.74 L 29.62 93.96 L 29.56 94.21 L 29.52 94.50 L 29.51 94.83 L 29.51 94.83 L 29.52 95.16 L 29.56 95.46 L 29.62 95.72 L 29.72 95.95 L 29.83 96.14 L 29.98 96.30 L 30.15 96.42 L 30.34 96.51 L 30.57 96.56 L 30.82 96.58 L 30.82 96.58 L 31.06 96.57 L 31.29 96.51 L 31.48 96.43 L 31.65 96.31 L 31.80 96.16 L 31.92 95.97 L 32.01 95.75 L 32.07 95.50 L 32.11 95.21 L 32.13 94.88 L 32.13 94.88 L 32.11 94.55 L 32.07 94.25 L 32.01 93.99 L 31.91 93.76 L 31.80 93.57 L 31.65 93.41 L 31.48 93.28 L 31.28 93.20 L 31.05 93.14 L 30.80 93.13 Z' style='fill-rule: nonzero; fill: #343A40; stroke-width: 0.75; stroke: none;' />
<path d='M 3.24 12.95 L 3.17 17.08 L 3.23 20.07 L 2.07 20.07 L 2.15 17.23 L 2.13 14.15 L 0.27 14.67 L 0.16 14.61 L 0.16 13.70 L 3.07 12.84 L 3.24 12.95 Z' style='fill-rule: nonzero; fill: #343A40; stroke-width: 0.75; stroke: none;' />
<path d='M 8.84 12.81 L 8.84 12.81 L 9.13 12.82 L 9.40 12.85 L 9.65 12.89 L 9.90 12.96 L 10.13 13.05 L 10.35 13.15 L 10.55 13.27 L 10.74 13.42 L 10.92 13.58 L 11.09 13.76 L 11.09 13.76 L 11.24 13.95 L 11.38 14.16 L 11.50 14.39 L 11.60 14.64 L 11.69 14.90 L 11.77 15.17 L 11.82 15.46 L 11.86 15.77 L 11.89 16.10 L 11.89 16.44 L 11.89 16.44 L 11.89 16.79 L 11.86 17.12 L 11.82 17.44 L 11.76 17.74 L 11.69 18.02 L 11.59 18.29 L 11.49 18.54 L 11.36 18.78 L 11.22 19.00 L 11.06 19.20 L 11.06 19.20 L 10.89 19.38 L 10.70 19.55 L 10.50 19.69 L 10.28 19.82 L 10.05 19.93 L 9.81 20.01 L 9.55 20.08 L 9.28 20.13 L 9.00 20.16 L 8.70 20.17 L 8.70 20.17 L 8.41 20.16 L 8.14 20.13 L 7.88 20.08 L 7.63 20.02 L 7.39 19.93 L 7.17 19.83 L 6.97 19.71 L 6.77 19.57 L 6.59 19.41 L 6.42 19.23 L 6.42 19.23 L 6.27 19.04 L 6.14 18.82 L 6.02 18.60 L 5.92 18.36 L 5.83 18.10 L 5.76 17.83 L 5.70 17.54 L 5.66 17.24 L 5.64 16.92 L 5.63 16.58 L 5.63 16.58 L 5.64 16.23 L 5.66 15.89 L 5.71 15.57 L 5.76 15.26 L 5.84 14.98 L 5.93 14.70 L 6.04 14.45 L 6.16 14.21 L 6.31 13.99 L 6.47 13.79 L 6.47 13.79 L 6.64 13.60 L 6.83 13.43 L 7.03 13.29 L 7.25 13.16 L 7.48 13.05 L 7.72 12.96 L 7.98 12.90 L 8.25 12.85 L 8.54 12.82 L 8.84 12.81 ZM 8.74 13.86 L 8.74 13.86 L 8.53 13.87 L 8.32 13.89 L 8.13 13.92 L 7.95 13.97 L 7.78 14.02 L 7.62 14.10 L 7.47 14.18 L 7.33 14.28 L 7.20 14.40 L 7.08 14.52 L 7.08 14.52 L 6.98 14.66 L 6.89 14.81 L 6.81 14.98 L 6.73 15.16 L 6.67 15.35 L 6.63 15.55 L 6.59 15.77 L 6.56 16.00 L 6.54 16.24 L 6.54 16.49 L 6.54 16.49 L 6.54 16.75 L 6.56 17.00 L 6.59 17.23 L 6.63 17.45 L 6.68 17.66 L 6.74 17.85 L 6.81 18.03 L 6.90 18.20 L 6.99 18.35 L 7.10 18.50 L 7.10 18.50 L 7.22 18.62 L 7.35 18.73 L 7.48 18.83 L 7.63 18.92 L 7.79 18.99 L 7.96 19.05 L 8.15 19.10 L 8.34 19.13 L 8.54 19.15 L 8.76 19.16 L 8.76 19.16 L 8.97 19.15 L 9.17 19.13 L 9.36 19.10 L 9.55 19.05 L 9.72 19.00 L 9.88 18.93 L 10.03 18.84 L 10.17 18.74 L 10.29 18.63 L 10.41 18.51 L 10.41 18.51 L 10.52 18.37 L 10.62 18.22 L 10.70 18.06 L 10.78 17.88 L 10.84 17.69 L 10.90 17.49 L 10.94 17.28 L 10.96 17.05 L 10.98 16.82 L 10.99 16.57 L 10.99 16.57 L 10.98 16.31 L 10.96 16.06 L 10.94 15.82 L 10.90 15.60 L 10.84 15.39 L 10.78 15.20 L 10.70 15.02 L 10.62 14.85 L 10.52 14.69 L 10.41 14.55 L 10.41 14.55 L 10.29 14.42 L 10.16 14.30 L 10.02 14.20 L 9.87 14.11 L 9.71 14.03 L 9.54 13.97 L 9.36 13.92 L 9.16 13.89 L 8.96 13.87 L 8.74 13.86 Z' style='fill-rule: nonzero; fill: #343A40; stroke-width: 0.75; stroke: none;' />
<path d='M 16.44 12.81 L 16.44 12.81 L 16.73 12.82 L 17.00 12.85 L 17.26 12.89 L 17.50 12.96 L 17.73 13.05 L 17.95 13.15 L 18.16 13.27 L 18.35 13.42 L 18.53 13.58 L 18.69 13.76 L 18.69 13.76 L 18.84 13.95 L 18.98 14.16 L 19.10 14.39 L 19.21 14.64 L 19.30 14.90 L 19.37 15.17 L 19.43 15.46 L 19.47 15.77 L 19.49 16.10 L 19.50 16.44 L 19.50 16.44 L 19.49 16.79 L 19.46 17.12 L 19.42 17.44 L 19.36 17.74 L 19.29 18.02 L 19.20 18.29 L 19.09 18.54 L 18.96 18.78 L 18.82 19.00 L 18.66 19.20 L 18.66 19.20 L 18.49 19.38 L 18.30 19.55 L 18.10 19.69 L 17.88 19.82 L 17.65 19.93 L 17.41 20.01 L 17.15 20.08 L 16.88 20.13 L 16.60 20.16 L 16.30 20.17 L 16.30 20.17 L 16.01 20.16 L 15.74 20.13 L 15.48 20.08 L 15.23 20.02 L 15.00 19.93 L 14.78 19.83 L 14.57 19.71 L 14.37 19.57 L 14.19 19.41 L 14.03 19.23 L 14.03 19.23 L 13.88 19.04 L 13.74 18.82 L 13.62 18.60 L 13.52 18.36 L 13.43 18.10 L 13.36 17.83 L 13.30 17.54 L 13.27 17.24 L 13.24 16.92 L 13.23 16.58 L 13.23 16.58 L 13.24 16.23 L 13.27 15.89 L 13.31 15.57 L 13.37 15.26 L 13.44 14.98 L 13.53 14.70 L 13.64 14.45 L 13.77 14.21 L 13.91 13.99 L 14.07 13.79 L 14.07 13.79 L 14.24 13.60 L 14.43 13.43 L 14.63 13.29 L 14.85 13.16 L 15.08 13.05 L 15.33 12.96 L 15.58 12.90 L 15.86 12.85 L 16.14 12.82 L 16.44 12.81 ZM 16.34 13.86 L 16.34 13.86 L 16.13 13.87 L 15.93 13.89 L 15.74 13.92 L 15.55 13.97 L 15.38 14.02 L 15.22 14.10 L 15.07 14.18 L 14.93 14.28 L 14.81 14.40 L 14.69 14.52 L 14.69 14.52 L 14.58 14.66 L 14.49 14.81 L 14.41 14.98 L 14.34 15.16 L 14.28 15.35 L 14.23 15.55 L 14.19 15.77 L 14.16 16.00 L 14.15 16.24 L 14.14 16.49 L 14.14 16.49 L 14.15 16.75 L 14.16 17.00 L 14.19 17.23 L 14.23 17.45 L 14.28 17.66 L 14.34 17.85 L 14.42 18.03 L 14.50 18.20 L 14.60 18.35 L 14.70 18.50 L 14.70 18.50 L 14.82 18.62 L 14.95 18.73 L 15.09 18.83 L 15.24 18.92 L 15.40 18.99 L 15.57 19.05 L 15.75 19.10 L 15.94 19.13 L 16.14 19.15 L 16.36 19.16 L 16.36 19.16 L 16.57 19.15 L 16.77 19.13 L 16.97 19.10 L 17.15 19.05 L 17.32 19.00 L 17.48 18.93 L 17.63 18.84 L 17.77 18.74 L 17.90 18.63 L 18.01 18.51 L 18.01 18.51 L 18.12 18.37 L 18.22 18.22 L 18.31 18.06 L 18.38 17.88 L 18.45 17.69 L 18.50 17.49 L 18.54 17.28 L 18.57 17.05 L 18.58 16.82 L 18.59 16.57 L 18.59 16.57 L 18.58 16.31 L 18.57 16.06 L 18.54 15.82 L 18.50 15.60 L 18.45 15.39 L 18.38 15.20 L 18.31 15.02 L 18.22 14.85 L 18.12 14.69 L 18.01 14.55 L 18.01 14.55 L 17.90 14.42 L 17.77 14.30 L 17.63 14.20 L 17.48 14.11 L 17.32 14.03 L 17.14 13.97 L 16.96 13.92 L 16.77 13.89 L 16.56 13.87 L 16.34 13.86 Z' style='fill-rule: nonzero; fill: #343A40; stroke-width: 0.75; stroke: none;' />
<path d='M 30.92 10.59 L 31.00 10.79 L 24.21 21.38 L 23.70 21.09 L 23.63 20.92 L 30.41 10.30 L 30.92 10.59 ZM 24.41 10.76 L 24.41 10.76 L 24.60 10.77 L 24.78 10.79 L 24.95 10.82 L 25.12 10.87 L 25.27 10.93 L 25.42 11.00 L 25.55 11.08 L 25.68 11.18 L 25.80 11.29 L 25.91 11.41 L 25.91 11.41 L 26.01 11.54 L 26.10 11.69 L 26.18 11.84 L 26.25 12.01 L 26.31 12.19 L 26.35 12.37 L 26.39 12.57 L 26.42 12.78 L 26.43 13.01 L 26.44 13.24 L 26.44 13.24 L 26.43 13.49 L 26.42 13.73 L 26.39 13.95 L 26.35 14.17 L 26.30 14.37 L 26.24 14.56 L 26.16 14.74 L 26.08 14.90 L 25.98 15.06 L 25.88 15.20 L 25.88 15.20 L 25.76 15.32 L 25.63 15.44 L 25.50 15.54 L 25.35 15.62 L 25.19 15.70 L 25.03 15.75 L 24.85 15.80 L 24.66 15.83 L 24.47 15.85 L 24.26 15.86 L 24.26 15.86 L 24.07 15.85 L 23.89 15.84 L 23.72 15.80 L 23.55 15.76 L 23.40 15.70 L 23.25 15.63 L 23.11 15.55 L 22.98 15.46 L 22.86 15.35 L 22.75 15.23 L 22.75 15.23 L 22.65 15.09 L 22.56 14.95 L 22.48 14.79 L 22.41 14.62 L 22.35 14.44 L 22.30 14.25 L 22.27 14.04 L 22.24 13.83 L 22.22 13.61 L 22.22 13.37 L 22.22 13.37 L 22.22 13.12 L 22.24 12.89 L 22.27 12.66 L 22.31 12.45 L 22.36 12.25 L 22.42 12.07 L 22.49 11.89 L 22.58 11.73 L 22.67 11.58 L 22.78 11.44 L 22.78 11.44 L 22.90 11.31 L 23.03 11.20 L 23.16 11.09 L 23.31 11.01 L 23.47 10.93 L 23.64 10.87 L 23.81 10.82 L 24.00 10.79 L 24.20 10.77 L 24.41 10.76 ZM 24.32 11.61 L 24.32 11.61 L 24.08 11.63 L 23.86 11.68 L 23.66 11.76 L 23.49 11.88 L 23.35 12.03 L 23.23 12.22 L 23.14 12.44 L 23.08 12.69 L 23.04 12.98 L 23.03 13.30 L 23.03 13.30 L 23.04 13.63 L 23.08 13.94 L 23.14 14.20 L 23.24 14.43 L 23.35 14.63 L 23.50 14.79 L 23.67 14.91 L 23.86 15.00 L 24.09 15.05 L 24.34 15.07 L 24.34 15.07 L 24.58 15.05 L 24.81 15.00 L 25.00 14.92 L 25.17 14.80 L 25.32 14.64 L 25.44 14.46 L 25.53 14.24 L 25.59 13.98 L 25.63 13.69 L 25.65 13.37 L 25.65 13.37 L 25.63 13.04 L 25.59 12.74 L 25.53 12.47 L 25.43 12.25 L 25.32 12.05 L 25.17 11.89 L 25.00 11.77 L 24.80 11.68 L 24.57 11.63 L 24.32 11.61 ZM 30.89 15.04 L 30.89 15.04 L 31.08 15.05 L 31.26 15.07 L 31.43 15.10 L 31.60 15.14 L 31.75 15.20 L 31.90 15.27 L 32.03 15.35 L 32.16 15.45 L 32.28 15.55 L 32.39 15.67 L 32.39 15.67 L 32.49 15.81 L 32.58 15.95 L 32.66 16.10 L 32.73 16.27 L 32.79 16.45 L 32.83 16.64 L 32.87 16.84 L 32.90 17.05 L 32.91 17.27 L 32.92 17.50 L 32.92 17.50 L 32.91 17.75 L 32.90 17.99 L 32.87 18.22 L 32.83 18.43 L 32.78 18.63 L 32.72 18.82 L 32.64 19.00 L 32.56 19.17 L 32.46 19.32 L 32.36 19.46 L 32.36 19.46 L 32.24 19.59 L 32.12 19.70 L 31.98 19.80 L 31.84 19.88 L 31.68 19.96 L 31.51 20.02 L 31.34 20.06 L 31.15 20.10 L 30.95 20.12 L 30.74 20.12 L 30.74 20.12 L 30.55 20.12 L 30.37 20.10 L 30.20 20.07 L 30.03 20.02 L 29.88 19.96 L 29.73 19.89 L 29.59 19.81 L 29.46 19.72 L 29.34 19.61 L 29.23 19.49 L 29.23 19.49 L 29.13 19.35 L 29.04 19.21 L 28.96 19.05 L 28.89 18.88 L 28.83 18.70 L 28.78 18.51 L 28.75 18.31 L 28.72 18.10 L 28.70 17.88 L 28.70 17.65 L 28.70 17.65 L 28.70 17.40 L 28.72 17.16 L 28.75 16.94 L 28.79 16.73 L 28.84 16.53 L 28.90 16.34 L 28.97 16.17 L 29.06 16.01 L 29.15 15.86 L 29.26 15.72 L 29.26 15.72 L 29.38 15.59 L 29.51 15.47 L 29.64 15.37 L 29.79 15.28 L 29.95 15.21 L 30.12 15.15 L 30.29 15.10 L 30.48 15.07 L 30.68 15.05 L 30.89 15.04 ZM 30.80 15.88 L 30.80 15.88 L 30.56 15.89 L 30.34 15.94 L 30.14 16.03 L 29.97 16.15 L 29.83 16.30 L 29.71 16.49 L 29.62 16.71 L 29.56 16.96 L 29.52 17.25 L 29.51 17.57 L 29.51 17.57 L 29.52 17.91 L 29.56 18.21 L 29.62 18.47 L 29.72 18.70 L 29.83 18.89 L 29.98 19.05 L 30.15 19.17 L 30.34 19.26 L 30.57 19.31 L 30.82 19.33 L 30.82 19.33 L 31.06 19.31 L 31.29 19.26 L 31.48 19.18 L 31.65 19.06 L 31.80 18.91 L 31.92 18.72 L 32.01 18.50 L 32.07 18.24 L 32.11 17.95 L 32.13 17.63 L 32.13 17.63 L 32.11 17.30 L 32.07 17.00 L 32.01 16.74 L 31.91 16.51 L 31.80 16.31 L 31.65 16.16 L 31.48 16.03 L 31.28 15.95 L 31.05 15.89 L 30.80 15.88 Z' style='fill-rule: nonzero; fill: #343A40; stroke-width: 0.75; stroke: none;' />
<path d='M 94.94 350.09 L 94.87 354.23 L 94.92 357.21 L 93.77 357.21 L 93.84 354.37 L 93.83 351.29 L 91.97 351.81 L 91.86 351.75 L 91.86 350.84 L 94.76 349.98 L 94.94 350.09 Z' style='fill-rule: nonzero; fill: #343A40; stroke-width: 0.75; stroke: none;' />
<path d='M 99.57 355.05 L 99.57 355.05 L 99.36 355.04 L 99.16 355.02 L 98.97 354.99 L 98.78 354.94 L 98.61 354.88 L 98.44 354.81 L 98.29 354.72 L 98.14 354.62 L 98.00 354.51 L 97.88 354.38 L 97.88 354.38 L 97.76 354.25 L 97.66 354.10 L 97.57 353.95 L 97.49 353.78 L 97.42 353.61 L 97.37 353.43 L 97.32 353.24 L 97.29 353.04 L 97.28 352.83 L 97.27 352.61 L 97.27 352.61 L 97.28 352.38 L 97.30 352.15 L 97.34 351.94 L 97.39 351.73 L 97.46 351.53 L 97.54 351.34 L 97.64 351.16 L 97.75 350.99 L 97.88 350.82 L 98.02 350.67 L 98.02 350.67 L 98.17 350.52 L 98.34 350.39 L 98.52 350.28 L 98.71 350.18 L 98.91 350.10 L 99.12 350.03 L 99.34 349.97 L 99.58 349.94 L 99.82 349.91 L 100.08 349.91 L 100.08 349.91 L 100.34 349.91 L 100.58 349.94 L 100.81 349.98 L 101.03 350.04 L 101.24 350.11 L 101.43 350.20 L 101.62 350.31 L 101.78 350.43 L 101.94 350.57 L 102.08 350.73 L 102.08 350.73 L 102.21 350.90 L 102.32 351.08 L 102.43 351.28 L 102.51 351.49 L 102.59 351.72 L 102.65 351.96 L 102.70 352.21 L 102.73 352.48 L 102.75 352.76 L 102.76 353.06 L 102.76 353.06 L 102.75 353.42 L 102.71 353.78 L 102.66 354.12 L 102.58 354.46 L 102.48 354.79 L 102.35 355.11 L 102.21 355.43 L 102.04 355.74 L 101.85 356.04 L 101.63 356.33 L 101.63 356.33 L 101.40 356.61 L 101.15 356.88 L 100.89 357.13 L 100.60 357.38 L 100.29 357.61 L 99.97 357.83 L 99.63 358.03 L 99.27 358.23 L 98.89 358.41 L 98.49 358.57 L 98.42 358.57 L 97.53 358.06 L 97.53 357.94 L 97.53 357.94 L 97.87 357.82 L 98.19 357.69 L 98.50 357.56 L 98.79 357.42 L 99.07 357.28 L 99.33 357.13 L 99.57 356.98 L 99.81 356.83 L 100.02 356.67 L 100.22 356.50 L 100.22 356.50 L 100.41 356.33 L 100.59 356.15 L 100.75 355.97 L 100.90 355.78 L 101.04 355.59 L 101.16 355.38 L 101.28 355.18 L 101.37 354.96 L 101.46 354.74 L 101.53 354.51 L 101.45 354.41 L 101.45 354.41 L 101.27 354.53 L 101.10 354.64 L 100.92 354.74 L 100.73 354.82 L 100.55 354.89 L 100.36 354.95 L 100.17 354.99 L 99.97 355.02 L 99.77 355.04 L 99.57 355.05 ZM 99.99 350.70 L 99.99 350.70 L 99.83 350.70 L 99.68 350.72 L 99.54 350.74 L 99.40 350.77 L 99.28 350.81 L 99.15 350.86 L 99.04 350.92 L 98.93 350.99 L 98.83 351.07 L 98.74 351.16 L 98.74 351.16 L 98.65 351.25 L 98.58 351.35 L 98.51 351.46 L 98.45 351.58 L 98.40 351.71 L 98.36 351.84 L 98.33 351.98 L 98.31 352.13 L 98.30 352.29 L 98.29 352.45 L 98.29 352.45 L 98.30 352.62 L 98.31 352.77 L 98.33 352.92 L 98.36 353.06 L 98.40 353.20 L 98.44 353.32 L 98.50 353.44 L 98.56 353.55 L 98.63 353.65 L 98.71 353.75 L 98.71 353.75 L 98.80 353.84 L 98.89 353.91 L 98.99 353.98 L 99.10 354.04 L 99.21 354.09 L 99.34 354.13 L 99.46 354.16 L 99.60 354.18 L 99.74 354.19 L 99.89 354.20 L 99.89 354.20 L 100.08 354.19 L 100.27 354.17 L 100.45 354.13 L 100.64 354.08 L 100.82 354.01 L 101.00 353.93 L 101.18 353.83 L 101.36 353.72 L 101.53 353.59 L 101.71 353.45 L 101.71 353.45 L 101.71 353.42 L 101.71 353.39 L 101.71 353.36 L 101.71 353.32 L 101.72 353.29 L 101.72 353.25 L 101.72 353.20 L 101.72 353.16 L 101.72 353.11 L 101.72 353.06 L 101.72 353.06 L 101.72 352.83 L 101.70 352.61 L 101.68 352.40 L 101.65 352.21 L 101.62 352.03 L 101.57 351.85 L 101.52 351.70 L 101.45 351.55 L 101.38 351.41 L 101.30 351.29 L 101.30 351.29 L 101.21 351.18 L 101.12 351.08 L 101.01 350.99 L 100.89 350.91 L 100.77 350.85 L 100.63 350.79 L 100.48 350.75 L 100.33 350.72 L 100.17 350.70 L 99.99 350.70 Z' style='fill-rule: nonzero; fill: #343A40; stroke-width: 0.75; stroke: none;' />
<path d='M 106.73 349.98 L 106.73 349.98 L 106.90 349.98 L 107.06 350.00 L 107.22 350.02 L 107.37 350.05 L 107.52 350.09 L 107.65 350.14 L 107.79 350.20 L 107.91 350.26 L 108.03 350.34 L 108.14 350.42 L 108.14 350.42 L 108.25 350.51 L 108.34 350.61 L 108.43 350.71 L 108.50 350.82 L 108.56 350.93 L 108.61 351.05 L 108.65 351.17 L 108.68 351.30 L 108.70 351.43 L 108.70 351.58 L 108.70 351.58 L 108.70 351.69 L 108.69 351.81 L 108.67 351.93 L 108.64 352.06 L 108.60 352.19 L 108.56 352.32 L 108.51 352.45 L 108.45 352.59 L 108.38 352.73 L 108.30 352.87 L 108.30 352.87 L 108.22 353.02 L 108.12 353.17 L 108.02 353.32 L 107.90 353.49 L 107.78 353.66 L 107.65 353.83 L 107.50 354.02 L 107.35 354.20 L 107.19 354.40 L 107.02 354.60 L 105.56 356.26 L 105.59 356.31 L 108.26 356.31 L 109.47 356.23 L 109.55 356.30 L 109.40 357.26 L 107.93 357.21 L 104.70 357.21 L 104.17 357.24 L 104.10 357.18 L 104.10 356.46 L 106.10 354.28 L 106.10 354.28 L 106.25 354.11 L 106.39 353.95 L 106.53 353.79 L 106.65 353.64 L 106.77 353.49 L 106.88 353.36 L 106.98 353.22 L 107.07 353.09 L 107.16 352.97 L 107.24 352.86 L 107.24 352.86 L 107.30 352.74 L 107.36 352.63 L 107.42 352.52 L 107.47 352.42 L 107.51 352.32 L 107.54 352.22 L 107.56 352.12 L 107.58 352.03 L 107.59 351.94 L 107.60 351.85 L 107.60 351.85 L 107.59 351.77 L 107.58 351.70 L 107.57 351.63 L 107.55 351.56 L 107.52 351.50 L 107.49 351.43 L 107.45 351.38 L 107.41 351.32 L 107.36 351.27 L 107.31 351.22 L 107.31 351.22 L 107.25 351.17 L 107.18 351.12 L 107.11 351.08 L 107.04 351.05 L 106.96 351.02 L 106.88 351.00 L 106.79 350.98 L 106.70 350.97 L 106.60 350.96 L 106.50 350.96 L 106.50 350.96 L 106.40 350.96 L 106.29 350.97 L 106.19 350.98 L 106.09 351.00 L 105.98 351.02 L 105.88 351.05 L 105.78 351.08 L 105.67 351.12 L 105.57 351.17 L 105.46 351.22 L 105.46 351.22 L 105.36 351.27 L 105.27 351.33 L 105.17 351.39 L 105.07 351.46 L 104.98 351.53 L 104.89 351.60 L 104.80 351.68 L 104.71 351.76 L 104.63 351.85 L 104.54 351.94 L 104.40 351.94 L 104.21 351.06 L 104.21 351.06 L 104.32 350.96 L 104.44 350.86 L 104.56 350.77 L 104.67 350.68 L 104.79 350.60 L 104.92 350.52 L 105.04 350.45 L 105.17 350.38 L 105.29 350.32 L 105.42 350.27 L 105.42 350.27 L 105.55 350.21 L 105.68 350.16 L 105.81 350.12 L 105.94 350.08 L 106.07 350.05 L 106.20 350.02 L 106.34 350.00 L 106.47 349.99 L 106.60 349.98 L 106.73 349.98 Z' style='fill-rule: nonzero; fill: #343A40; stroke-width: 0.75; stroke: none;' />
<path d='M 113.86 349.95 L 113.86 349.95 L 114.14 349.96 L 114.41 349.99 L 114.67 350.03 L 114.92 350.10 L 115.15 350.19 L 115.37 350.29 L 115.57 350.41 L 115.76 350.56 L 115.94 350.72 L 116.11 350.90 L 116.11 350.90 L 116.26 351.09 L 116.40 351.31 L 116.52 351.53 L 116.62 351.78 L 116.71 352.04 L 116.78 352.31 L 116.84 352.60 L 116.88 352.91 L 116.90 353.24 L 116.91 353.58 L 116.91 353.58 L 116.90 353.93 L 116.88 354.26 L 116.84 354.58 L 116.78 354.88 L 116.70 355.16 L 116.61 355.43 L 116.50 355.68 L 116.38 355.92 L 116.24 356.14 L 116.08 356.34 L 116.08 356.34 L 115.90 356.53 L 115.72 356.69 L 115.51 356.83 L 115.30 356.96 L 115.07 357.07 L 114.83 357.15 L 114.57 357.22 L 114.30 357.27 L 114.01 357.30 L 113.72 357.31 L 113.72 357.31 L 113.43 357.30 L 113.15 357.27 L 112.89 357.22 L 112.65 357.16 L 112.41 357.07 L 112.19 356.97 L 111.98 356.85 L 111.79 356.71 L 111.61 356.55 L 111.44 356.37 L 111.44 356.37 L 111.29 356.18 L 111.15 355.97 L 111.04 355.74 L 110.93 355.50 L 110.85 355.24 L 110.77 354.97 L 110.72 354.68 L 110.68 354.38 L 110.66 354.06 L 110.65 353.72 L 110.65 353.72 L 110.66 353.37 L 110.68 353.03 L 110.72 352.71 L 110.78 352.40 L 110.86 352.12 L 110.95 351.84 L 111.06 351.59 L 111.18 351.35 L 111.32 351.13 L 111.48 350.93 L 111.48 350.93 L 111.66 350.74 L 111.85 350.58 L 112.05 350.43 L 112.26 350.30 L 112.49 350.19 L 112.74 350.11 L 113.00 350.04 L 113.27 349.99 L 113.56 349.96 L 113.86 349.95 ZM 113.76 351.00 L 113.76 351.00 L 113.54 351.01 L 113.34 351.03 L 113.15 351.06 L 112.97 351.11 L 112.80 351.17 L 112.64 351.24 L 112.49 351.32 L 112.35 351.42 L 112.22 351.54 L 112.10 351.66 L 112.10 351.66 L 112.00 351.80 L 111.91 351.95 L 111.82 352.12 L 111.75 352.30 L 111.69 352.49 L 111.64 352.69 L 111.60 352.91 L 111.58 353.14 L 111.56 353.38 L 111.56 353.64 L 111.56 353.64 L 111.56 353.89 L 111.58 354.14 L 111.61 354.37 L 111.65 354.59 L 111.70 354.80 L 111.76 354.99 L 111.83 355.17 L 111.91 355.34 L 112.01 355.49 L 112.12 355.64 L 112.12 355.64 L 112.23 355.76 L 112.36 355.88 L 112.50 355.97 L 112.65 356.06 L 112.81 356.13 L 112.98 356.19 L 113.16 356.24 L 113.36 356.27 L 113.56 356.29 L 113.77 356.30 L 113.77 356.30 L 113.99 356.29 L 114.19 356.27 L 114.38 356.24 L 114.56 356.20 L 114.73 356.14 L 114.89 356.07 L 115.04 355.98 L 115.18 355.88 L 115.31 355.77 L 115.43 355.65 L 115.43 355.65 L 115.54 355.51 L 115.64 355.36 L 115.72 355.20 L 115.80 355.02 L 115.86 354.83 L 115.91 354.63 L 115.95 354.42 L 115.98 354.20 L 116.00 353.96 L 116.00 353.71 L 116.00 353.71 L 116.00 353.45 L 115.98 353.20 L 115.95 352.96 L 115.91 352.74 L 115.86 352.53 L 115.80 352.34 L 115.72 352.16 L 115.64 351.99 L 115.54 351.83 L 115.43 351.69 L 115.43 351.69 L 115.31 351.56 L 115.18 351.44 L 115.04 351.34 L 114.89 351.25 L 114.73 351.17 L 114.56 351.11 L 114.37 351.06 L 114.18 351.03 L 113.97 351.01 L 113.76 351.00 Z' style='fill-rule: nonzero; fill: #343A40; stroke-width: 0.75; stroke: none;' />
<path d='M 178.83 350.09 L 178.76 354.23 L 178.81 357.21 L 177.66 357.21 L 177.73 354.37 L 177.72 351.29 L 175.86 351.81 L 175.75 351.75 L 175.75 350.84 L 178.65 349.98 L 178.83 350.09 Z' style='fill-rule: nonzero; fill: #343A40; stroke-width: 0.75; stroke: none;' />
<path d='M 183.46 355.05 L 183.46 355.05 L 183.25 355.04 L 183.05 355.02 L 182.86 354.99 L 182.67 354.94 L 182.50 354.88 L 182.33 354.81 L 182.18 354.72 L 182.03 354.62 L 181.89 354.51 L 181.76 354.38 L 181.76 354.38 L 181.65 354.25 L 181.55 354.10 L 181.46 353.95 L 181.38 353.78 L 181.31 353.61 L 181.26 353.43 L 181.21 353.24 L 181.18 353.04 L 181.17 352.83 L 181.16 352.61 L 181.16 352.61 L 181.17 352.38 L 181.19 352.15 L 181.23 351.94 L 181.28 351.73 L 181.35 351.53 L 181.43 351.34 L 181.53 351.16 L 181.64 350.99 L 181.77 350.82 L 181.91 350.67 L 181.91 350.67 L 182.06 350.52 L 182.23 350.39 L 182.41 350.28 L 182.60 350.18 L 182.80 350.10 L 183.01 350.03 L 183.23 349.97 L 183.47 349.94 L 183.71 349.91 L 183.97 349.91 L 183.97 349.91 L 184.23 349.91 L 184.47 349.94 L 184.70 349.98 L 184.92 350.04 L 185.13 350.11 L 185.32 350.20 L 185.51 350.31 L 185.67 350.43 L 185.83 350.57 L 185.97 350.73 L 185.97 350.73 L 186.10 350.90 L 186.21 351.08 L 186.31 351.28 L 186.40 351.49 L 186.48 351.72 L 186.54 351.96 L 186.59 352.21 L 186.62 352.48 L 186.64 352.76 L 186.65 353.06 L 186.65 353.06 L 186.64 353.42 L 186.60 353.78 L 186.55 354.12 L 186.47 354.46 L 186.37 354.79 L 186.24 355.11 L 186.10 355.43 L 185.93 355.74 L 185.74 356.04 L 185.52 356.33 L 185.52 356.33 L 185.29 356.61 L 185.04 356.88 L 184.77 357.13 L 184.49 357.38 L 184.18 357.61 L 183.86 357.83 L 183.52 358.03 L 183.16 358.23 L 182.78 358.41 L 182.38 358.57 L 182.31 358.57 L 181.42 358.06 L 181.42 357.94 L 181.42 357.94 L 181.76 357.82 L 182.08 357.69 L 182.39 357.56 L 182.68 357.42 L 182.96 357.28 L 183.22 357.13 L 183.46 356.98 L 183.70 356.83 L 183.91 356.67 L 184.11 356.50 L 184.11 356.50 L 184.30 356.33 L 184.48 356.15 L 184.64 355.97 L 184.79 355.78 L 184.93 355.59 L 185.05 355.38 L 185.17 355.18 L 185.26 354.96 L 185.35 354.74 L 185.42 354.51 L 185.34 354.41 L 185.34 354.41 L 185.16 354.53 L 184.98 354.64 L 184.80 354.74 L 184.62 354.82 L 184.44 354.89 L 184.25 354.95 L 184.06 354.99 L 183.86 355.02 L 183.66 355.04 L 183.46 355.05 ZM 183.88 350.70 L 183.88 350.70 L 183.72 350.70 L 183.57 350.72 L 183.43 350.74 L 183.29 350.77 L 183.17 350.81 L 183.04 350.86 L 182.93 350.92 L 182.82 350.99 L 182.72 351.07 L 182.63 351.16 L 182.63 351.16 L 182.54 351.25 L 182.47 351.35 L 182.40 351.46 L 182.34 351.58 L 182.29 351.71 L 182.25 351.84 L 182.22 351.98 L 182.20 352.13 L 182.19 352.29 L 182.18 352.45 L 182.18 352.45 L 182.19 352.62 L 182.20 352.77 L 182.22 352.92 L 182.25 353.06 L 182.29 353.20 L 182.33 353.32 L 182.39 353.44 L 182.45 353.55 L 182.52 353.65 L 182.60 353.75 L 182.60 353.75 L 182.69 353.84 L 182.78 353.91 L 182.88 353.98 L 182.99 354.04 L 183.10 354.09 L 183.23 354.13 L 183.35 354.16 L 183.49 354.18 L 183.63 354.19 L 183.78 354.20 L 183.78 354.20 L 183.97 354.19 L 184.16 354.17 L 184.34 354.13 L 184.53 354.08 L 184.71 354.01 L 184.89 353.93 L 185.07 353.83 L 185.25 353.72 L 185.42 353.59 L 185.60 353.45 L 185.60 353.45 L 185.60 353.42 L 185.60 353.39 L 185.60 353.36 L 185.60 353.32 L 185.61 353.29 L 185.61 353.25 L 185.61 353.20 L 185.61 353.16 L 185.61 353.11 L 185.61 353.06 L 185.61 353.06 L 185.61 352.83 L 185.59 352.61 L 185.57 352.40 L 185.54 352.21 L 185.51 352.03 L 185.46 351.85 L 185.40 351.70 L 185.34 351.55 L 185.27 351.41 L 185.19 351.29 L 185.19 351.29 L 185.10 351.18 L 185.01 351.08 L 184.90 350.99 L 184.78 350.91 L 184.66 350.85 L 184.52 350.79 L 184.37 350.75 L 184.22 350.72 L 184.06 350.70 L 183.88 350.70 Z' style='fill-rule: nonzero; fill: #343A40; stroke-width: 0.75; stroke: none;' />
<path d='M 192.38 356.10 L 192.35 356.10 L 192.39 358.44 L 192.32 358.53 L 191.46 358.60 L 191.38 358.52 L 191.41 356.10 L 188.72 356.10 L 187.77 356.13 L 187.70 356.01 L 187.70 355.28 L 191.31 350.04 L 192.36 350.04 L 192.33 355.20 L 193.69 355.20 L 193.77 355.32 L 193.70 356.13 L 192.38 356.10 ZM 191.43 355.20 L 191.43 351.42 L 191.33 351.42 L 188.71 355.20 L 191.43 355.20 Z' style='fill-rule: nonzero; fill: #343A40; stroke-width: 0.75; stroke: none;' />
<path d='M 198.12 349.95 L 198.12 349.95 L 198.41 349.96 L 198.68 349.99 L 198.94 350.03 L 199.18 350.10 L 199.41 350.19 L 199.63 350.29 L 199.83 350.41 L 200.03 350.56 L 200.20 350.72 L 200.37 350.90 L 200.37 350.90 L 200.52 351.09 L 200.66 351.31 L 200.78 351.53 L 200.89 351.78 L 200.97 352.04 L 201.05 352.31 L 201.10 352.60 L 201.14 352.91 L 201.17 353.24 L 201.18 353.58 L 201.18 353.58 L 201.17 353.93 L 201.14 354.26 L 201.10 354.58 L 201.04 354.88 L 200.97 355.16 L 200.88 355.43 L 200.77 355.68 L 200.64 355.92 L 200.50 356.14 L 200.34 356.34 L 200.34 356.34 L 200.17 356.53 L 199.98 356.69 L 199.78 356.83 L 199.56 356.96 L 199.33 357.07 L 199.09 357.15 L 198.83 357.22 L 198.56 357.27 L 198.28 357.30 L 197.98 357.31 L 197.98 357.31 L 197.69 357.30 L 197.42 357.27 L 197.16 357.22 L 196.91 357.16 L 196.68 357.07 L 196.45 356.97 L 196.25 356.85 L 196.05 356.71 L 195.87 356.55 L 195.70 356.37 L 195.70 356.37 L 195.55 356.18 L 195.42 355.97 L 195.30 355.74 L 195.20 355.50 L 195.11 355.24 L 195.04 354.97 L 194.98 354.68 L 194.94 354.38 L 194.92 354.06 L 194.91 353.72 L 194.91 353.72 L 194.92 353.37 L 194.95 353.03 L 194.99 352.71 L 195.05 352.40 L 195.12 352.12 L 195.21 351.84 L 195.32 351.59 L 195.45 351.35 L 195.59 351.13 L 195.75 350.93 L 195.75 350.93 L 195.92 350.74 L 196.11 350.58 L 196.31 350.43 L 196.53 350.30 L 196.76 350.19 L 197.00 350.11 L 197.26 350.04 L 197.53 349.99 L 197.82 349.96 L 198.12 349.95 ZM 198.02 351.00 L 198.02 351.00 L 197.81 351.01 L 197.61 351.03 L 197.41 351.06 L 197.23 351.11 L 197.06 351.17 L 196.90 351.24 L 196.75 351.32 L 196.61 351.42 L 196.48 351.54 L 196.37 351.66 L 196.37 351.66 L 196.26 351.80 L 196.17 351.95 L 196.09 352.12 L 196.02 352.30 L 195.96 352.49 L 195.91 352.69 L 195.87 352.91 L 195.84 353.14 L 195.82 353.38 L 195.82 353.64 L 195.82 353.64 L 195.82 353.89 L 195.84 354.14 L 195.87 354.37 L 195.91 354.59 L 195.96 354.80 L 196.02 354.99 L 196.09 355.17 L 196.18 355.34 L 196.27 355.49 L 196.38 355.64 L 196.38 355.64 L 196.50 355.76 L 196.63 355.88 L 196.77 355.97 L 196.92 356.06 L 197.08 356.13 L 197.25 356.19 L 197.43 356.24 L 197.62 356.27 L 197.82 356.29 L 198.04 356.30 L 198.04 356.30 L 198.25 356.29 L 198.45 356.27 L 198.65 356.24 L 198.83 356.20 L 199.00 356.14 L 199.16 356.07 L 199.31 355.98 L 199.45 355.88 L 199.57 355.77 L 199.69 355.65 L 199.69 355.65 L 199.80 355.51 L 199.90 355.36 L 199.99 355.20 L 200.06 355.02 L 200.12 354.83 L 200.18 354.63 L 200.22 354.42 L 200.25 354.20 L 200.26 353.96 L 200.27 353.71 L 200.27 353.71 L 200.26 353.45 L 200.25 353.20 L 200.22 352.96 L 200.18 352.74 L 200.12 352.53 L 200.06 352.34 L 199.99 352.16 L 199.90 351.99 L 199.80 351.83 L 199.69 351.69 L 199.69 351.69 L 199.57 351.56 L 199.45 351.44 L 199.31 351.34 L 199.16 351.25 L 198.99 351.17 L 198.82 351.11 L 198.64 351.06 L 198.44 351.03 L 198.24 351.01 L 198.02 351.00 Z' style='fill-rule: nonzero; fill: #343A40; stroke-width: 0.75; stroke: none;' />
<path d='M 262.98 350.09 L 262.91 354.23 L 262.97 357.21 L 261.82 357.21 L 261.89 354.37 L 261.87 351.29 L 260.02 351.81 L 259.90 351.75 L 259.90 350.84 L 262.81 349.98 L 262.98 350.09 Z' style='fill-rule: nonzero; fill: #343A40; stroke-width: 0.75; stroke: none;' />
<path d='M 267.62 355.05 L 267.62 355.05 L 267.41 355.04 L 267.21 355.02 L 267.01 354.99 L 266.83 354.94 L 266.65 354.88 L 266.49 354.81 L 266.33 354.72 L 266.19 354.62 L 266.05 354.51 L 265.92 354.38 L 265.92 354.38 L 265.81 354.25 L 265.70 354.10 L 265.61 353.95 L 265.53 353.78 L 265.47 353.61 L 265.41 353.43 L 265.37 353.24 L 265.34 353.04 L 265.32 352.83 L 265.32 352.61 L 265.32 352.61 L 265.32 352.38 L 265.35 352.15 L 265.38 351.94 L 265.44 351.73 L 265.50 351.53 L 265.59 351.34 L 265.68 351.16 L 265.79 350.99 L 265.92 350.82 L 266.06 350.67 L 266.06 350.67 L 266.22 350.52 L 266.39 350.39 L 266.56 350.28 L 266.75 350.18 L 266.95 350.10 L 267.17 350.03 L 267.39 349.97 L 267.62 349.94 L 267.87 349.91 L 268.12 349.91 L 268.12 349.91 L 268.38 349.91 L 268.63 349.94 L 268.86 349.98 L 269.08 350.04 L 269.29 350.11 L 269.48 350.20 L 269.66 350.31 L 269.83 350.43 L 269.98 350.57 L 270.13 350.73 L 270.13 350.73 L 270.25 350.90 L 270.37 351.08 L 270.47 351.28 L 270.56 351.49 L 270.63 351.72 L 270.69 351.96 L 270.74 352.21 L 270.77 352.48 L 270.80 352.76 L 270.80 353.06 L 270.80 353.06 L 270.79 353.42 L 270.76 353.78 L 270.70 354.12 L 270.62 354.46 L 270.52 354.79 L 270.40 355.11 L 270.25 355.43 L 270.08 355.74 L 269.89 356.04 L 269.68 356.33 L 269.68 356.33 L 269.45 356.61 L 269.20 356.88 L 268.93 357.13 L 268.64 357.38 L 268.34 357.61 L 268.02 357.83 L 267.67 358.03 L 267.31 358.23 L 266.94 358.41 L 266.54 358.57 L 266.47 358.57 L 265.57 358.06 L 265.57 357.94 L 265.57 357.94 L 265.91 357.82 L 266.24 357.69 L 266.54 357.56 L 266.84 357.42 L 267.11 357.28 L 267.37 357.13 L 267.62 356.98 L 267.85 356.83 L 268.07 356.67 L 268.27 356.50 L 268.27 356.50 L 268.46 356.33 L 268.63 356.15 L 268.80 355.97 L 268.95 355.78 L 269.08 355.59 L 269.21 355.38 L 269.32 355.18 L 269.42 354.96 L 269.51 354.74 L 269.58 354.51 L 269.49 354.41 L 269.49 354.41 L 269.32 354.53 L 269.14 354.64 L 268.96 354.74 L 268.78 354.82 L 268.59 354.89 L 268.40 354.95 L 268.21 354.99 L 268.02 355.02 L 267.82 355.04 L 267.62 355.05 ZM 268.04 350.70 L 268.04 350.70 L 267.88 350.70 L 267.73 350.72 L 267.59 350.74 L 267.45 350.77 L 267.32 350.81 L 267.20 350.86 L 267.08 350.92 L 266.98 350.99 L 266.88 351.07 L 266.78 351.16 L 266.78 351.16 L 266.70 351.25 L 266.62 351.35 L 266.56 351.46 L 266.50 351.58 L 266.45 351.71 L 266.41 351.84 L 266.38 351.98 L 266.36 352.13 L 266.34 352.29 L 266.34 352.45 L 266.34 352.45 L 266.34 352.62 L 266.35 352.77 L 266.38 352.92 L 266.40 353.06 L 266.44 353.20 L 266.49 353.32 L 266.54 353.44 L 266.61 353.55 L 266.68 353.65 L 266.76 353.75 L 266.76 353.75 L 266.84 353.84 L 266.94 353.91 L 267.04 353.98 L 267.15 354.04 L 267.26 354.09 L 267.38 354.13 L 267.51 354.16 L 267.65 354.18 L 267.79 354.19 L 267.94 354.20 L 267.94 354.20 L 268.13 354.19 L 268.31 354.17 L 268.50 354.13 L 268.68 354.08 L 268.87 354.01 L 269.05 353.93 L 269.22 353.83 L 269.40 353.72 L 269.58 353.59 L 269.75 353.45 L 269.75 353.45 L 269.75 353.42 L 269.76 353.39 L 269.76 353.36 L 269.76 353.32 L 269.76 353.29 L 269.76 353.25 L 269.76 353.20 L 269.76 353.16 L 269.77 353.11 L 269.77 353.06 L 269.77 353.06 L 269.76 352.83 L 269.75 352.61 L 269.73 352.40 L 269.70 352.21 L 269.66 352.03 L 269.61 351.85 L 269.56 351.70 L 269.50 351.55 L 269.43 351.41 L 269.35 351.29 L 269.35 351.29 L 269.26 351.18 L 269.16 351.08 L 269.05 350.99 L 268.94 350.91 L 268.81 350.85 L 268.68 350.79 L 268.53 350.75 L 268.38 350.72 L 268.21 350.70 L 268.04 350.70 Z' style='fill-rule: nonzero; fill: #343A40; stroke-width: 0.75; stroke: none;' />
<path d='M 275.31 352.18 L 275.31 352.18 L 275.52 352.19 L 275.72 352.21 L 275.91 352.24 L 276.10 352.29 L 276.27 352.35 L 276.43 352.42 L 276.59 352.51 L 276.73 352.60 L 276.87 352.72 L 276.99 352.84 L 276.99 352.84 L 277.11 352.98 L 277.22 353.13 L 277.31 353.28 L 277.39 353.44 L 277.46 353.62 L 277.51 353.80 L 277.56 353.99 L 277.59 354.19 L 277.61 354.40 L 277.61 354.61 L 277.61 354.61 L 277.61 354.85 L 277.58 355.08 L 277.55 355.29 L 277.49 355.50 L 277.43 355.70 L 277.34 355.89 L 277.25 356.08 L 277.13 356.25 L 277.01 356.42 L 276.86 356.57 L 276.86 356.57 L 276.71 356.72 L 276.54 356.84 L 276.36 356.95 L 276.18 357.05 L 275.98 357.13 L 275.76 357.20 L 275.54 357.25 L 275.31 357.29 L 275.06 357.31 L 274.81 357.32 L 274.81 357.32 L 274.55 357.31 L 274.30 357.29 L 274.07 357.25 L 273.85 357.19 L 273.64 357.12 L 273.45 357.03 L 273.27 356.92 L 273.10 356.80 L 272.95 356.66 L 272.80 356.50 L 272.80 356.50 L 272.68 356.33 L 272.56 356.14 L 272.46 355.95 L 272.37 355.73 L 272.30 355.51 L 272.24 355.27 L 272.19 355.01 L 272.15 354.75 L 272.13 354.46 L 272.13 354.17 L 272.13 354.17 L 272.14 353.81 L 272.17 353.45 L 272.23 353.11 L 272.30 352.77 L 272.40 352.44 L 272.53 352.11 L 272.67 351.80 L 272.84 351.49 L 273.02 351.19 L 273.24 350.90 L 273.24 350.90 L 273.47 350.62 L 273.72 350.35 L 273.99 350.09 L 274.28 349.85 L 274.59 349.62 L 274.91 349.40 L 275.25 349.19 L 275.61 349.00 L 275.99 348.82 L 276.39 348.65 L 276.46 348.65 L 277.35 349.17 L 277.35 349.29 L 277.35 349.29 L 277.02 349.41 L 276.69 349.54 L 276.38 349.67 L 276.09 349.81 L 275.81 349.95 L 275.55 350.10 L 275.30 350.25 L 275.07 350.40 L 274.85 350.56 L 274.65 350.73 L 274.65 350.73 L 274.46 350.90 L 274.29 351.07 L 274.13 351.26 L 273.98 351.45 L 273.84 351.64 L 273.72 351.84 L 273.61 352.05 L 273.51 352.27 L 273.42 352.49 L 273.35 352.71 L 273.44 352.81 L 273.44 352.81 L 273.61 352.69 L 273.79 352.59 L 273.97 352.49 L 274.15 352.41 L 274.34 352.34 L 274.53 352.28 L 274.72 352.24 L 274.91 352.21 L 275.11 352.19 L 275.31 352.18 ZM 274.89 356.53 L 274.89 356.53 L 275.05 356.53 L 275.20 356.51 L 275.34 356.49 L 275.48 356.46 L 275.61 356.42 L 275.73 356.37 L 275.84 356.31 L 275.95 356.24 L 276.05 356.17 L 276.14 356.08 L 276.14 356.08 L 276.23 355.99 L 276.31 355.88 L 276.37 355.77 L 276.43 355.65 L 276.48 355.53 L 276.52 355.39 L 276.55 355.25 L 276.57 355.10 L 276.59 354.94 L 276.59 354.77 L 276.59 354.77 L 276.59 354.61 L 276.57 354.45 L 276.55 354.31 L 276.52 354.17 L 276.49 354.03 L 276.44 353.91 L 276.39 353.79 L 276.32 353.69 L 276.25 353.58 L 276.17 353.49 L 276.17 353.49 L 276.09 353.40 L 275.99 353.33 L 275.89 353.26 L 275.78 353.20 L 275.67 353.15 L 275.55 353.10 L 275.42 353.07 L 275.28 353.05 L 275.14 353.04 L 274.99 353.03 L 274.99 353.03 L 274.80 353.04 L 274.62 353.06 L 274.43 353.10 L 274.25 353.15 L 274.06 353.22 L 273.88 353.30 L 273.70 353.40 L 273.53 353.51 L 273.35 353.64 L 273.18 353.78 L 273.18 353.78 L 273.18 353.81 L 273.17 353.84 L 273.17 353.87 L 273.17 353.90 L 273.17 353.94 L 273.17 353.98 L 273.16 354.02 L 273.16 354.07 L 273.16 354.12 L 273.16 354.17 L 273.16 354.17 L 273.17 354.40 L 273.18 354.62 L 273.20 354.82 L 273.23 355.02 L 273.27 355.20 L 273.31 355.37 L 273.37 355.53 L 273.43 355.68 L 273.50 355.82 L 273.58 355.94 L 273.58 355.94 L 273.67 356.05 L 273.77 356.15 L 273.87 356.24 L 273.99 356.32 L 274.12 356.38 L 274.25 356.44 L 274.40 356.48 L 274.55 356.51 L 274.72 356.52 L 274.89 356.53 Z' style='fill-rule: nonzero; fill: #343A40; stroke-width: 0.75; stroke: none;' />
<path d='M 282.12 349.95 L 282.12 349.95 L 282.40 349.96 L 282.68 349.99 L 282.93 350.03 L 283.18 350.10 L 283.41 350.19 L 283.63 350.29 L 283.83 350.41 L 284.02 350.56 L 284.20 350.72 L 284.37 350.90 L 284.37 350.90 L 284.52 351.09 L 284.66 351.31 L 284.78 351.53 L 284.88 351.78 L 284.97 352.04 L 285.04 352.31 L 285.10 352.60 L 285.14 352.91 L 285.17 353.24 L 285.17 353.58 L 285.17 353.58 L 285.16 353.93 L 285.14 354.26 L 285.10 354.58 L 285.04 354.88 L 284.96 355.16 L 284.87 355.43 L 284.76 355.68 L 284.64 355.92 L 284.50 356.14 L 284.34 356.34 L 284.34 356.34 L 284.16 356.53 L 283.98 356.69 L 283.77 356.83 L 283.56 356.96 L 283.33 357.07 L 283.09 357.15 L 282.83 357.22 L 282.56 357.27 L 282.27 357.30 L 281.98 357.31 L 281.98 357.31 L 281.69 357.30 L 281.42 357.27 L 281.15 357.22 L 280.91 357.16 L 280.67 357.07 L 280.45 356.97 L 280.24 356.85 L 280.05 356.71 L 279.87 356.55 L 279.70 356.37 L 279.70 356.37 L 279.55 356.18 L 279.42 355.97 L 279.30 355.74 L 279.19 355.50 L 279.11 355.24 L 279.04 354.97 L 278.98 354.68 L 278.94 354.38 L 278.92 354.06 L 278.91 353.72 L 278.91 353.72 L 278.92 353.37 L 278.94 353.03 L 278.98 352.71 L 279.04 352.40 L 279.12 352.12 L 279.21 351.84 L 279.32 351.59 L 279.44 351.35 L 279.59 351.13 L 279.74 350.93 L 279.74 350.93 L 279.92 350.74 L 280.11 350.58 L 280.31 350.43 L 280.53 350.30 L 280.76 350.19 L 281.00 350.11 L 281.26 350.04 L 281.53 349.99 L 281.82 349.96 L 282.12 349.95 ZM 282.02 351.00 L 282.02 351.00 L 281.81 351.01 L 281.60 351.03 L 281.41 351.06 L 281.23 351.11 L 281.06 351.17 L 280.90 351.24 L 280.75 351.32 L 280.61 351.42 L 280.48 351.54 L 280.36 351.66 L 280.36 351.66 L 280.26 351.80 L 280.17 351.95 L 280.08 352.12 L 280.01 352.30 L 279.95 352.49 L 279.90 352.69 L 279.87 352.91 L 279.84 353.14 L 279.82 353.38 L 279.82 353.64 L 279.82 353.64 L 279.82 353.89 L 279.84 354.14 L 279.87 354.37 L 279.91 354.59 L 279.96 354.80 L 280.02 354.99 L 280.09 355.17 L 280.18 355.34 L 280.27 355.49 L 280.38 355.64 L 280.38 355.64 L 280.50 355.76 L 280.62 355.88 L 280.76 355.97 L 280.91 356.06 L 281.07 356.13 L 281.24 356.19 L 281.43 356.24 L 281.62 356.27 L 281.82 356.29 L 282.03 356.30 L 282.03 356.30 L 282.25 356.29 L 282.45 356.27 L 282.64 356.24 L 282.82 356.20 L 283.00 356.14 L 283.16 356.07 L 283.31 355.98 L 283.44 355.88 L 283.57 355.77 L 283.69 355.65 L 283.69 355.65 L 283.80 355.51 L 283.90 355.36 L 283.98 355.20 L 284.06 355.02 L 284.12 354.83 L 284.17 354.63 L 284.21 354.42 L 284.24 354.20 L 284.26 353.96 L 284.27 353.71 L 284.27 353.71 L 284.26 353.45 L 284.24 353.20 L 284.21 352.96 L 284.17 352.74 L 284.12 352.53 L 284.06 352.34 L 283.98 352.16 L 283.90 351.99 L 283.80 351.83 L 283.69 351.69 L 283.69 351.69 L 283.57 351.56 L 283.44 351.44 L 283.30 351.34 L 283.15 351.25 L 282.99 351.17 L 282.82 351.11 L 282.64 351.06 L 282.44 351.03 L 282.24 351.01 L 282.02 351.00 Z' style='fill-rule: nonzero; fill: #343A40; stroke-width: 0.75; stroke: none;' />
<path d='M 347.03 350.09 L 346.96 354.23 L 347.02 357.21 L 345.86 357.21 L 345.94 354.37 L 345.92 351.29 L 344.06 351.81 L 343.95 351.75 L 343.95 350.84 L 346.86 349.98 L 347.03 350.09 Z' style='fill-rule: nonzero; fill: #343A40; stroke-width: 0.75; stroke: none;' />
<path d='M 351.67 355.05 L 351.67 355.05 L 351.46 355.04 L 351.25 355.02 L 351.06 354.99 L 350.88 354.94 L 350.70 354.88 L 350.54 354.81 L 350.38 354.72 L 350.23 354.62 L 350.10 354.51 L 349.97 354.38 L 349.97 354.38 L 349.85 354.25 L 349.75 354.10 L 349.66 353.95 L 349.58 353.78 L 349.51 353.61 L 349.46 353.43 L 349.42 353.24 L 349.39 353.04 L 349.37 352.83 L 349.36 352.61 L 349.36 352.61 L 349.37 352.38 L 349.39 352.15 L 349.43 351.94 L 349.48 351.73 L 349.55 351.53 L 349.63 351.34 L 349.73 351.16 L 349.84 350.99 L 349.97 350.82 L 350.11 350.67 L 350.11 350.67 L 350.27 350.52 L 350.43 350.39 L 350.61 350.28 L 350.80 350.18 L 351.00 350.10 L 351.21 350.03 L 351.44 349.97 L 351.67 349.94 L 351.92 349.91 L 352.17 349.91 L 352.17 349.91 L 352.43 349.91 L 352.68 349.94 L 352.91 349.98 L 353.13 350.04 L 353.33 350.11 L 353.53 350.20 L 353.71 350.31 L 353.88 350.43 L 354.03 350.57 L 354.17 350.73 L 354.17 350.73 L 354.30 350.90 L 354.42 351.08 L 354.52 351.28 L 354.61 351.49 L 354.68 351.72 L 354.74 351.96 L 354.79 352.21 L 354.82 352.48 L 354.84 352.76 L 354.85 353.06 L 354.85 353.06 L 354.84 353.42 L 354.80 353.78 L 354.75 354.12 L 354.67 354.46 L 354.57 354.79 L 354.45 355.11 L 354.30 355.43 L 354.13 355.74 L 353.94 356.04 L 353.73 356.33 L 353.73 356.33 L 353.50 356.61 L 353.25 356.88 L 352.98 357.13 L 352.69 357.38 L 352.39 357.61 L 352.06 357.83 L 351.72 358.03 L 351.36 358.23 L 350.98 358.41 L 350.59 358.57 L 350.52 358.57 L 349.62 358.06 L 349.62 357.94 L 349.62 357.94 L 349.96 357.82 L 350.28 357.69 L 350.59 357.56 L 350.88 357.42 L 351.16 357.28 L 351.42 357.13 L 351.67 356.98 L 351.90 356.83 L 352.11 356.67 L 352.32 356.50 L 352.32 356.50 L 352.50 356.33 L 352.68 356.15 L 352.84 355.97 L 353.00 355.78 L 353.13 355.59 L 353.26 355.38 L 353.37 355.18 L 353.47 354.96 L 353.55 354.74 L 353.63 354.51 L 353.54 354.41 L 353.54 354.41 L 353.37 354.53 L 353.19 354.64 L 353.01 354.74 L 352.83 354.82 L 352.64 354.89 L 352.45 354.95 L 352.26 354.99 L 352.06 355.02 L 351.87 355.04 L 351.67 355.05 ZM 352.09 350.70 L 352.09 350.70 L 351.93 350.70 L 351.78 350.72 L 351.63 350.74 L 351.50 350.77 L 351.37 350.81 L 351.25 350.86 L 351.13 350.92 L 351.03 350.99 L 350.93 351.07 L 350.83 351.16 L 350.83 351.16 L 350.75 351.25 L 350.67 351.35 L 350.60 351.46 L 350.55 351.58 L 350.50 351.71 L 350.46 351.84 L 350.43 351.98 L 350.40 352.13 L 350.39 352.29 L 350.39 352.45 L 350.39 352.45 L 350.39 352.62 L 350.40 352.77 L 350.42 352.92 L 350.45 353.06 L 350.49 353.20 L 350.54 353.32 L 350.59 353.44 L 350.65 353.55 L 350.72 353.65 L 350.80 353.75 L 350.80 353.75 L 350.89 353.84 L 350.98 353.91 L 351.09 353.98 L 351.19 354.04 L 351.31 354.09 L 351.43 354.13 L 351.56 354.16 L 351.69 354.18 L 351.84 354.19 L 351.98 354.20 L 351.98 354.20 L 352.17 354.19 L 352.36 354.17 L 352.55 354.13 L 352.73 354.08 L 352.91 354.01 L 353.09 353.93 L 353.27 353.83 L 353.45 353.72 L 353.63 353.59 L 353.80 353.45 L 353.80 353.45 L 353.80 353.42 L 353.80 353.39 L 353.81 353.36 L 353.81 353.32 L 353.81 353.29 L 353.81 353.25 L 353.81 353.20 L 353.81 353.16 L 353.81 353.11 L 353.81 353.06 L 353.81 353.06 L 353.81 352.83 L 353.80 352.61 L 353.78 352.40 L 353.75 352.21 L 353.71 352.03 L 353.66 351.85 L 353.61 351.70 L 353.55 351.55 L 353.47 351.41 L 353.40 351.29 L 353.40 351.29 L 353.31 351.18 L 353.21 351.08 L 353.10 350.99 L 352.99 350.91 L 352.86 350.85 L 352.72 350.79 L 352.58 350.75 L 352.42 350.72 L 352.26 350.70 L 352.09 350.70 Z' style='fill-rule: nonzero; fill: #343A40; stroke-width: 0.75; stroke: none;' />
<path d='M 359.04 348.68 L 359.04 348.68 L 359.25 348.69 L 359.44 348.70 L 359.63 348.73 L 359.81 348.77 L 359.98 348.82 L 360.14 348.88 L 360.29 348.95 L 360.43 349.03 L 360.56 349.12 L 360.68 349.23 L 360.68 349.23 L 360.80 349.34 L 360.90 349.46 L 360.99 349.58 L 361.07 349.72 L 361.14 349.86 L 361.19 350.01 L 361.23 350.17 L 361.26 350.34 L 361.28 350.51 L 361.29 350.70 L 361.29 350.70 L 361.28 350.84 L 361.27 350.98 L 361.25 351.11 L 361.23 351.24 L 361.19 351.37 L 361.15 351.49 L 361.10 351.60 L 361.05 351.71 L 360.98 351.81 L 360.91 351.91 L 360.91 351.91 L 360.83 352.00 L 360.75 352.09 L 360.66 352.18 L 360.57 352.27 L 360.47 352.36 L 360.36 352.44 L 360.25 352.52 L 360.14 352.60 L 360.02 352.68 L 359.89 352.76 L 359.89 352.83 L 359.89 352.83 L 360.04 352.90 L 360.19 352.98 L 360.33 353.06 L 360.46 353.14 L 360.58 353.22 L 360.70 353.31 L 360.81 353.40 L 360.91 353.48 L 361.01 353.57 L 361.10 353.66 L 361.10 353.66 L 361.18 353.76 L 361.26 353.86 L 361.33 353.97 L 361.39 354.08 L 361.43 354.20 L 361.47 354.33 L 361.51 354.47 L 361.53 354.62 L 361.54 354.77 L 361.55 354.93 L 361.55 354.93 L 361.54 355.14 L 361.52 355.35 L 361.48 355.54 L 361.42 355.73 L 361.36 355.90 L 361.27 356.07 L 361.17 356.23 L 361.06 356.38 L 360.93 356.53 L 360.78 356.66 L 360.78 356.66 L 360.63 356.78 L 360.46 356.89 L 360.28 356.99 L 360.09 357.07 L 359.89 357.15 L 359.69 357.20 L 359.47 357.25 L 359.24 357.28 L 359.00 357.30 L 358.75 357.31 L 358.75 357.31 L 358.52 357.30 L 358.30 357.28 L 358.09 357.25 L 357.89 357.21 L 357.69 357.16 L 357.51 357.09 L 357.34 357.02 L 357.18 356.93 L 357.02 356.83 L 356.88 356.72 L 356.88 356.72 L 356.75 356.59 L 356.64 356.46 L 356.54 356.32 L 356.45 356.18 L 356.37 356.02 L 356.31 355.86 L 356.26 355.69 L 356.23 355.52 L 356.21 355.34 L 356.20 355.15 L 356.20 355.15 L 356.21 354.99 L 356.22 354.84 L 356.24 354.69 L 356.28 354.55 L 356.32 354.42 L 356.37 354.29 L 356.43 354.17 L 356.50 354.05 L 356.58 353.94 L 356.66 353.84 L 356.66 353.84 L 356.76 353.73 L 356.86 353.64 L 356.97 353.54 L 357.08 353.45 L 357.20 353.35 L 357.33 353.27 L 357.46 353.18 L 357.60 353.10 L 357.74 353.02 L 357.89 352.94 L 357.89 352.87 L 357.89 352.87 L 357.77 352.81 L 357.66 352.74 L 357.55 352.67 L 357.44 352.60 L 357.34 352.52 L 357.25 352.44 L 357.15 352.36 L 357.07 352.27 L 356.99 352.19 L 356.91 352.09 L 356.91 352.09 L 356.84 352.00 L 356.77 351.90 L 356.72 351.79 L 356.67 351.68 L 356.63 351.56 L 356.59 351.44 L 356.57 351.31 L 356.55 351.17 L 356.54 351.03 L 356.53 350.88 L 356.53 350.88 L 356.54 350.68 L 356.56 350.49 L 356.60 350.31 L 356.65 350.14 L 356.71 349.97 L 356.78 349.81 L 356.87 349.67 L 356.98 349.53 L 357.09 349.39 L 357.23 349.27 L 357.23 349.27 L 357.37 349.16 L 357.52 349.06 L 357.68 348.97 L 357.85 348.89 L 358.03 348.83 L 358.21 348.78 L 358.41 348.73 L 358.61 348.71 L 358.82 348.69 L 359.04 348.68 ZM 358.98 349.52 L 358.98 349.52 L 358.85 349.52 L 358.72 349.53 L 358.60 349.55 L 358.49 349.57 L 358.37 349.61 L 358.27 349.65 L 358.17 349.69 L 358.07 349.75 L 357.99 349.81 L 357.90 349.88 L 357.90 349.88 L 357.83 349.95 L 357.76 350.03 L 357.70 350.12 L 357.64 350.21 L 357.60 350.30 L 357.56 350.40 L 357.54 350.51 L 357.52 350.62 L 357.50 350.73 L 357.50 350.86 L 357.50 350.86 L 357.50 350.98 L 357.51 351.09 L 357.53 351.20 L 357.56 351.31 L 357.59 351.41 L 357.63 351.50 L 357.68 351.59 L 357.74 351.67 L 357.80 351.75 L 357.87 351.82 L 357.87 351.82 L 357.95 351.89 L 358.04 351.95 L 358.14 352.02 L 358.24 352.08 L 358.35 352.14 L 358.46 352.20 L 358.58 352.26 L 358.71 352.32 L 358.84 352.38 L 358.98 352.44 L 358.98 352.44 L 359.11 352.38 L 359.23 352.33 L 359.35 352.27 L 359.46 352.21 L 359.56 352.14 L 359.66 352.08 L 359.75 352.01 L 359.84 351.95 L 359.92 351.88 L 359.99 351.81 L 359.99 351.81 L 360.06 351.73 L 360.13 351.65 L 360.18 351.56 L 360.23 351.47 L 360.27 351.37 L 360.31 351.26 L 360.33 351.16 L 360.35 351.04 L 360.36 350.92 L 360.37 350.80 L 360.37 350.80 L 360.36 350.68 L 360.35 350.57 L 360.33 350.46 L 360.31 350.36 L 360.27 350.26 L 360.23 350.17 L 360.18 350.09 L 360.13 350.01 L 360.06 349.93 L 359.99 349.86 L 359.99 349.86 L 359.92 349.80 L 359.84 349.74 L 359.75 349.69 L 359.66 349.64 L 359.56 349.60 L 359.46 349.57 L 359.35 349.55 L 359.23 349.53 L 359.11 349.52 L 358.98 349.52 ZM 358.78 353.30 L 358.78 353.30 L 358.64 353.36 L 358.50 353.41 L 358.37 353.47 L 358.24 353.53 L 358.12 353.60 L 358.01 353.66 L 357.90 353.73 L 357.80 353.80 L 357.70 353.88 L 357.61 353.95 L 357.61 353.95 L 357.53 354.03 L 357.46 354.12 L 357.39 354.21 L 357.34 354.31 L 357.29 354.42 L 357.25 354.53 L 357.22 354.64 L 357.20 354.77 L 357.19 354.90 L 357.18 355.03 L 357.18 355.03 L 357.19 355.16 L 357.20 355.28 L 357.22 355.40 L 357.25 355.51 L 357.29 355.62 L 357.34 355.72 L 357.40 355.82 L 357.47 355.91 L 357.54 356.00 L 357.63 356.08 L 357.63 356.08 L 357.72 356.16 L 357.83 356.23 L 357.93 356.29 L 358.05 356.34 L 358.17 356.39 L 358.29 356.42 L 358.42 356.45 L 358.56 356.47 L 358.70 356.48 L 358.85 356.49 L 358.85 356.49 L 359.01 356.48 L 359.16 356.47 L 359.30 356.45 L 359.43 356.42 L 359.56 356.39 L 359.68 356.34 L 359.80 356.29 L 359.91 356.23 L 360.01 356.16 L 360.11 356.08 L 360.11 356.08 L 360.20 356.00 L 360.28 355.91 L 360.35 355.81 L 360.41 355.71 L 360.46 355.60 L 360.51 355.49 L 360.54 355.38 L 360.56 355.26 L 360.58 355.13 L 360.58 355.00 L 360.58 355.00 L 360.58 354.91 L 360.57 354.83 L 360.56 354.74 L 360.54 354.66 L 360.52 354.58 L 360.49 354.51 L 360.46 354.44 L 360.42 354.37 L 360.38 354.30 L 360.34 354.24 L 360.34 354.24 L 360.29 354.18 L 360.23 354.12 L 360.18 354.06 L 360.12 354.01 L 360.07 353.96 L 360.01 353.91 L 359.94 353.87 L 359.88 353.83 L 359.81 353.79 L 359.75 353.75 L 359.75 353.75 L 359.68 353.71 L 359.60 353.67 L 359.52 353.63 L 359.43 353.59 L 359.34 353.55 L 359.24 353.50 L 359.13 353.45 L 359.02 353.40 L 358.90 353.36 L 358.78 353.30 Z' style='fill-rule: nonzero; fill: #343A40; stroke-width: 0.75; stroke: none;' />
<path d='M 366.23 349.95 L 366.23 349.95 L 366.51 349.96 L 366.78 349.99 L 367.04 350.03 L 367.28 350.10 L 367.51 350.19 L 367.73 350.29 L 367.94 350.41 L 368.13 350.56 L 368.31 350.72 L 368.47 350.90 L 368.47 350.90 L 368.63 351.09 L 368.76 351.31 L 368.88 351.53 L 368.99 351.78 L 369.08 352.04 L 369.15 352.31 L 369.21 352.60 L 369.25 352.91 L 369.27 353.24 L 369.28 353.58 L 369.28 353.58 L 369.27 353.93 L 369.25 354.26 L 369.20 354.58 L 369.15 354.88 L 369.07 355.16 L 368.98 355.43 L 368.87 355.68 L 368.74 355.92 L 368.60 356.14 L 368.44 356.34 L 368.44 356.34 L 368.27 356.53 L 368.08 356.69 L 367.88 356.83 L 367.66 356.96 L 367.44 357.07 L 367.19 357.15 L 366.94 357.22 L 366.66 357.27 L 366.38 357.30 L 366.08 357.31 L 366.08 357.31 L 365.79 357.30 L 365.52 357.27 L 365.26 357.22 L 365.01 357.16 L 364.78 357.07 L 364.56 356.97 L 364.35 356.85 L 364.16 356.71 L 363.97 356.55 L 363.81 356.37 L 363.81 356.37 L 363.66 356.18 L 363.52 355.97 L 363.40 355.74 L 363.30 355.50 L 363.21 355.24 L 363.14 354.97 L 363.09 354.68 L 363.05 354.38 L 363.02 354.06 L 363.01 353.72 L 363.01 353.72 L 363.02 353.37 L 363.05 353.03 L 363.09 352.71 L 363.15 352.40 L 363.22 352.12 L 363.32 351.84 L 363.42 351.59 L 363.55 351.35 L 363.69 351.13 L 363.85 350.93 L 363.85 350.93 L 364.02 350.74 L 364.21 350.58 L 364.41 350.43 L 364.63 350.30 L 364.86 350.19 L 365.11 350.11 L 365.36 350.04 L 365.64 349.99 L 365.92 349.96 L 366.23 349.95 ZM 366.13 351.00 L 366.13 351.00 L 365.91 351.01 L 365.71 351.03 L 365.52 351.06 L 365.33 351.11 L 365.16 351.17 L 365.00 351.24 L 364.85 351.32 L 364.72 351.42 L 364.59 351.54 L 364.47 351.66 L 364.47 351.66 L 364.37 351.80 L 364.27 351.95 L 364.19 352.12 L 364.12 352.30 L 364.06 352.49 L 364.01 352.69 L 363.97 352.91 L 363.94 353.14 L 363.93 353.38 L 363.92 353.64 L 363.92 353.64 L 363.93 353.89 L 363.94 354.14 L 363.97 354.37 L 364.01 354.59 L 364.06 354.80 L 364.12 354.99 L 364.20 355.17 L 364.28 355.34 L 364.38 355.49 L 364.48 355.64 L 364.48 355.64 L 364.60 355.76 L 364.73 355.88 L 364.87 355.97 L 365.02 356.06 L 365.18 356.13 L 365.35 356.19 L 365.53 356.24 L 365.72 356.27 L 365.93 356.29 L 366.14 356.30 L 366.14 356.30 L 366.35 356.29 L 366.56 356.27 L 366.75 356.24 L 366.93 356.20 L 367.10 356.14 L 367.26 356.07 L 367.41 355.98 L 367.55 355.88 L 367.68 355.77 L 367.80 355.65 L 367.80 355.65 L 367.90 355.51 L 368.00 355.36 L 368.09 355.20 L 368.16 355.02 L 368.23 354.83 L 368.28 354.63 L 368.32 354.42 L 368.35 354.20 L 368.37 353.96 L 368.37 353.71 L 368.37 353.71 L 368.37 353.45 L 368.35 353.20 L 368.32 352.96 L 368.28 352.74 L 368.23 352.53 L 368.16 352.34 L 368.09 352.16 L 368.00 351.99 L 367.90 351.83 L 367.80 351.69 L 367.80 351.69 L 367.68 351.56 L 367.55 351.44 L 367.41 351.34 L 367.26 351.25 L 367.10 351.17 L 366.92 351.11 L 366.74 351.06 L 366.55 351.03 L 366.34 351.01 L 366.13 351.00 Z' style='fill-rule: nonzero; fill: #343A40; stroke-width: 0.75; stroke: none;' />
<path d='M 429.57 349.98 L 429.57 349.98 L 429.74 349.98 L 429.91 350.00 L 430.06 350.02 L 430.21 350.05 L 430.36 350.09 L 430.50 350.14 L 430.63 350.20 L 430.75 350.26 L 430.87 350.34 L 430.98 350.42 L 430.98 350.42 L 431.09 350.51 L 431.19 350.61 L 431.27 350.71 L 431.34 350.82 L 431.41 350.93 L 431.46 351.05 L 431.50 351.17 L 431.52 351.30 L 431.54 351.43 L 431.55 351.58 L 431.55 351.58 L 431.54 351.69 L 431.53 351.81 L 431.51 351.93 L 431.48 352.06 L 431.45 352.19 L 431.40 352.32 L 431.35 352.45 L 431.29 352.59 L 431.22 352.73 L 431.14 352.87 L 431.14 352.87 L 431.06 353.02 L 430.96 353.17 L 430.86 353.32 L 430.74 353.49 L 430.62 353.66 L 430.49 353.83 L 430.35 354.02 L 430.19 354.20 L 430.03 354.40 L 429.86 354.60 L 428.41 356.26 L 428.44 356.31 L 431.10 356.31 L 432.31 356.23 L 432.40 356.30 L 432.24 357.26 L 430.77 357.21 L 427.54 357.21 L 427.01 357.24 L 426.94 357.18 L 426.94 356.46 L 428.94 354.28 L 428.94 354.28 L 429.09 354.11 L 429.23 353.95 L 429.37 353.79 L 429.50 353.64 L 429.61 353.49 L 429.72 353.36 L 429.82 353.22 L 429.92 353.09 L 430.00 352.97 L 430.08 352.86 L 430.08 352.86 L 430.15 352.74 L 430.21 352.63 L 430.26 352.52 L 430.31 352.42 L 430.35 352.32 L 430.38 352.22 L 430.41 352.12 L 430.42 352.03 L 430.43 351.94 L 430.44 351.85 L 430.44 351.85 L 430.43 351.77 L 430.43 351.70 L 430.41 351.63 L 430.39 351.56 L 430.37 351.50 L 430.33 351.43 L 430.30 351.38 L 430.25 351.32 L 430.20 351.27 L 430.15 351.22 L 430.15 351.22 L 430.09 351.17 L 430.03 351.12 L 429.96 351.08 L 429.88 351.05 L 429.80 351.02 L 429.72 351.00 L 429.63 350.98 L 429.54 350.97 L 429.44 350.96 L 429.34 350.96 L 429.34 350.96 L 429.24 350.96 L 429.14 350.97 L 429.03 350.98 L 428.93 351.00 L 428.82 351.02 L 428.72 351.05 L 428.62 351.08 L 428.51 351.12 L 428.41 351.17 L 428.31 351.22 L 428.31 351.22 L 428.21 351.27 L 428.11 351.33 L 428.01 351.39 L 427.92 351.46 L 427.82 351.53 L 427.73 351.60 L 427.64 351.68 L 427.56 351.76 L 427.47 351.85 L 427.38 351.94 L 427.24 351.94 L 427.05 351.06 L 427.05 351.06 L 427.17 350.96 L 427.28 350.86 L 427.40 350.77 L 427.52 350.68 L 427.64 350.60 L 427.76 350.52 L 427.88 350.45 L 428.01 350.38 L 428.13 350.32 L 428.26 350.27 L 428.26 350.27 L 428.39 350.21 L 428.52 350.16 L 428.65 350.12 L 428.78 350.08 L 428.91 350.05 L 429.05 350.02 L 429.18 350.00 L 429.31 349.99 L 429.44 349.98 L 429.57 349.98 Z' style='fill-rule: nonzero; fill: #343A40; stroke-width: 0.75; stroke: none;' />
<path d='M 436.70 349.95 L 436.70 349.95 L 436.99 349.96 L 437.26 349.99 L 437.51 350.03 L 437.76 350.10 L 437.99 350.19 L 438.21 350.29 L 438.41 350.41 L 438.60 350.56 L 438.78 350.72 L 438.95 350.90 L 438.95 350.90 L 439.10 351.09 L 439.24 351.31 L 439.36 351.53 L 439.46 351.78 L 439.55 352.04 L 439.63 352.31 L 439.68 352.60 L 439.72 352.91 L 439.75 353.24 L 439.75 353.58 L 439.75 353.58 L 439.75 353.93 L 439.72 354.26 L 439.68 354.58 L 439.62 354.88 L 439.55 355.16 L 439.45 355.43 L 439.35 355.68 L 439.22 355.92 L 439.08 356.14 L 438.92 356.34 L 438.92 356.34 L 438.75 356.53 L 438.56 356.69 L 438.36 356.83 L 438.14 356.96 L 437.91 357.07 L 437.67 357.15 L 437.41 357.22 L 437.14 357.27 L 436.86 357.30 L 436.56 357.31 L 436.56 357.31 L 436.27 357.30 L 436.00 357.27 L 435.74 357.22 L 435.49 357.16 L 435.25 357.07 L 435.03 356.97 L 434.83 356.85 L 434.63 356.71 L 434.45 356.55 L 434.28 356.37 L 434.28 356.37 L 434.13 356.18 L 434.00 355.97 L 433.88 355.74 L 433.78 355.50 L 433.69 355.24 L 433.62 354.97 L 433.56 354.68 L 433.52 354.38 L 433.50 354.06 L 433.49 353.72 L 433.49 353.72 L 433.50 353.37 L 433.52 353.03 L 433.57 352.71 L 433.62 352.40 L 433.70 352.12 L 433.79 351.84 L 433.90 351.59 L 434.03 351.35 L 434.17 351.13 L 434.33 350.93 L 434.33 350.93 L 434.50 350.74 L 434.69 350.58 L 434.89 350.43 L 435.11 350.30 L 435.34 350.19 L 435.58 350.11 L 435.84 350.04 L 436.11 349.99 L 436.40 349.96 L 436.70 349.95 ZM 436.60 351.00 L 436.60 351.00 L 436.39 351.01 L 436.18 351.03 L 435.99 351.06 L 435.81 351.11 L 435.64 351.17 L 435.48 351.24 L 435.33 351.32 L 435.19 351.42 L 435.06 351.54 L 434.94 351.66 L 434.94 351.66 L 434.84 351.80 L 434.75 351.95 L 434.67 352.12 L 434.59 352.30 L 434.53 352.49 L 434.49 352.69 L 434.45 352.91 L 434.42 353.14 L 434.40 353.38 L 434.40 353.64 L 434.40 353.64 L 434.40 353.89 L 434.42 354.14 L 434.45 354.37 L 434.49 354.59 L 434.54 354.80 L 434.60 354.99 L 434.67 355.17 L 434.76 355.34 L 434.85 355.49 L 434.96 355.64 L 434.96 355.64 L 435.08 355.76 L 435.21 355.88 L 435.34 355.97 L 435.49 356.06 L 435.65 356.13 L 435.83 356.19 L 436.01 356.24 L 436.20 356.27 L 436.40 356.29 L 436.62 356.30 L 436.62 356.30 L 436.83 356.29 L 437.03 356.27 L 437.22 356.24 L 437.41 356.20 L 437.58 356.14 L 437.74 356.07 L 437.89 355.98 L 438.03 355.88 L 438.15 355.77 L 438.27 355.65 L 438.27 355.65 L 438.38 355.51 L 438.48 355.36 L 438.57 355.20 L 438.64 355.02 L 438.70 354.83 L 438.76 354.63 L 438.80 354.42 L 438.82 354.20 L 438.84 353.96 L 438.85 353.71 L 438.85 353.71 L 438.84 353.45 L 438.82 353.20 L 438.80 352.96 L 438.76 352.74 L 438.70 352.53 L 438.64 352.34 L 438.57 352.16 L 438.48 351.99 L 438.38 351.83 L 438.27 351.69 L 438.27 351.69 L 438.15 351.56 L 438.02 351.44 L 437.89 351.34 L 437.73 351.25 L 437.57 351.17 L 437.40 351.11 L 437.22 351.06 L 437.02 351.03 L 436.82 351.01 L 436.60 351.00 Z' style='fill-rule: nonzero; fill: #343A40; stroke-width: 0.75; stroke: none;' />
<path d='M 444.30 349.95 L 444.30 349.95 L 444.59 349.96 L 444.86 349.99 L 445.12 350.03 L 445.36 350.10 L 445.59 350.19 L 445.81 350.29 L 446.02 350.41 L 446.21 350.56 L 446.39 350.72 L 446.55 350.90 L 446.55 350.90 L 446.70 351.09 L 446.84 351.31 L 446.96 351.53 L 447.07 351.78 L 447.16 352.04 L 447.23 352.31 L 447.29 352.60 L 447.33 352.91 L 447.35 353.24 L 447.36 353.58 L 447.36 353.58 L 447.35 353.93 L 447.32 354.26 L 447.28 354.58 L 447.22 354.88 L 447.15 355.16 L 447.06 355.43 L 446.95 355.68 L 446.82 355.92 L 446.68 356.14 L 446.52 356.34 L 446.52 356.34 L 446.35 356.53 L 446.16 356.69 L 445.96 356.83 L 445.74 356.96 L 445.51 357.07 L 445.27 357.15 L 445.01 357.22 L 444.74 357.27 L 444.46 357.30 L 444.16 357.31 L 444.16 357.31 L 443.87 357.30 L 443.60 357.27 L 443.34 357.22 L 443.09 357.16 L 442.86 357.07 L 442.64 356.97 L 442.43 356.85 L 442.23 356.71 L 442.05 356.55 L 441.89 356.37 L 441.89 356.37 L 441.74 356.18 L 441.60 355.97 L 441.48 355.74 L 441.38 355.50 L 441.29 355.24 L 441.22 354.97 L 441.17 354.68 L 441.13 354.38 L 441.10 354.06 L 441.09 353.72 L 441.09 353.72 L 441.10 353.37 L 441.13 353.03 L 441.17 352.71 L 441.23 352.40 L 441.30 352.12 L 441.39 351.84 L 441.50 351.59 L 441.63 351.35 L 441.77 351.13 L 441.93 350.93 L 441.93 350.93 L 442.10 350.74 L 442.29 350.58 L 442.49 350.43 L 442.71 350.30 L 442.94 350.19 L 443.19 350.11 L 443.44 350.04 L 443.72 349.99 L 444.00 349.96 L 444.30 349.95 ZM 444.20 351.00 L 444.20 351.00 L 443.99 351.01 L 443.79 351.03 L 443.60 351.06 L 443.41 351.11 L 443.24 351.17 L 443.08 351.24 L 442.93 351.32 L 442.79 351.42 L 442.67 351.54 L 442.55 351.66 L 442.55 351.66 L 442.44 351.80 L 442.35 351.95 L 442.27 352.12 L 442.20 352.30 L 442.14 352.49 L 442.09 352.69 L 442.05 352.91 L 442.02 353.14 L 442.01 353.38 L 442.00 353.64 L 442.00 353.64 L 442.01 353.89 L 442.02 354.14 L 442.05 354.37 L 442.09 354.59 L 442.14 354.80 L 442.20 354.99 L 442.28 355.17 L 442.36 355.34 L 442.46 355.49 L 442.56 355.64 L 442.56 355.64 L 442.68 355.76 L 442.81 355.88 L 442.95 355.97 L 443.10 356.06 L 443.26 356.13 L 443.43 356.19 L 443.61 356.24 L 443.80 356.27 L 444.00 356.29 L 444.22 356.30 L 444.22 356.30 L 444.43 356.29 L 444.63 356.27 L 444.83 356.24 L 445.01 356.20 L 445.18 356.14 L 445.34 356.07 L 445.49 355.98 L 445.63 355.88 L 445.76 355.77 L 445.87 355.65 L 445.87 355.65 L 445.98 355.51 L 446.08 355.36 L 446.17 355.20 L 446.24 355.02 L 446.31 354.83 L 446.36 354.63 L 446.40 354.42 L 446.43 354.20 L 446.44 353.96 L 446.45 353.71 L 446.45 353.71 L 446.44 353.45 L 446.43 353.20 L 446.40 352.96 L 446.36 352.74 L 446.31 352.53 L 446.24 352.34 L 446.17 352.16 L 446.08 351.99 L 445.98 351.83 L 445.87 351.69 L 445.87 351.69 L 445.76 351.56 L 445.63 351.44 L 445.49 351.34 L 445.34 351.25 L 445.18 351.17 L 445.00 351.11 L 444.82 351.06 L 444.63 351.03 L 444.42 351.01 L 444.20 351.00 Z' style='fill-rule: nonzero; fill: #343A40; stroke-width: 0.75; stroke: none;' />
<path d='M 451.91 349.95 L 451.91 349.95 L 452.19 349.96 L 452.46 349.99 L 452.72 350.03 L 452.97 350.10 L 453.20 350.19 L 453.41 350.29 L 453.62 350.41 L 453.81 350.56 L 453.99 350.72 L 454.15 350.90 L 454.15 350.90 L 454.31 351.09 L 454.44 351.31 L 454.57 351.53 L 454.67 351.78 L 454.76 352.04 L 454.83 352.31 L 454.89 352.60 L 454.93 352.91 L 454.95 353.24 L 454.96 353.58 L 454.96 353.58 L 454.95 353.93 L 454.93 354.26 L 454.89 354.58 L 454.83 354.88 L 454.75 355.16 L 454.66 355.43 L 454.55 355.68 L 454.43 355.92 L 454.28 356.14 L 454.13 356.34 L 454.13 356.34 L 453.95 356.53 L 453.76 356.69 L 453.56 356.83 L 453.35 356.96 L 453.12 357.07 L 452.87 357.15 L 452.62 357.22 L 452.35 357.27 L 452.06 357.30 L 451.76 357.31 L 451.76 357.31 L 451.48 357.30 L 451.20 357.27 L 450.94 357.22 L 450.70 357.16 L 450.46 357.07 L 450.24 356.97 L 450.03 356.85 L 449.84 356.71 L 449.66 356.55 L 449.49 356.37 L 449.49 356.37 L 449.34 356.18 L 449.20 355.97 L 449.09 355.74 L 448.98 355.50 L 448.89 355.24 L 448.82 354.97 L 448.77 354.68 L 448.73 354.38 L 448.70 354.06 L 448.70 353.72 L 448.70 353.72 L 448.71 353.37 L 448.73 353.03 L 448.77 352.71 L 448.83 352.40 L 448.91 352.12 L 449.00 351.84 L 449.11 351.59 L 449.23 351.35 L 449.37 351.13 L 449.53 350.93 L 449.53 350.93 L 449.71 350.74 L 449.89 350.58 L 450.10 350.43 L 450.31 350.30 L 450.54 350.19 L 450.79 350.11 L 451.05 350.04 L 451.32 349.99 L 451.61 349.96 L 451.91 349.95 ZM 451.81 351.00 L 451.81 351.00 L 451.59 351.01 L 451.39 351.03 L 451.20 351.06 L 451.02 351.11 L 450.85 351.17 L 450.69 351.24 L 450.54 351.32 L 450.40 351.42 L 450.27 351.54 L 450.15 351.66 L 450.15 351.66 L 450.05 351.80 L 449.95 351.95 L 449.87 352.12 L 449.80 352.30 L 449.74 352.49 L 449.69 352.69 L 449.65 352.91 L 449.63 353.14 L 449.61 353.38 L 449.60 353.64 L 449.60 353.64 L 449.61 353.89 L 449.63 354.14 L 449.65 354.37 L 449.69 354.59 L 449.74 354.80 L 449.81 354.99 L 449.88 355.17 L 449.96 355.34 L 450.06 355.49 L 450.17 355.64 L 450.17 355.64 L 450.28 355.76 L 450.41 355.88 L 450.55 355.97 L 450.70 356.06 L 450.86 356.13 L 451.03 356.19 L 451.21 356.24 L 451.41 356.27 L 451.61 356.29 L 451.82 356.30 L 451.82 356.30 L 452.04 356.29 L 452.24 356.27 L 452.43 356.24 L 452.61 356.20 L 452.78 356.14 L 452.94 356.07 L 453.09 355.98 L 453.23 355.88 L 453.36 355.77 L 453.48 355.65 L 453.48 355.65 L 453.59 355.51 L 453.69 355.36 L 453.77 355.20 L 453.85 355.02 L 453.91 354.83 L 453.96 354.63 L 454.00 354.42 L 454.03 354.20 L 454.05 353.96 L 454.05 353.71 L 454.05 353.71 L 454.05 353.45 L 454.03 353.20 L 454.00 352.96 L 453.96 352.74 L 453.91 352.53 L 453.85 352.34 L 453.77 352.16 L 453.69 351.99 L 453.59 351.83 L 453.48 351.69 L 453.48 351.69 L 453.36 351.56 L 453.23 351.44 L 453.09 351.34 L 452.94 351.25 L 452.78 351.17 L 452.61 351.11 L 452.42 351.06 L 452.23 351.03 L 452.02 351.01 L 451.81 351.00 Z' style='fill-rule: nonzero; fill: #343A40; stroke-width: 0.75; stroke: none;' />
</g>
</svg>
