projectKey=zayneb.samaali_sonartest_1f39e358-4a7a-410b-9722-ae6a5ef9ac73
serverUrl=http://localhost:9000
serverVersion=10.4.1.88267
dashboardUrl=http://localhost:9000/dashboard?id=zayneb.samaali_sonartest_1f39e358-4a7a-410b-9722-ae6a5ef9ac73
ceTaskId=5d7a6761-3130-40c0-aaad-1c4a4e4c2099
ceTaskUrl=http://localhost:9000/api/ce/task?id=5d7a6761-3130-40c0-aaad-1c4a4e4c2099
