[
  {
    "title": "Super Snickers",
    "price": 0.99,
    "imageUrl": "https://gastronom.com.ua/images/sets/799_av.jpg",
    "vendorCode": 5900951261060,
    "color": "custom"
  },
  {
    "title": "Snickers",
    "price": 0.49,
    "imageUrl": "https://gastronom.com.ua/images/sets/8112_av.jpg",
    "vendorCode": 5900951251060,
    "color": "custom"
  },
  {
    "title": "Nuts King Size",
    "price": 1.09,
    "imageUrl": "https://gastronom.com.ua/images/sets/806_av.jpg",
    "vendorCode": 5900951181450,
    "color": "custom"
  },
  {
    "title": "Nuts",
    "price": 0.69,
    "imageUrl": "https://gastronom.com.ua/images/sets/6000_av.jpg",
    "vendorCode": 5900955984257,
    "color": "custom"
  },
  {
    "title": "Kinder Surprise",
    "price": 1.19,
    "imageUrl": "https://gastronom.com.ua/images/sets/810_av.jpg",
    "vendorCode": 5900955555555
  },
  {
    "title": "Bounty Trio",
    "price": 0.79,
    "imageUrl": "https://gastronom.com.ua/images/sets/804_av.jpg",
    "vendorCode": 5900956927513,
    "color": "custom"
  },
  {
    "title": "Bounty",
    "price": 0.39,
    "imageUrl": "https://gastronom.com.ua/images/sets/798_av.jpg",
    "vendorCode": 5900956459275,
    "color": "custom"
  },
  {
    "title": "Twix Extra",
    "price": 0.69,
    "imageUrl": "https://gastronom.com.ua/images/sets/1975_av.jpg",
    "vendorCode": 5900954125756
  },
  {
    "title": "Twix",
    "price": 0.29,
    "imageUrl": "https://gastronom.com.ua/images/sets/801_av.jpg",
    "vendorCode": 5900956428943,
    "color": "custom"
  },
  {
    "title": "Kit Kat",
    "price": 0.34,
    "imageUrl": "https://gastronom.com.ua/images/sets/1977_av.jpg",
    "vendorCode": 5900954531411
  }
]