<?xml version="1.0" encoding="UTF-8"?>
<svg viewBox="0 0 600 600" xmlns="http://www.w3.org/2000/svg">
  <path role="presentation" d="M212 600h-14l-2-1c-6-2-12-3-17-6-13-6-24-16-34-27a380 380 0 0 1-53-78c-5-9-10-18-13-27a372 372 0 0 1-29-151c1-16 4-32 8-47 4-16 11-30 19-44a148 148 0 0 1 110-72c9-1 19-1 29 1 13 2 25 6 37 11l30 11c8 3 16 4 24 1l18-6c15-5 29-11 44-15a135 135 0 0 1 66-2 142 142 0 0 1 81 48l6 8-14 11a135 135 0 0 0-46 72l-4 19c-1 22 1 43 9 63a138 138 0 0 0 65 69l6 2-1 3-7 20a354 354 0 0 1-82 120 72 72 0 0 1-59 15c-11-2-21-6-31-10a130 130 0 0 0-68-12c-12 2-25 6-36 11-13 6-26 11-40 12l-2 1zM413 0l1 14a128 128 0 0 1-26 74 124 124 0 0 1-56 44 88 88 0 0 1-39 6 106 106 0 0 1 10-57 137 137 0 0 1 84-76l19-4 2-1h5z" fill-rule="nonzero"></path>
</svg>
