{
  "instagramLikes": [
    {
      "id": 0,
      "name": "Instagram Likes",
      "quantity": "50",
      "salePrice": 1.99,
      "regex": "^https?:\\/\\/(?:www\\.)?instagram\\.com\\/p\\/([a-zA-Z0-9_-]+)\\/?$",
      "errorMsg": "Please enter instagram post URL.",
      "sellix": "/tawkto"
    },
    {
      "id": 1,
      "name": "Instagram Likes",
      "quantity": "100",
      "salePrice": 2.99,
      "regex": "^https?:\\/\\/(?:www\\.)?instagram\\.com\\/p\\/([a-zA-Z0-9_-]+)\\/?$",
      "errorMsg": "Please enter instagram post URL.",
      "sellix": "/tawkto"
    },
    {
      "id": 2,
      "name": "Instagram Likes",
      "quantity": "500",
      "salePrice": 9.99,
      "regex": "^https?:\\/\\/(?:www\\.)?instagram\\.com\\/p\\/([a-zA-Z0-9_-]+)\\/?$",
      "errorMsg": "Please enter instagram post URL.",
      "sellix": "/tawkto"
    },
    {
      "id": 3,
      "name": "Instagram Likes",
      "quantity": "1000",
      "salePrice": 19.99,
      "regex": "^https?:\\/\\/(?:www\\.)?instagram\\.com\\/p\\/([a-zA-Z0-9_-]+)\\/?$",
      "errorMsg": "Please enter instagram post URL.",
      "sellix": "/tawkto"
    },
    {
      "id": 4,
      "name": "Instagram Likes",
      "quantity": "2500",
      "salePrice": 39.99,
      "regex": "^https?:\\/\\/(?:www\\.)?instagram\\.com\\/p\\/([a-zA-Z0-9_-]+)\\/?$",
      "errorMsg": "Please enter instagram post URL.",
      "sellix": "/tawkto"
    },
    {
      "id": 5,
      "name": "Instagram Likes",
      "quantity": "5000",
      "salePrice": 69.99,
      "regex": "^https?:\\/\\/(?:www\\.)?instagram\\.com\\/p\\/([a-zA-Z0-9_-]+)\\/?$",
      "errorMsg": "Please enter instagram post URL.",
      "sellix": "/tawkto"
    },
    {
      "id": 6,
      "name": "Instagram Likes",
      "quantity": "10000",
      "salePrice": 99.99,
      "regex": "^https?:\\/\\/(?:www\\.)?instagram\\.com\\/p\\/([a-zA-Z0-9_-]+)\\/?$",
      "errorMsg": "Please enter instagram post URL.",
      "sellix": "/tawkto"
    }
  ],

  "instagramViews": [
    {
      "id": 0,
      "name": "Instagram Views",
      "quantity": "500",
      "salePrice": 1.99,
      "discountAmount": 2.4875,
      "discount": "25%",
      "regex": "^https?:\\/\\/(?:www\\.)?instagram\\.com\\/p\\/([a-zA-Z0-9_-]+)\\/?$",
      "errorMsg": "Please enter your instagram video URL.",
      "sellix": "/tawkto"
    },
    {
      "id": 1,
      "name": "Instagram Views",
      "quantity": "2500",
      "salePrice": 4.99,
      "discountAmount": 6.2375,
      "discount": "25%",
      "regex": "^https?:\\/\\/(?:www\\.)?instagram\\.com\\/p\\/([a-zA-Z0-9_-]+)\\/?$",
      "errorMsg": "Please enter your instagram video URL.",
      "sellix": "/tawkto"
    },
    {
      "id": 2,
      "name": "Instagram Views",
      "quantity": "5000",
      "salePrice": 11.99,
      "discountAmount": 14.9875,
      "discount": "25%",
      "regex": "^https?:\\/\\/(?:www\\.)?instagram\\.com\\/p\\/([a-zA-Z0-9_-]+)\\/?$",
      "errorMsg": "Please enter your instagram video URL.",
      "sellix": "/tawkto"
    },
    {
      "id": 3,
      "name": "Instagram Views",
      "quantity": "15000",
      "salePrice": 24.99,
      "discountAmount": 32.487,
      "discount": "30%",
      "regex": "^https?:\\/\\/(?:www\\.)?instagram\\.com\\/p\\/([a-zA-Z0-9_-]+)\\/?$",
      "errorMsg": "Please enter your instagram video URL.",
      "sellix": "/tawkto"
    },
    {
      "id": 4,
      "name": "Instagram Views",
      "quantity": "25000",
      "salePrice": 44.99,
      "discountAmount": 58.487,
      "discount": "30%",
      "regex": "^https?:\\/\\/(?:www\\.)?instagram\\.com\\/p\\/([a-zA-Z0-9_-]+)\\/?$",
      "errorMsg": "Please enter your instagram video URL.",
      "sellix": "/tawkto"
    }
  ],
  "instagramFollower": [
    {
      "id": 0,
      "name": "Instagram Followers",
      "quantity": "50",
      "salePrice": 1.99,
      "regex": "^https?:\\/\\/(?:www\\.)?instagram\\.com\\/[a-zA-Z0-9_\\.]+\\/?$",
      "errorMsg": "Please enter your instagram profile URL.",
      "sellix": "/tawkto"
    },
    {
      "id": 1,
      "name": "Instagram Followers",
      "quantity": "100",
      "salePrice": 2.99,
      "regex": "^https?:\\/\\/(?:www\\.)?instagram\\.com\\/[a-zA-Z0-9_\\.]+\\/?$",
      "errorMsg": "Please enter your instagram profile URL.",
      "sellix": "/tawkto"
    },
    {
      "id": 2,
      "name": "Instagram Followers",
      "quantity": "500",
      "salePrice": 9.99,
      "regex": "^https?:\\/\\/(?:www\\.)?instagram\\.com\\/[a-zA-Z0-9_\\.]+\\/?$",
      "errorMsg": "Please enter your instagram profile URL.",
      "sellix": "/tawkto"
    },
    {
      "id": 3,
      "name": "Instagram Followers",
      "quantity": "1000",
      "salePrice": 19.99,
      "regex": "^https?:\\/\\/(?:www\\.)?instagram\\.com\\/[a-zA-Z0-9_\\.]+\\/?$",
      "errorMsg": "Please enter your instagram profile URL.",
      "sellix": "/tawkto"
    },
    {
      "id": 4,
      "name": "Instagram Followers",
      "quantity": "2500",
      "salePrice": 39.99,
      "regex": "^https?:\\/\\/(?:www\\.)?instagram\\.com\\/[a-zA-Z0-9_\\.]+\\/?$",
      "errorMsg": "Please enter your instagram profile URL.",
      "sellix": "/tawkto"
    },
    {
      "id": 5,
      "name": "Instagram Followers",
      "quantity": "5000",
      "salePrice": 69.99,
      "regex": "^https?:\\/\\/(?:www\\.)?instagram\\.com\\/[a-zA-Z0-9_\\.]+\\/?$",
      "errorMsg": "Please enter your instagram profile URL.",
      "sellix": "/tawkto"
    },
    {
      "id": 6,
      "name": "Instagram Followers",
      "quantity": "10000",
      "salePrice": 99.99,
      "regex": "^https?:\\/\\/(?:www\\.)?instagram\\.com\\/[a-zA-Z0-9_\\.]+\\/?$",
      "errorMsg": "Please enter your instagram profile URL.",
      "sellix": "/tawkto"
    }
  ],
  "instagramStoryViews": [
    {
      "id": 0,
      "name": "Instagram Story Views",
      "quantity": "500",
      "salePrice": 1.99,
      "discountAmount": 2.4875,
      "discount": "25%",
      "regex": "^https?:\\/\\/(?:www\\.)?instagram\\.com\\/stories\\/([a-zA-Z0-9_]+)\\/?$",
      "errorMsg": "Please enter your instagram story URL.",
      "sellix": "/tawkto"
    },
    {
      "id": 1,
      "name": "Instagram Story Views",
      "quantity": "2500",
      "salePrice": 6.99,
      "discountAmount": 8.7375,
      "discount": "25%",
      "regex": "^https?:\\/\\/(?:www\\.)?instagram\\.com\\/stories\\/([a-zA-Z0-9_]+)\\/?$",
      "errorMsg": "Please enter your instagram story URL.",
      "sellix": "/tawkto"
    },
    {
      "id": 2,
      "name": "Instagram Story Views",
      "quantity": "5000",
      "salePrice": 12.99,
      "discountAmount": 16.2375,
      "discount": "25%",
      "regex": "^https?:\\/\\/(?:www\\.)?instagram\\.com\\/stories\\/([a-zA-Z0-9_]+)\\/?$",
      "errorMsg": "Please enter your instagram story URL.",
      "sellix": "/tawkto"
    },
    {
      "id": 3,
      "name": "Instagram Story Views",
      "quantity": "15000",
      "salePrice": 27.99,
      "discountAmount": 36.387,
      "discount": "30%",
      "regex": "^https?:\\/\\/(?:www\\.)?instagram\\.com\\/stories\\/([a-zA-Z0-9_]+)\\/?$",
      "errorMsg": "Please enter your instagram story URL.",
      "sellix": "/tawkto"
    },
    {
      "id": 4,
      "name": "Instagram Story Views",
      "quantity": "25000",
      "salePrice": 49.99,
      "discountAmount": 64.987,
      "discount": "30%",
      "regex": "^https?:\\/\\/(?:www\\.)?instagram\\.com\\/stories\\/([a-zA-Z0-9_]+)\\/?$",
      "errorMsg": "Please enter your instagram story URL.",
      "sellix": "/tawkto"
    }
  ],
  "InstagramImpressions": [
    {
      "id": 0,
      "name": "Instagram Impressions",
      "quantity": "100",
      "salePrice": 2,
      "regex": "^https?:\\/\\/(?:www\\.)?instagram\\.com\\/p\\/([a-zA-Z0-9_-]+)\\/?$",
      "errorMsg": "Please enter your instagram post URL.",
      "sellix": "/tawkto"
    },
    {
      "id": 1,
      "name": "Instagram Impressions",
      "quantity": "250",
      "salePrice": 4,
      "regex": "^https?:\\/\\/(?:www\\.)?instagram\\.com\\/p\\/([a-zA-Z0-9_-]+)\\/?$",
      "errorMsg": "Please enter your instagram post URL.",
      "sellix": "/tawkto"
    },
    {
      "id": 2,
      "name": "Instagram Impressions",
      "quantity": "500",
      "salePrice": 7,
      "regex": "^https?:\\/\\/(?:www\\.)?instagram\\.com\\/p\\/([a-zA-Z0-9_-]+)\\/?$",
      "errorMsg": "Please enter your instagram post URL.",
      "sellix": "/tawkto"
    },
    {
      "id": 3,
      "name": "Instagram Impressions",
      "quantity": "1000",
      "salePrice": 12,
      "regex": "^https?:\\/\\/(?:www\\.)?instagram\\.com\\/p\\/([a-zA-Z0-9_-]+)\\/?$",
      "errorMsg": "Please enter your instagram post URL.",
      "sellix": "/tawkto"
    },
    {
      "id": 4,
      "name": "Instagram Impressions",
      "quantity": "2500",
      "salePrice": 16,
      "regex": "^https?:\\/\\/(?:www\\.)?instagram\\.com\\/p\\/([a-zA-Z0-9_-]+)\\/?$",
      "errorMsg": "Please enter your instagram post URL.",
      "sellix": "/tawkto"
    }
  ],
  "InstagramPowerLikes": [
    {
      "id": 0,
      "name": "Instagram Power Likes",
      "quantity": "100",
      "salePrice": 12,
      "regex": "^https?:\\/\\/(?:www\\.)?instagram\\.com\\/p\\/([a-zA-Z0-9_-]+)\\/?$",
      "errorMsg": "Please enter your instagram post URL.",
      "sellix": "/tawkto"
    },
    {
      "id": 1,
      "name": "Instagram Power Likes",
      "quantity": "250",
      "salePrice": 30,
      "regex": "^https?:\\/\\/(?:www\\.)?instagram\\.com\\/p\\/([a-zA-Z0-9_-]+)\\/?$",
      "errorMsg": "Please enter your instagram post URL.",
      "sellix": "/tawkto"
    },
    {
      "id": 2,
      "name": "Instagram Power Likes",
      "quantity": "500",
      "salePrice": 55,
      "regex": "^https?:\\/\\/(?:www\\.)?instagram\\.com\\/p\\/([a-zA-Z0-9_-]+)\\/?$",
      "errorMsg": "Please enter your instagram post URL.",
      "sellix": "/tawkto"
    },
    {
      "id": 3,
      "name": "Instagram Power Likes",
      "quantity": "1000",
      "salePrice": 110,
      "regex": "^https?:\\/\\/(?:www\\.)?instagram\\.com\\/p\\/([a-zA-Z0-9_-]+)\\/?$",
      "errorMsg": "Please enter your instagram post URL.",
      "sellix": "/tawkto"
    },
    {
      "id": 4,
      "name": "Instagram Power Likes",
      "quantity": "2500",
      "salePrice": 290,
      "regex": "^https?:\\/\\/(?:www\\.)?instagram\\.com\\/p\\/([a-zA-Z0-9_-]+)\\/?$",
      "errorMsg": "Please enter your instagram post URL.",
      "sellix": "/tawkto"
    }
  ],
  "InstagramLiveVideoViews": [
    {
      "id": 0,
      "name": "Instagram Live Video Views",
      "quantity": "500",
      "salePrice": 15,
      "regex": "^https?:\\/\\/(?:www\\.)?instagram\\.com\\/p\\/([a-zA-Z0-9_-]+)\\/?$",
      "errorMsg": "Please enter your instagram post URL.",
      "sellix": "/tawkto"
    },
    {
      "id": 1,
      "name": "Instagram Live Video Views",
      "quantity": "1000",
      "salePrice": 30,
      "regex": "^https?:\\/\\/(?:www\\.)?instagram\\.com\\/p\\/([a-zA-Z0-9_-]+)\\/?$",
      "errorMsg": "Please enter your instagram post URL.",
      "sellix": "/tawkto"
    },
    {
      "id": 2,
      "name": "Instagram Live Video Views",
      "quantity": "2500",
      "salePrice": 76,
      "regex": "^https?:\\/\\/(?:www\\.)?instagram\\.com\\/p\\/([a-zA-Z0-9_-]+)\\/?$",
      "errorMsg": "Please enter your instagram post URL.",
      "sellix": "/tawkto"
    },
    {
      "id": 3,
      "name": "Instagram Live Video Views",
      "quantity": "5000",
      "salePrice": 152,
      "regex": "^https?:\\/\\/(?:www\\.)?instagram\\.com\\/p\\/([a-zA-Z0-9_-]+)\\/?$",
      "errorMsg": "Please enter your instagram post URL.",
      "sellix": "/tawkto"
    },
    {
      "id": 4,
      "name": "Instagram Live Video Views",
      "quantity": "10000",
      "salePrice": 304,
      "regex": "^https?:\\/\\/(?:www\\.)?instagram\\.com\\/p\\/([a-zA-Z0-9_-]+)\\/?$",
      "errorMsg": "Please enter your instagram post URL.",
      "sellix": "/tawkto"
    }
  ],
  "InstagramShares": [
    {
      "id": 0,
      "name": "Instagram Shares",
      "quantity": "500",
      "salePrice": 2.5,
      "regex": "^https?:\\/\\/(?:www\\.)?instagram\\.com\\/p\\/([a-zA-Z0-9_-]+)\\/?$",
      "errorMsg": "Please enter your instagram post URL.",
      "sellix": "/tawkto"
    },
    {
      "id": 1,
      "name": "Instagram Shares",
      "quantity": "1000",
      "salePrice": 5,
      "regex": "^https?:\\/\\/(?:www\\.)?instagram\\.com\\/p\\/([a-zA-Z0-9_-]+)\\/?$",
      "errorMsg": "Please enter your instagram post URL.",
      "sellix": "/tawkto"
    },
    {
      "id": 2,
      "name": "Instagram Shares",
      "quantity": "2500",
      "salePrice": 12,
      "regex": "^https?:\\/\\/(?:www\\.)?instagram\\.com\\/p\\/([a-zA-Z0-9_-]+)\\/?$",
      "errorMsg": "Please enter your instagram post URL.",
      "sellix": "/tawkto"
    },
    {
      "id": 3,
      "name": "Instagram Shares",
      "quantity": "5000",
      "salePrice": 24,
      "regex": "^https?:\\/\\/(?:www\\.)?instagram\\.com\\/p\\/([a-zA-Z0-9_-]+)\\/?$",
      "errorMsg": "Please enter your instagram post URL.",
      "sellix": "/tawkto"
    },
    {
      "id": 4,
      "name": "Instagram Shares",
      "quantity": "10000",
      "salePrice": 47,
      "regex": "^https?:\\/\\/(?:www\\.)?instagram\\.com\\/p\\/([a-zA-Z0-9_-]+)\\/?$",
      "errorMsg": "Please enter your instagram post URL.",
      "sellix": "/tawkto"
    }
  ],
  "InstagramComments": [
    {
      "id": 0,
      "name": "Instagram Comments",
      "quantity": "10",
      "salePrice": 7,
      "regex": "^https?:\\/\\/(?:www\\.)?instagram\\.com\\/p\\/([a-zA-Z0-9_-]+)\\/?$",
      "errorMsg": "Please enter your instagram post URL.",
      "sellix": "/tawkto"
    },
    {
      "id": 1,
      "name": "Instagram Comments",
      "quantity": "25",
      "salePrice": 17,
      "regex": "^https?:\\/\\/(?:www\\.)?instagram\\.com\\/p\\/([a-zA-Z0-9_-]+)\\/?$",
      "errorMsg": "Please enter your instagram post URL.",
      "sellix": "/tawkto"
    },
    {
      "id": 2,
      "name": "Instagram Comments",
      "quantity": "50",
      "salePrice": 35,
      "regex": "^https?:\\/\\/(?:www\\.)?instagram\\.com\\/p\\/([a-zA-Z0-9_-]+)\\/?$",
      "errorMsg": "Please enter your instagram post URL.",
      "sellix": "/tawkto"
    },
    {
      "id": 3,
      "name": "Instagram Comments",
      "quantity": "75",
      "salePrice": 52,
      "regex": "^https?:\\/\\/(?:www\\.)?instagram\\.com\\/p\\/([a-zA-Z0-9_-]+)\\/?$",
      "errorMsg": "Please enter your instagram post URL.",
      "sellix": "/tawkto"
    },
    {
      "id": 4,
      "name": "Instagram Comments",
      "quantity": "100",
      "salePrice": 70,
      "regex": "^https?:\\/\\/(?:www\\.)?instagram\\.com\\/p\\/([a-zA-Z0-9_-]+)\\/?$",
      "errorMsg": "Please enter your instagram post URL.",
      "sellix": "/tawkto"
    }
  ],
  "youtubeLikes": [
    {
      "id": 0,
      "name": "Youtube Likes",
      "quantity": "200",
      "salePrice": 2.99,
      "regex": "^https?:\\/\\/(?:www\\.)?youtube\\.com\\/watch\\?v=([a-zA-Z0-9_-]{11})$",
      "errorMsg": "Please enter your youtube video URL.",
      "sellix": "/tawkto"
    },
    {
      "id": 1,
      "name": "Youtube Likes",
      "quantity": "500",
      "salePrice": 4.99,
      "regex": "^https?:\\/\\/(?:www\\.)?youtube\\.com\\/watch\\?v=([a-zA-Z0-9_-]{11})$",
      "errorMsg": "Please enter your youtube video URL.",
      "sellix": "/tawkto"
    },
    {
      "id": 2,
      "name": "Youtube Likes",
      "quantity": "1000",
      "salePrice": 9.99,
      "regex": "^https?:\\/\\/(?:www\\.)?youtube\\.com\\/watch\\?v=([a-zA-Z0-9_-]{11})$",
      "errorMsg": "Please enter your youtube video URL.",
      "sellix": "/tawkto"
    },
    {
      "id": 3,
      "name": "Youtube Likes",
      "quantity": "5000",
      "salePrice": 19.99,
      "regex": "^https?:\\/\\/(?:www\\.)?youtube\\.com\\/watch\\?v=([a-zA-Z0-9_-]{11})$",
      "errorMsg": "Please enter your youtube video URL.",
      "sellix": "/tawkto"
    },
    {
      "id": 4,
      "name": "Youtube Likes",
      "quantity": "10000",
      "salePrice": 29.99,
      "regex": "^https?:\\/\\/(?:www\\.)?youtube\\.com\\/watch\\?v=([a-zA-Z0-9_-]{11})$",
      "errorMsg": "Please enter your youtube video URL.",
      "sellix": "/tawkto"
    },
    {
      "id": 5,
      "name": "Youtube Likes",
      "quantity": "20000",
      "salePrice": 50,
      "regex": "^https?:\\/\\/(?:www\\.)?youtube\\.com\\/watch\\?v=([a-zA-Z0-9_-]{11})$",
      "errorMsg": "Please enter your youtube video URL.",
      "sellix": "/tawkto"
    }
  ],
  "youtubeSubscribers": [
    {
      "id": 0,
      "name": "Youtube Subscribers",
      "quantity": "50",
      "salePrice": 7.99,
      "regex": "^https?:\\/\\/(?:www\\.)?youtube\\.com\\/(?:c\\/|channel\\/|user\\/)?([a-zA-Z0-9_-]{1,})$",
      "errorMsg": "Please enter your youtube channel URL.",
      "sellix": "/tawkto"
    },
    {
      "id": 1,
      "name": "Youtube Subscribers",
      "quantity": "100",
      "salePrice": 14.99,
      "regex": "^https?:\\/\\/(?:www\\.)?youtube\\.com\\/(?:c\\/|channel\\/|user\\/)?([a-zA-Z0-9_-]{1,})$",
      "errorMsg": "Please enter your youtube channel URL.",
      "sellix": "/tawkto"
    },
    {
      "id": 2,
      "name": "Youtube Subscribers",
      "quantity": "250",
      "salePrice": 29.99,
      "regex": "^https?:\\/\\/(?:www\\.)?youtube\\.com\\/(?:c\\/|channel\\/|user\\/)?([a-zA-Z0-9_-]{1,})$",
      "errorMsg": "Please enter your youtube channel URL.",
      "sellix": "/tawkto"
    },
    {
      "id": 3,
      "name": "Youtube Subscribers",
      "quantity": "500",
      "salePrice": 49.99,
      "regex": "^https?:\\/\\/(?:www\\.)?youtube\\.com\\/(?:c\\/|channel\\/|user\\/)?([a-zA-Z0-9_-]{1,})$",
      "errorMsg": "Please enter your youtube channel URL.",
      "sellix": "/tawkto"
    },
    {
      "id": 4,
      "name": "Youtube Subscribers",
      "quantity": "1000",
      "salePrice": 99.99,
      "regex": "^https?:\\/\\/(?:www\\.)?youtube\\.com\\/(?:c\\/|channel\\/|user\\/)?([a-zA-Z0-9_-]{1,})$",
      "errorMsg": "Please enter your youtube channel URL.",
      "sellix": "/tawkto"
    },
    {
      "id": 5,
      "name": "Youtube Subscribers",
      "quantity": "2000",
      "salePrice": 150,
      "regex": "^https?:\\/\\/(?:www\\.)?youtube\\.com\\/(?:c\\/|channel\\/|user\\/)?([a-zA-Z0-9_-]{1,})$",
      "errorMsg": "Please enter your youtube channel URL.",
      "sellix": "/tawkto"
    }
  ],
  "youtubeViews": [
    {
      "id": 0,
      "name": "Youtube Views",
      "quantity": "200",
      "salePrice": 2.99,
      "regex": "^https?:\\/\\/(?:www\\.)?youtube\\.com\\/watch\\?v=([a-zA-Z0-9_-]{11})$",
      "errorMsg": "Please enter your youtube video URL.",
      "sellix": "/tawkto"
    },
    {
      "id": 1,
      "name": "Youtube Views",
      "quantity": "500",
      "salePrice": 4.99,
      "regex": "^https?:\\/\\/(?:www\\.)?youtube\\.com\\/watch\\?v=([a-zA-Z0-9_-]{11})$",
      "errorMsg": "Please enter your youtube video URL.",
      "sellix": "/tawkto"
    },
    {
      "id": 2,
      "name": "Youtube Views",
      "quantity": "1000",
      "salePrice": 9.99,
      "regex": "^https?:\\/\\/(?:www\\.)?youtube\\.com\\/watch\\?v=([a-zA-Z0-9_-]{11})$",
      "errorMsg": "Please enter your youtube video URL.",
      "sellix": "/tawkto"
    },
    {
      "id": 3,
      "name": "Youtube Views",
      "quantity": "5000",
      "salePrice": 19.99,
      "regex": "^https?:\\/\\/(?:www\\.)?youtube\\.com\\/watch\\?v=([a-zA-Z0-9_-]{11})$",
      "errorMsg": "Please enter your youtube video URL.",
      "sellix": "/tawkto"
    },
    {
      "id": 4,
      "name": "Youtube Views",
      "quantity": "10000",
      "salePrice": 29.99,
      "regex": "^https?:\\/\\/(?:www\\.)?youtube\\.com\\/watch\\?v=([a-zA-Z0-9_-]{11})$",
      "errorMsg": "Please enter your youtube video URL.",
      "sellix": "/tawkto"
    },
    {
      "id": 5,
      "name": "Youtube Views",
      "quantity": "20000",
      "salePrice": 50,
      "regex": "^https?:\\/\\/(?:www\\.)?youtube\\.com\\/watch\\?v=([a-zA-Z0-9_-]{11})$",
      "errorMsg": "Please enter your youtube video URL.",
      "sellix": "/tawkto"
    }
  ],
  "facebookLikes": [
    {
      "id": 0,
      "name": "facebook Likes",
      "quantity": "1000",
      "salePrice": 1.99,
      "regex": "^https?:\\/\\/(?:www\\.)?facebook\\.com\\/(?:[a-zA-Z0-9\\.]+\\/)?photos\\/(?:[a-zA-Z0-9\\.]+\\/)?(\\d+)",
      "errorMsg": "Please enter your facebook photo URL.",
      "sellix": "/tawkto"
    },
    {
      "id": 1,
      "name": "Facebook Likes",
      "quantity": "2500",
      "salePrice": 3.99,
      "regex": "^https?:\\/\\/(?:www\\.)?facebook\\.com\\/(?:[a-zA-Z0-9\\.]+\\/)?photos\\/(?:[a-zA-Z0-9\\.]+\\/)?(\\d+)",
      "errorMsg": "Please enter your facebook photo URL.",
      "sellix": "/tawkto"
    },
    {
      "id": 2,
      "name": "Facebook Likes",
      "quantity": "5000",
      "salePrice": 6.99,
      "regex": "^https?:\\/\\/(?:www\\.)?facebook\\.com\\/(?:[a-zA-Z0-9\\.]+\\/)?photos\\/(?:[a-zA-Z0-9\\.]+\\/)?(\\d+)",
      "errorMsg": "Please enter your facebook photo URL.",
      "sellix": "/tawkto"
    },
    {
      "id": 3,
      "name": "Facebook Likes",
      "quantity": "10000",
      "salePrice": 9.99,
      "regex": "^https?:\\/\\/(?:www\\.)?facebook\\.com\\/(?:[a-zA-Z0-9\\.]+\\/)?photos\\/(?:[a-zA-Z0-9\\.]+\\/)?(\\d+)",
      "errorMsg": "Please enter your facebook photo URL.",
      "sellix": "/tawkto"
    },
    {
      "id": 4,
      "name": "Facebook Likes",
      "quantity": "20000",
      "salePrice": 19.99,
      "regex": "^https?:\\/\\/(?:www\\.)?facebook\\.com\\/(?:[a-zA-Z0-9\\.]+\\/)?photos\\/(?:[a-zA-Z0-9\\.]+\\/)?(\\d+)",
      "errorMsg": "Please enter your facebook photo URL.",
      "sellix": "/tawkto"
    },
    {
      "id": 5,
      "name": "Facebook Likes",
      "quantity": "50000",
      "salePrice": 29.99,
      "regex": "^https?:\\/\\/(?:www\\.)?facebook\\.com\\/(?:[a-zA-Z0-9\\.]+\\/)?photos\\/(?:[a-zA-Z0-9\\.]+\\/)?(\\d+)",
      "errorMsg": "Please enter your facebook photo URL.",
      "sellix": "/tawkto"
    },
    {
      "id": 6,
      "name": "Facebook Likes",
      "quantity": "100000",
      "salePrice": 50,
      "regex": "^https?:\\/\\/(?:www\\.)?facebook\\.com\\/(?:[a-zA-Z0-9\\.]+\\/)?photos\\/(?:[a-zA-Z0-9\\.]+\\/)?(\\d+)",
      "errorMsg": "Please enter your facebook photo URL.",
      "sellix": "/tawkto"
    }
  ],
  "facebookFollowers": [
    {
      "id": 0,
      "name": "Facebook Followers",
      "quantity": "100",
      "salePrice": 2.99,
      "regex": "^https?:\\/\\/(?:www\\.)?facebook\\.com\\/(?:[a-zA-Z0-9\\.]+\\/)?(?:profile\\.php\\?id=\\d+|[a-zA-Z0-9\\.]+)$",
      "errorMsg": "Please enter your facebook profile URL.",
      "sellix": "/tawkto"
    },
    {
      "id": 1,
      "name": "Facebook Followers",
      "quantity": "250",
      "salePrice": 4.99,
      "regex": "^https?:\\/\\/(?:www\\.)?facebook\\.com\\/(?:[a-zA-Z0-9\\.]+\\/)?(?:profile\\.php\\?id=\\d+|[a-zA-Z0-9\\.]+)$",
      "errorMsg": "Please enter your facebook profile URL.",
      "sellix": "/tawkto"
    },
    {
      "id": 2,
      "name": "Facebook Followers",
      "quantity": "500",
      "salePrice": 8.99,
      "regex": "^https?:\\/\\/(?:www\\.)?facebook\\.com\\/(?:[a-zA-Z0-9\\.]+\\/)?(?:profile\\.php\\?id=\\d+|[a-zA-Z0-9\\.]+)$",
      "errorMsg": "Please enter your facebook profile URL.",
      "sellix": "/tawkto"
    },
    {
      "id": 3,
      "name": "Facebook Followers",
      "quantity": "1000",
      "salePrice": 14.99,
      "regex": "^https?:\\/\\/(?:www\\.)?facebook\\.com\\/(?:[a-zA-Z0-9\\.]+\\/)?(?:profile\\.php\\?id=\\d+|[a-zA-Z0-9\\.]+)$",
      "errorMsg": "Please enter your facebook profile URL.",
      "sellix": "/tawkto"
    },
    {
      "id": 4,
      "name": "Facebook Followers",
      "quantity": "2500",
      "salePrice": 29.99,
      "regex": "^https?:\\/\\/(?:www\\.)?facebook\\.com\\/(?:[a-zA-Z0-9\\.]+\\/)?(?:profile\\.php\\?id=\\d+|[a-zA-Z0-9\\.]+)$",
      "errorMsg": "Please enter your facebook profile URL.",
      "sellix": "/tawkto"
    },
    {
      "id": 5,
      "name": "Facebook Followers",
      "quantity": "5000",
      "salePrice": 49.99,
      "regex": "^https?:\\/\\/(?:www\\.)?facebook\\.com\\/(?:[a-zA-Z0-9\\.]+\\/)?(?:profile\\.php\\?id=\\d+|[a-zA-Z0-9\\.]+)$",
      "errorMsg": "Please enter your facebook profile URL.",
      "sellix": "/tawkto"
    },
    {
      "id": 6,
      "name": "Facebook Followers",
      "quantity": "10000",
      "salePrice": 100,
      "regex": "^https?:\\/\\/(?:www\\.)?facebook\\.com\\/(?:[a-zA-Z0-9\\.]+\\/)?(?:profile\\.php\\?id=\\d+|[a-zA-Z0-9\\.]+)$",
      "errorMsg": "Please enter your facebook profile URL.",
      "sellix": "/tawkto"
    }
  ],
  "facebookViews": [
    {
      "id": 0,
      "name": "Facebook Views",
      "quantity": "1000",
      "salePrice": 3.99,
      "regex": "^https?:\\/\\/(?:www\\.)?facebook\\.com\\/(?:[a-zA-Z0-9\\.]+\\/)?videos\\/(?:[a-zA-Z0-9\\.]+\\/)?(\\d+)",
      "errorMsg": "Please enter your facebook video URL.",
      "sellix": "/tawkto"
    },
    {
      "id": 1,
      "name": "Facebook Views",
      "quantity": "2500",
      "salePrice": 9.99,
      "regex": "^https?:\\/\\/(?:www\\.)?facebook\\.com\\/(?:[a-zA-Z0-9\\.]+\\/)?videos\\/(?:[a-zA-Z0-9\\.]+\\/)?(\\d+)",
      "errorMsg": "Please enter your facebook video URL.",
      "sellix": "/tawkto"
    },
    {
      "id": 2,
      "name": "Facebook Views",
      "quantity": "5000",
      "salePrice": 15.99,
      "regex": "^https?:\\/\\/(?:www\\.)?facebook\\.com\\/(?:[a-zA-Z0-9\\.]+\\/)?videos\\/(?:[a-zA-Z0-9\\.]+\\/)?(\\d+)",
      "errorMsg": "Please enter your facebook video URL.",
      "sellix": "/tawkto"
    },
    {
      "id": 3,
      "name": "Facebook Views",
      "quantity": "10000",
      "salePrice": 24.99,
      "regex": "^https?:\\/\\/(?:www\\.)?facebook\\.com\\/(?:[a-zA-Z0-9\\.]+\\/)?videos\\/(?:[a-zA-Z0-9\\.]+\\/)?(\\d+)",
      "errorMsg": "Please enter your facebook video URL.",
      "sellix": "/tawkto"
    },
    {
      "id": 4,
      "name": "Facebook Views",
      "quantity": "20000",
      "salePrice": 44.99,
      "regex": "^https?:\\/\\/(?:www\\.)?facebook\\.com\\/(?:[a-zA-Z0-9\\.]+\\/)?videos\\/(?:[a-zA-Z0-9\\.]+\\/)?(\\d+)",
      "errorMsg": "Please enter your facebook video URL.",
      "sellix": "/tawkto"
    },
    {
      "id": 5,
      "name": "Facebook Views",
      "quantity": "50000",
      "salePrice": 99.99,
      "regex": "^https?:\\/\\/(?:www\\.)?facebook\\.com\\/(?:[a-zA-Z0-9\\.]+\\/)?videos\\/(?:[a-zA-Z0-9\\.]+\\/)?(\\d+)",
      "errorMsg": "Please enter your facebook video URL.",
      "sellix": "/tawkto"
    },
    {
      "id": 6,
      "name": "Facebook Views",
      "quantity": "100000",
      "salePrice": 189.99,
      "regex": "^https?:\\/\\/(?:www\\.)?facebook\\.com\\/(?:[a-zA-Z0-9\\.]+\\/)?videos\\/(?:[a-zA-Z0-9\\.]+\\/)?(\\d+)",
      "errorMsg": "Please enter your facebook video URL.",
      "sellix": "/tawkto"
    }
  ],
  "tiktokLikes": [
    {
      "id": 0,
      "name": "Tiktok Likes",
      "quantity": "1000",
      "salePrice": 1.99,
      "regex": "^https?:\\/\\/(?:www\\.)?tiktok\\.com\\/@([a-zA-Z0-9._-]+)\\/video\\/(\\d+)\\/?",
      "errorMsg": "Please enter your tiktok video URL.",
      "sellix": "/tawkto"
    },
    {
      "id": 1,
      "name": "Tiktok Likes",
      "quantity": "2500",
      "salePrice": 2.99,
      "regex": "^https?:\\/\\/(?:www\\.)?tiktok\\.com\\/@([a-zA-Z0-9._-]+)\\/video\\/(\\d+)\\/?",
      "errorMsg": "Please enter your tiktok video URL.",
      "sellix": "/tawkto"
    },
    {
      "id": 2,
      "name": "Tiktok Likes",
      "quantity": "5000",
      "salePrice": 4.99,
      "regex": "^https?:\\/\\/(?:www\\.)?tiktok\\.com\\/@([a-zA-Z0-9._-]+)\\/video\\/(\\d+)\\/?",
      "errorMsg": "Please enter your tiktok video URL.",
      "sellix": "/tawkto"
    },
    {
      "id": 3,
      "name": "Tiktok Likes",
      "quantity": "10000",
      "salePrice": 9.99,
      "regex": "^https?:\\/\\/(?:www\\.)?tiktok\\.com\\/@([a-zA-Z0-9._-]+)\\/video\\/(\\d+)\\/?",
      "errorMsg": "Please enter your tiktok video URL.",
      "sellix": "/tawkto"
    },
    {
      "id": 4,
      "name": "Tiktok Likes",
      "quantity": "25000",
      "salePrice": 19.99,
      "regex": "^https?:\\/\\/(?:www\\.)?tiktok\\.com\\/@([a-zA-Z0-9._-]+)\\/video\\/(\\d+)\\/?",
      "errorMsg": "Please enter your tiktok video URL.",
      "sellix": "/tawkto"
    },
    {
      "id": 5,
      "name": "Tiktok Likes",
      "quantity": "50000",
      "salePrice": 39.99,
      "regex": "^https?:\\/\\/(?:www\\.)?tiktok\\.com\\/@([a-zA-Z0-9._-]+)\\/video\\/(\\d+)\\/?",
      "errorMsg": "Please enter your tiktok video URL.",
      "sellix": "/tawkto"
    },
    {
      "id": 6,
      "name": "Tiktok Likes",
      "quantity": "100000",
      "salePrice": 69,
      "regex": "^https?:\\/\\/(?:www\\.)?tiktok\\.com\\/@([a-zA-Z0-9._-]+)\\/video\\/(\\d+)\\/?",
      "errorMsg": "Please enter your tiktok video URL.",
      "sellix": "/tawkto"
    }
  ],
  "tiktokFollowers": [
    {
      "id": 0,
      "name": "Tiktok Followers",
      "quantity": "100",
      "salePrice": 3.99,
      "regex": "^https?:\\/\\/(?:www\\.)?tiktok\\.com\\/@([a-zA-Z0-9._-]+)\\/?",
      "errorMsg": "Please enter your tiktok profile URL.",
      "sellix": "/tawkto"
    },
    {
      "id": 1,
      "name": "Tiktok Followers",
      "quantity": "250",
      "salePrice": 5.99,
      "regex": "^https?:\\/\\/(?:www\\.)?tiktok\\.com\\/@([a-zA-Z0-9._-]+)\\/?",
      "errorMsg": "Please enter your tiktok profile URL.",
      "sellix": "/tawkto"
    },
    {
      "id": 2,
      "name": "Tiktok Followers",
      "quantity": "500",
      "salePrice": 9.99,
      "regex": "^https?:\\/\\/(?:www\\.)?tiktok\\.com\\/@([a-zA-Z0-9._-]+)\\/?",
      "errorMsg": "Please enter your tiktok profile URL.",
      "sellix": "/tawkto"
    },
    {
      "id": 3,
      "name": "Tiktok Followers",
      "quantity": "1000",
      "salePrice": 19.99,
      "regex": "^https?:\\/\\/(?:www\\.)?tiktok\\.com\\/@([a-zA-Z0-9._-]+)\\/?",
      "errorMsg": "Please enter your tiktok profile URL.",
      "sellix": "/tawkto"
    },
    {
      "id": 4,
      "name": "Tiktok Followers",
      "quantity": "2500",
      "salePrice": 35.99,
      "regex": "^https?:\\/\\/(?:www\\.)?tiktok\\.com\\/@([a-zA-Z0-9._-]+)\\/?",
      "errorMsg": "Please enter your tiktok profile URL.",
      "sellix": "/tawkto"
    },
    {
      "id": 5,
      "name": "Tiktok Followers",
      "quantity": "5000",
      "salePrice": 69.99,
      "regex": "^https?:\\/\\/(?:www\\.)?tiktok\\.com\\/@([a-zA-Z0-9._-]+)\\/?",
      "errorMsg": "Please enter your tiktok profile URL.",
      "sellix": "/tawkto"
    },
    {
      "id": 6,
      "name": "Tiktok Followers",
      "quantity": "10000",
      "salePrice": 100,
      "regex": "^https?:\\/\\/(?:www\\.)?tiktok\\.com\\/@([a-zA-Z0-9._-]+)\\/?",
      "errorMsg": "Please enter your tiktok profile URL.",
      "sellix": "/tawkto"
    }
  ],
  "tiktokViews": [
    {
      "id": 0,
      "name": "Tiktok Views",
      "quantity": "1000",
      "salePrice": 1.99,
      "regex": "^https?:\\/\\/(?:www\\.)?tiktok\\.com\\/@([a-zA-Z0-9._-]+)\\/video\\/(\\d+)\\/?",
      "errorMsg": "Please enter your tiktok video URL.",
      "sellix": "/tawkto"
    },
    {
      "id": 1,
      "name": "Tiktok Views",
      "quantity": "2500",
      "salePrice": 2.99,
      "regex": "^https?:\\/\\/(?:www\\.)?tiktok\\.com\\/@([a-zA-Z0-9._-]+)\\/video\\/(\\d+)\\/?",
      "errorMsg": "Please enter your tiktok profile URL.",
      "sellix": "/tawkto"
    },
    {
      "id": 2,
      "name": "Tiktok Views",
      "quantity": "5000",
      "salePrice": 4.99,
      "regex": "^https?:\\/\\/(?:www\\.)?tiktok\\.com\\/@([a-zA-Z0-9._-]+)\\/video\\/(\\d+)\\/?",
      "errorMsg": "Please enter your tiktok profile URL.",
      "sellix": "/tawkto"
    },
    {
      "id": 3,
      "name": "Tiktok Views",
      "quantity": "10000",
      "salePrice": 9.99,
      "regex": "^https?:\\/\\/(?:www\\.)?tiktok\\.com\\/@([a-zA-Z0-9._-]+)\\/video\\/(\\d+)\\/?",
      "errorMsg": "Please enter your tiktok profile URL.",
      "sellix": "/tawkto"
    },
    {
      "id": 4,
      "name": "Tiktok Views",
      "quantity": "25000",
      "salePrice": 19.99,
      "regex": "^https?:\\/\\/(?:www\\.)?tiktok\\.com\\/@([a-zA-Z0-9._-]+)\\/video\\/(\\d+)\\/?",
      "errorMsg": "Please enter your tiktok profile URL.",
      "sellix": "/tawkto"
    },
    {
      "id": 5,
      "name": "Tiktok Views",
      "quantity": "50000",
      "salePrice": 39.99,
      "regex": "^https?:\\/\\/(?:www\\.)?tiktok\\.com\\/@([a-zA-Z0-9._-]+)\\/video\\/(\\d+)\\/?",
      "errorMsg": "Please enter your tiktok profile URL.",
      "sellix": "/tawkto"
    },
    {
      "id": 6,
      "name": "Tiktok Views",
      "quantity": "100000",
      "salePrice": 69,
      "regex": "^https?:\\/\\/(?:www\\.)?tiktok\\.com\\/@([a-zA-Z0-9._-]+)\\/video\\/(\\d+)\\/?",
      "errorMsg": "Please enter your tiktok profile URL.",
      "sellix": "/tawkto"
    }
  ],
  "twitterComments": [
    {
      "id": 0,
      "name": "Twitter Comments",
      "quantity": "10",
      "salePrice": 122,
      "regex": "^https?:\\/\\/twitter\\.com\\/(?:#!\\/)?(\\w+)\\/status(?:es)?\\/(\\d+)",
      "errorMsg": "Please enter your twitter tweet URL.",
      "sellix": "/tawkto"
    },
    {
      "id": 1,
      "name": "Twitter Comments",
      "quantity": "25",
      "salePrice": 304,
      "regex": "^https?:\\/\\/twitter\\.com\\/(?:#!\\/)?(\\w+)\\/status(?:es)?\\/(\\d+)",
      "errorMsg": "Please enter your twitter tweet URL.",
      "sellix": "/tawkto"
    },
    {
      "id": 2,
      "name": "Twitter Comments",
      "quantity": "50",
      "salePrice": 609,
      "regex": "^https?:\\/\\/twitter\\.com\\/(?:#!\\/)?(\\w+)\\/status(?:es)?\\/(\\d+)",
      "errorMsg": "Please enter your twitter tweet URL.",
      "sellix": "/tawkto"
    },
    {
      "id": 3,
      "name": "Twitter Comments",
      "quantity": "75",
      "salePrice": 915,
      "regex": "^https?:\\/\\/twitter\\.com\\/(?:#!\\/)?(\\w+)\\/status(?:es)?\\/(\\d+)",
      "errorMsg": "Please enter your twitter tweet URL.",
      "sellix": "/tawkto"
    },
    {
      "id": 4,
      "name": "Twitter Comments",
      "quantity": "100",
      "salePrice": 1218,
      "regex": "^https?:\\/\\/twitter\\.com\\/(?:#!\\/)?(\\w+)\\/status(?:es)?\\/(\\d+)",
      "errorMsg": "Please enter your twitter tweet URL.",
      "sellix": "/tawkto"
    }
  ],
  "twitterViews": [
    {
      "id": 0,
      "name": "Twitter Views",
      "quantity": "500",
      "salePrice": 3,
      "regex": "^https?:\\/\\/twitter\\.com\\/(?:#!\\/)?(\\w+)\\/status(?:es)?\\/(\\d+)",
      "errorMsg": "Please enter your twitter tweet URL.",
      "sellix": "/tawkto"
    },
    {
      "id": 1,
      "name": "Twitter Views",
      "quantity": "1000",
      "salePrice": 6,
      "regex": "^https?:\\/\\/twitter\\.com\\/(?:#!\\/)?(\\w+)\\/status(?:es)?\\/(\\d+)",
      "errorMsg": "Please enter your twitter tweet URL.",
      "sellix": "/tawkto"
    },
    {
      "id": 2,
      "name": "Twitter Views",
      "quantity": "2500",
      "salePrice": 10,
      "regex": "^https?:\\/\\/twitter\\.com\\/(?:#!\\/)?(\\w+)\\/status(?:es)?\\/(\\d+)",
      "errorMsg": "Please enter your twitter tweet URL.",
      "sellix": "/tawkto"
    },
    {
      "id": 3,
      "name": "Twitter Views",
      "quantity": "5000",
      "salePrice": 20,
      "regex": "^https?:\\/\\/twitter\\.com\\/(?:#!\\/)?(\\w+)\\/status(?:es)?\\/(\\d+)",
      "errorMsg": "Please enter your twitter tweet URL.",
      "sellix": "/tawkto"
    },
    {
      "id": 4,
      "name": "Twitter Views",
      "quantity": "10000",
      "salePrice": 38,
      "regex": "^https?:\\/\\/twitter\\.com\\/(?:#!\\/)?(\\w+)\\/status(?:es)?\\/(\\d+)",
      "errorMsg": "Please enter your twitter tweet URL.",
      "sellix": "/tawkto"
    }
  ],
  "twitterLikes": [
    {
      "id": 0,
      "name": "Twitter Likes",
      "quantity": "50",
      "salePrice": 1.99,
      "regex": "^https?:\\/\\/twitter\\.com\\/(?:#!\\/)?(\\w+)\\/status(?:es)?\\/(\\d+)",
      "errorMsg": "Please enter your twitter tweet URL.",
      "sellix": "/tawkto"
    },
    {
      "id": 1,
      "name": "Twitter Likes",
      "quantity": "100",
      "salePrice": 2.99,
      "regex": "^https?:\\/\\/twitter\\.com\\/(?:#!\\/)?(\\w+)\\/status(?:es)?\\/(\\d+)",
      "errorMsg": "Please enter your twitter tweet URL.",
      "sellix": "/tawkto"
    },
    {
      "id": 2,
      "name": "Twitter Likes",
      "quantity": "250",
      "salePrice": 4.99,
      "regex": "^https?:\\/\\/twitter\\.com\\/(?:#!\\/)?(\\w+)\\/status(?:es)?\\/(\\d+)",
      "errorMsg": "Please enter your twitter tweet URL.",
      "sellix": "/tawkto"
    },
    {
      "id": 3,
      "name": "Twitter Likes",
      "quantity": "500",
      "salePrice": 8.99,
      "regex": "^https?:\\/\\/twitter\\.com\\/(?:#!\\/)?(\\w+)\\/status(?:es)?\\/(\\d+)",
      "errorMsg": "Please enter your twitter tweet URL.",
      "sellix": "/tawkto"
    },
    {
      "id": 4,
      "name": "Twitter Likes",
      "quantity": "1000",
      "salePrice": 14.99,
      "regex": "^https?:\\/\\/twitter\\.com\\/(?:#!\\/)?(\\w+)\\/status(?:es)?\\/(\\d+)",
      "errorMsg": "Please enter your twitter tweet URL.",
      "sellix": "/tawkto"
    },
    {
      "id": 5,
      "name": "Twitter Likes",
      "quantity": "2500",
      "salePrice": 29.99,
      "regex": "^https?:\\/\\/twitter\\.com\\/(?:#!\\/)?(\\w+)\\/status(?:es)?\\/(\\d+)",
      "errorMsg": "Please enter your twitter tweet URL.",
      "sellix": "/tawkto"
    },
    {
      "id": 6,
      "name": "Twitter Likes",
      "quantity": "5000",
      "salePrice": 49.99,
      "regex": "^https?:\\/\\/twitter\\.com\\/(?:#!\\/)?(\\w+)\\/status(?:es)?\\/(\\d+)",
      "errorMsg": "Please enter your twitter tweet URL.",
      "sellix": "/tawkto"
    }
  ],
  "twitterFollowers": [
    {
      "id": 0,
      "name": "Twitter Followers",
      "quantity": "100",
      "salePrice": 3.99,
      "regex": "^https?:\\/\\/twitter\\.com\\/(?:#!\\/)?(\\w+)(?:\\/\\w+)*$",
      "errorMsg": "Please enter your twitter profile URL.",
      "sellix": "/tawkto"
    },
    {
      "id": 1,
      "name": "Twitter Followers",
      "quantity": "250",
      "salePrice": 6.99,
      "regex": "^https?:\\/\\/twitter\\.com\\/(?:#!\\/)?(\\w+)(?:\\/\\w+)*$",
      "errorMsg": "Please enter your twitter profile URL.",
      "sellix": "/tawkto"
    },
    {
      "id": 2,
      "name": "Twitter Followers",
      "quantity": "500",
      "salePrice": 12.99,
      "regex": "^https?:\\/\\/twitter\\.com\\/(?:#!\\/)?(\\w+)(?:\\/\\w+)*$",
      "errorMsg": "Please enter your twitter profile URL.",
      "sellix": "/tawkto"
    },
    {
      "id": 3,
      "name": "Twitter Followers",
      "quantity": "1000",
      "salePrice": 19.99,
      "regex": "^https?:\\/\\/twitter\\.com\\/(?:#!\\/)?(\\w+)(?:\\/\\w+)*$",
      "errorMsg": "Please enter your twitter profile URL.",
      "sellix": "/tawkto"
    },
    {
      "id": 4,
      "name": "Twitter Followers",
      "quantity": "2500",
      "salePrice": 29.99,
      "regex": "^https?:\\/\\/twitter\\.com\\/(?:#!\\/)?(\\w+)(?:\\/\\w+)*$",
      "errorMsg": "Please enter your twitter profile URL.",
      "sellix": "/tawkto"
    },
    {
      "id": 5,
      "name": "Twitter Followers",
      "quantity": "5000",
      "salePrice": 49.99,
      "regex": "^https?:\\/\\/twitter\\.com\\/(?:#!\\/)?(\\w+)(?:\\/\\w+)*$",
      "errorMsg": "Please enter your twitter profile URL.",
      "sellix": "/tawkto"
    },
    {
      "id": 5,
      "name": "Twitter Followers",
      "quantity": "10000",
      "salePrice": 90,
      "regex": "^https?:\\/\\/twitter\\.com\\/(?:#!\\/)?(\\w+)(?:\\/\\w+)*$",
      "errorMsg": "Please enter your twitter profile URL.",
      "sellix": "/tawkto"
    }
  ],
  "twitterRetweets": [
    {
      "id": 0,
      "name": "Twitter Retweets",
      "quantity": "50",
      "salePrice": 1.99,
      "regex": "^https?:\\/\\/twitter\\.com\\/(?:#!\\/)?(\\w+)\\/status(?:es)?\\/(\\d+)",
      "errorMsg": "Please enter your twitter tweet URL.",
      "sellix": "/tawkto"
    },
    {
      "id": 1,
      "name": "Twitter Retweets",
      "quantity": "100",
      "salePrice": 2.99,
      "regex": "^https?:\\/\\/twitter\\.com\\/(?:#!\\/)?(\\w+)\\/status(?:es)?\\/(\\d+)",
      "errorMsg": "Please enter your twitter tweet URL.",
      "sellix": "/tawkto"
    },
    {
      "id": 2,
      "name": "Twitter Retweets",
      "quantity": "250",
      "salePrice": 4.99,
      "regex": "^https?:\\/\\/twitter\\.com\\/(?:#!\\/)?(\\w+)\\/status(?:es)?\\/(\\d+)",
      "errorMsg": "Please enter your twitter tweet URL.",
      "sellix": "/tawkto"
    },
    {
      "id": 3,
      "name": "Twitter Retweets",
      "quantity": "500",
      "salePrice": 8.99,
      "regex": "^https?:\\/\\/twitter\\.com\\/(?:#!\\/)?(\\w+)\\/status(?:es)?\\/(\\d+)",
      "errorMsg": "Please enter your twitter tweet URL.",
      "sellix": "/tawkto"
    },
    {
      "id": 4,
      "name": "Twitter Retweets",
      "quantity": "1000",
      "salePrice": 14.99,
      "regex": "^https?:\\/\\/twitter\\.com\\/(?:#!\\/)?(\\w+)\\/status(?:es)?\\/(\\d+)",
      "errorMsg": "Please enter your twitter tweet URL.",
      "sellix": "/tawkto"
    },
    {
      "id": 5,
      "name": "Twitter Retweets",
      "quantity": "2500",
      "salePrice": 29.99,
      "regex": "^https?:\\/\\/twitter\\.com\\/(?:#!\\/)?(\\w+)\\/status(?:es)?\\/(\\d+)",
      "errorMsg": "Please enter your twitter tweet URL.",
      "sellix": "/tawkto"
    },
    {
      "id": 6,
      "name": "Twitter Retweets",
      "quantity": "5000",
      "salePrice": 49.99,
      "regex": "^https?:\\/\\/twitter\\.com\\/(?:#!\\/)?(\\w+)\\/status(?:es)?\\/(\\d+)",
      "errorMsg": "Please enter your twitter tweet URL.",
      "sellix": "/tawkto"
    }
  ],
  "twitterImpressions": [
    {
      "id": 0,
      "name": "Twitter Impressions",
      "quantity": "100",
      "salePrice": 2,
      "regex": "^https?:\\/\\/twitter\\.com\\/(?:#!\\/)?(\\w+)\\/status(?:es)?\\/(\\d+)",
      "errorMsg": "Please enter your twitter tweet URL.",
      "sellix": "/tawkto"
    },
    {
      "id": 1,
      "name": "Twitter Impressions",
      "quantity": "250",
      "salePrice": 4,
      "regex": "^https?:\\/\\/twitter\\.com\\/(?:#!\\/)?(\\w+)\\/status(?:es)?\\/(\\d+)",
      "errorMsg": "Please enter your twitter tweet URL.",
      "sellix": "/tawkto"
    },
    {
      "id": 2,
      "name": "Twitter Impressions",
      "quantity": "500",
      "salePrice": 7,
      "regex": "^https?:\\/\\/twitter\\.com\\/(?:#!\\/)?(\\w+)\\/status(?:es)?\\/(\\d+)",
      "errorMsg": "Please enter your twitter tweet URL.",
      "sellix": "/tawkto"
    },
    {
      "id": 3,
      "name": "Twitter Impressions",
      "quantity": "1000",
      "salePrice": 10,
      "regex": "^https?:\\/\\/twitter\\.com\\/(?:#!\\/)?(\\w+)\\/status(?:es)?\\/(\\d+)",
      "errorMsg": "Please enter your twitter tweet URL.",
      "sellix": "/tawkto"
    },
    {
      "id": 4,
      "name": "Twitter Impressions",
      "quantity": "2500",
      "salePrice": 12,
      "regex": "^https?:\\/\\/twitter\\.com\\/(?:#!\\/)?(\\w+)\\/status(?:es)?\\/(\\d+)",
      "errorMsg": "Please enter your twitter tweet URL.",
      "sellix": "/tawkto"
    }
  ]
}
