{

	"id": "course1",
	"name":"Computer I",
	"description":"Introduction to Programming",
	"price":"5600",
	"instructor":"Mr. Right",
	"isActive":true,
	"enrollees": [

		{
			"id": "enrollee1",
			"userId":"user1",
			"fullName":"Eric Zantua",
			"dateEnrolled":2023-11-11
		},
		{
			"id": "enrollee2",
			"userId":"user2",
			"fullName":"Julia Guysayko",
			"dateEnrolled":2023-11-12
		}

	]

},
{

	"id": "course2",
	"name":"Math 54",
	"description":"Statistics with Probability",
	"price":"6500",
	"instructor":"Mr. Caspistrano",
	"isActive":true,
	"enrollees": [

		{
			"id": "enrollee3",
			"userId":"user2",
			"fullName":"Julia Guysayko",
			"dateEnrolled":2023-11-12
		}

	]

}