{
	"info": {
		"_postman_id": "4b000942-5833-4aa7-9cd4-95099631f635",
		"name": "CAPSTONE2",
		"schema": "https://schema.getpostman.com/json/collection/v2.1.0/collection.json",
		"_exporter_id": "24728899"
	},
	"item": [
		{
			"name": "USER - REGISTER",
			"request": {
				"method": "POST",
				"header": [],
				"body": {
					"mode": "raw",
					"raw": "{\r\n    \"email\" : \"user@gmail.com\",\r\n    \"password\" : \"pass123\"\r\n\r\n    \r\n    \r\n}",
					"options": {
						"raw": {
							"language": "json"
						}
					}
				},
				"url": {
					"raw": "localhost:6000/users/register",
					"host": [
						"localhost"
					],
					"port": "6000",
					"path": [
						"users",
						"register"
					]
				}
			},
			"response": []
		},
		{
			"name": "USER - LOGIN",
			"request": {
				"method": "POST",
				"header": [],
				"body": {
					"mode": "raw",
					"raw": "{\r\n    \"email\" : \"user200@gmail.com\",\r\n    \"password\" : \"pass1234\"\r\n}",
					"options": {
						"raw": {
							"language": "json"
						}
					}
				},
				"url": {
					"raw": "localhost:6000/users/login",
					"host": [
						"localhost"
					],
					"port": "6000",
					"path": [
						"users",
						"login"
					]
				}
			},
			"response": []
		},
		{
			"name": "PRODUCT - ADD",
			"request": {
				"auth": {
					"type": "bearer",
					"bearer": [
						{
							"key": "token",
							"value": "eyJhbGciOiJIUzI1NiIsInR5cCI6IkpXVCJ9.eyJpZCI6IjYzY2E0YWJiMTQyYTk2ZjhmN2U0NWMwYiIsImVtYWlsIjoiZXpAZ21haWwuY29tIiwiaXNBZG1pbiI6dHJ1ZSwiaXNVc2VyQWRtaW4iOmZhbHNlLCJpYXQiOjE2NzQ0NDEwMDB9.tHH4v5Jc45C6Sk9N1IiFzuWBlqsdLO09DB3Kn8bq6r4",
							"type": "string"
						}
					]
				},
				"method": "POST",
				"header": [],
				"body": {
					"mode": "raw",
					"raw": "{\r\n    \"name\":\"Apple Ipad Air 33224\",\r\n    \"description\" : \"256 GB, A2 Chipset, Apple Ipad\",\r\n    \"price\" : 50000,\r\n    \"stock\" : 100\r\n\r\n}",
					"options": {
						"raw": {
							"language": "json"
						}
					}
				},
				"url": {
					"raw": "localhost:6000/products/add",
					"host": [
						"localhost"
					],
					"port": "6000",
					"path": [
						"products",
						"add"
					]
				}
			},
			"response": []
		},
		{
			"name": "PRODUCTS - GET ALL ACTIVE",
			"request": {
				"method": "GET",
				"header": [],
				"url": {
					"raw": "localhost:6000/products",
					"host": [
						"localhost"
					],
					"port": "6000",
					"path": [
						"products"
					]
				}
			},
			"response": []
		},
		{
			"name": "PRODUCTS -GET ALL",
			"request": {
				"auth": {
					"type": "bearer",
					"bearer": [
						{
							"key": "token",
							"value": "eyJhbGciOiJIUzI1NiIsInR5cCI6IkpXVCJ9.eyJpZCI6IjYzY2E0NDQ3Y2M1NDM2NjFhMDk3NTY3OSIsImVtYWlsIjoianVsaWFndXlAZ21haWwuY29tIiwiaXNBZG1pbiI6ZmFsc2UsImlzVXNlckFkbWluIjpmYWxzZSwiaWF0IjoxNjc0NDQxOTk4fQ.XYApgNRu5mqwe2Bq-4DJ_BInR120CisReh4uU8ROmU4",
							"type": "string"
						}
					]
				},
				"method": "GET",
				"header": [],
				"url": {
					"raw": "localhost:6000/products/allproducts",
					"host": [
						"localhost"
					],
					"port": "6000",
					"path": [
						"products",
						"allproducts"
					]
				}
			},
			"response": []
		},
		{
			"name": "PRODUCT - ARCHIVE",
			"request": {
				"auth": {
					"type": "bearer",
					"bearer": [
						{
							"key": "token",
							"value": "eyJhbGciOiJIUzI1NiIsInR5cCI6IkpXVCJ9.eyJpZCI6IjYzY2E0YWJiMTQyYTk2ZjhmN2U0NWMwYiIsImVtYWlsIjoiZXpAZ21haWwuY29tIiwiaXNBZG1pbiI6dHJ1ZSwiaWF0IjoxNjc0MjAzMzA2fQ.YMBg4Z9DRHXO-xhByCESsoXLrWqcY4cNSgpPI1pRuKY",
							"type": "string"
						}
					]
				},
				"method": "PUT",
				"header": [],
				"url": {
					"raw": "localhost:6000/products/63ca4fb87a7bb7a8d2c2ac0d/archive",
					"host": [
						"localhost"
					],
					"port": "6000",
					"path": [
						"products",
						"63ca4fb87a7bb7a8d2c2ac0d",
						"archive"
					]
				}
			},
			"response": []
		},
		{
			"name": "PRODUCT - UPDATE",
			"request": {
				"auth": {
					"type": "bearer",
					"bearer": [
						{
							"key": "token",
							"value": "eyJhbGciOiJIUzI1NiIsInR5cCI6IkpXVCJ9.eyJpZCI6IjYzY2E0YWJiMTQyYTk2ZjhmN2U0NWMwYiIsImVtYWlsIjoiZXpAZ21haWwuY29tIiwiaXNBZG1pbiI6dHJ1ZSwiaWF0IjoxNjc0MjY2NTM2fQ.-K8xVDHs5yHRFZlWHem8-v8KzIoRUW2mVdg78l0iNIM",
							"type": "string"
						}
					]
				},
				"method": "PUT",
				"header": [],
				"body": {
					"mode": "raw",
					"raw": "{\r\n    \"name\":\"Smart Load 50\",\r\n    \"description\" : \"Gets Smart mobile load valued at P60\",\r\n    \"price\" : 55,\r\n    \"stock\" : 100,\r\n    \"isActive\" : true\r\n\r\n}",
					"options": {
						"raw": {
							"language": "json"
						}
					}
				},
				"url": {
					"raw": "localhost:6000/products/63ca50bd385f83d6f992b7c5/update",
					"host": [
						"localhost"
					],
					"port": "6000",
					"path": [
						"products",
						"63ca50bd385f83d6f992b7c5",
						"update"
					]
				}
			},
			"response": []
		},
		{
			"name": "PRODUCT - GET DETAILS",
			"request": {
				"auth": {
					"type": "bearer",
					"bearer": [
						{
							"key": "token",
							"value": "eyJhbGciOiJIUzI1NiIsInR5cCI6IkpXVCJ9.eyJpZCI6IjYzY2E0YWJiMTQyYTk2ZjhmN2U0NWMwYiIsImVtYWlsIjoiZXpAZ21haWwuY29tIiwiaXNBZG1pbiI6dHJ1ZSwiaWF0IjoxNjc0MjgwOTkxfQ.lZywn7PsGq5_aJT4eu94xvlGRdBWMJlDZ1pz2YRDhIE",
							"type": "string"
						}
					]
				},
				"method": "GET",
				"header": [],
				"url": {
					"raw": "localhost:6000/products/63ca4fb87a7bb7a8d2c2ac0d",
					"host": [
						"localhost"
					],
					"port": "6000",
					"path": [
						"products",
						"63ca4fb87a7bb7a8d2c2ac0d"
					]
				}
			},
			"response": []
		},
		{
			"name": "CART - ADD ITEM",
			"request": {
				"auth": {
					"type": "bearer",
					"bearer": [
						{
							"key": "token",
							"value": "eyJhbGciOiJIUzI1NiIsInR5cCI6IkpXVCJ9.eyJpZCI6IjYzY2RmNWQyMDJmZWQwZjVlZWY0MmI2YSIsImVtYWlsIjoidXNlckBnbWFpbC5jb20iLCJpc0FkbWluIjpmYWxzZSwiaXNVc2VyQWRtaW4iOmZhbHNlLCJpYXQiOjE2NzQ0NDIyMDJ9.fZwdvhdEDh4s5Ez_RmSIUzdjsILJSzTwaKUEsYq3EXc",
							"type": "string"
						}
					]
				},
				"method": "POST",
				"header": [],
				"body": {
					"mode": "raw",
					"raw": "{\r\n    \"productId\": \"63ca50bd385f83d6f992b7c5\",\r\n    \"quantity\": 1\r\n}",
					"options": {
						"raw": {
							"language": "json"
						}
					}
				},
				"url": {
					"raw": "localhost:6000/carts/add",
					"host": [
						"localhost"
					],
					"port": "6000",
					"path": [
						"carts",
						"add"
					]
				}
			},
			"response": []
		},
		{
			"name": "CART - CHECKOUT",
			"request": {
				"auth": {
					"type": "bearer",
					"bearer": [
						{
							"key": "token",
							"value": "eyJhbGciOiJIUzI1NiIsInR5cCI6IkpXVCJ9.eyJpZCI6IjYzY2RmNWQyMDJmZWQwZjVlZWY0MmI2YSIsImVtYWlsIjoidXNlckBnbWFpbC5jb20iLCJpc0FkbWluIjpmYWxzZSwiaXNVc2VyQWRtaW4iOmZhbHNlLCJpYXQiOjE2NzQ0NDIyMDJ9.fZwdvhdEDh4s5Ez_RmSIUzdjsILJSzTwaKUEsYq3EXc",
							"type": "string"
						}
					]
				},
				"method": "POST",
				"header": [],
				"url": {
					"raw": "localhost:6000/carts/checkout",
					"host": [
						"localhost"
					],
					"port": "6000",
					"path": [
						"carts",
						"checkout"
					]
				}
			},
			"response": []
		},
		{
			"name": "CART - EDIT QTY",
			"request": {
				"auth": {
					"type": "bearer",
					"bearer": [
						{
							"key": "token",
							"value": "eyJhbGciOiJIUzI1NiIsInR5cCI6IkpXVCJ9.eyJpZCI6IjYzY2RmNWQyMDJmZWQwZjVlZWY0MmI2YSIsImVtYWlsIjoidXNlckBnbWFpbC5jb20iLCJpc0FkbWluIjpmYWxzZSwiaXNVc2VyQWRtaW4iOmZhbHNlLCJpYXQiOjE2NzQ0NDIyMDJ9.fZwdvhdEDh4s5Ez_RmSIUzdjsILJSzTwaKUEsYq3EXc",
							"type": "string"
						}
					]
				},
				"method": "PUT",
				"header": [],
				"body": {
					"mode": "raw",
					"raw": "{\r\n    \"quantity\": 4,\r\n    \"productId\": \"63cdf1a0ad3a4ea7a913ab21\"\r\n\r\n}",
					"options": {
						"raw": {
							"language": "json"
						}
					}
				},
				"url": {
					"raw": "localhost:6000/carts/editqty",
					"host": [
						"localhost"
					],
					"port": "6000",
					"path": [
						"carts",
						"editqty"
					]
				}
			},
			"response": []
		},
		{
			"name": "USER - SET AS ADMIN",
			"request": {
				"auth": {
					"type": "bearer",
					"bearer": [
						{
							"key": "token",
							"value": "eyJhbGciOiJIUzI1NiIsInR5cCI6IkpXVCJ9.eyJpZCI6IjYzY2RlZTliNmE4MWJhNTMwMjNiODQyYyIsImVtYWlsIjoic3VwZXJAZ21haWwuY29tIiwiaXNBZG1pbiI6dHJ1ZSwiaXNVc2VyQWRtaW4iOnRydWUsImlhdCI6MTY3NDQ0MDgzNn0.GqRxVzCQUGrpG3-KUjpM0uM478WBX6doaV-lVAnZYfE",
							"type": "string"
						}
					]
				},
				"method": "PUT",
				"header": [],
				"url": {
					"raw": "localhost:6000/users/63ccf5821e92a33562475a3e/setadmin",
					"host": [
						"localhost"
					],
					"port": "6000",
					"path": [
						"users",
						"63ccf5821e92a33562475a3e",
						"setadmin"
					]
				}
			},
			"response": []
		},
		{
			"name": "ORDERS - GET ALL",
			"request": {
				"auth": {
					"type": "bearer",
					"bearer": [
						{
							"key": "token",
							"value": "eyJhbGciOiJIUzI1NiIsInR5cCI6IkpXVCJ9.eyJpZCI6IjYzY2RmNWQyMDJmZWQwZjVlZWY0MmI2YSIsImVtYWlsIjoidXNlckBnbWFpbC5jb20iLCJpc0FkbWluIjpmYWxzZSwiaXNVc2VyQWRtaW4iOmZhbHNlLCJpYXQiOjE2NzQ0NDIyMDJ9.fZwdvhdEDh4s5Ez_RmSIUzdjsILJSzTwaKUEsYq3EXc",
							"type": "string"
						}
					]
				},
				"method": "GET",
				"header": [],
				"url": {
					"raw": "localhost:6000/orders",
					"host": [
						"localhost"
					],
					"port": "6000",
					"path": [
						"orders"
					]
				}
			},
			"response": []
		},
		{
			"name": "CART - VIEW ITEMS",
			"request": {
				"method": "GET",
				"header": [],
				"url": {
					"raw": "localhost:6000/carts/63cdf5d202fed0f5eef42b6a",
					"host": [
						"localhost"
					],
					"port": "6000",
					"path": [
						"carts",
						"63cdf5d202fed0f5eef42b6a"
					]
				}
			},
			"response": []
		},
		{
			"name": "USER - GET ALL USERS",
			"request": {
				"auth": {
					"type": "bearer",
					"bearer": [
						{
							"key": "token",
							"value": "eyJhbGciOiJIUzI1NiIsInR5cCI6IkpXVCJ9.eyJpZCI6IjYzY2RlZTliNmE4MWJhNTMwMjNiODQyYyIsImVtYWlsIjoic3VwZXJAZ21haWwuY29tIiwiaXNBZG1pbiI6dHJ1ZSwiaXNVc2VyQWRtaW4iOnRydWUsImlhdCI6MTY3NDQ0MDgzNn0.GqRxVzCQUGrpG3-KUjpM0uM478WBX6doaV-lVAnZYfE",
							"type": "string"
						}
					]
				},
				"method": "GET",
				"header": [],
				"url": {
					"raw": "localhost:6000/users/",
					"host": [
						"localhost"
					],
					"port": "6000",
					"path": [
						"users",
						""
					]
				}
			},
			"response": []
		},
		{
			"name": "ORDER - GET USER ORDERS",
			"request": {
				"method": "GET",
				"header": [],
				"url": {
					"raw": "localhost:6000/orders/63cdf5d202fed0f5eef42b6a",
					"host": [
						"localhost"
					],
					"port": "6000",
					"path": [
						"orders",
						"63cdf5d202fed0f5eef42b6a"
					]
				}
			},
			"response": []
		},
		{
			"name": "STATUS - UPDATE STATUS",
			"request": {
				"auth": {
					"type": "bearer",
					"bearer": [
						{
							"key": "token",
							"value": "eyJhbGciOiJIUzI1NiIsInR5cCI6IkpXVCJ9.eyJpZCI6IjYzY2E0YWJiMTQyYTk2ZjhmN2U0NWMwYiIsImVtYWlsIjoiZXpAZ21haWwuY29tIiwiaXNBZG1pbiI6dHJ1ZSwiaXNVc2VyQWRtaW4iOmZhbHNlLCJpYXQiOjE2NzQ0NDM5OTd9.u7CZioZRBcZd5whlF5MWdCLlQ36I2SJFAe9KM1yZ_gU",
							"type": "string"
						}
					]
				},
				"method": "POST",
				"header": [],
				"body": {
					"mode": "raw",
					"raw": "{\r\n    \"status\" : \"cancelled\",\r\n    \"remarks\" : \"cancelled by user\"\r\n}",
					"options": {
						"raw": {
							"language": "json"
						}
					}
				},
				"url": {
					"raw": "localhost:6000/status/63cdf6f602fed0f5eef42b89/update",
					"host": [
						"localhost"
					],
					"port": "6000",
					"path": [
						"status",
						"63cdf6f602fed0f5eef42b89",
						"update"
					]
				}
			},
			"response": []
		},
		{
			"name": "STATUS - VIEW STATUS HISTORY",
			"request": {
				"auth": {
					"type": "bearer",
					"bearer": [
						{
							"key": "token",
							"value": "eyJhbGciOiJIUzI1NiIsInR5cCI6IkpXVCJ9.eyJpZCI6IjYzY2E0YWJiMTQyYTk2ZjhmN2U0NWMwYiIsImVtYWlsIjoiZXpAZ21haWwuY29tIiwiaXNBZG1pbiI6dHJ1ZSwiaXNVc2VyQWRtaW4iOmZhbHNlLCJpYXQiOjE2NzQ0NDM5OTd9.u7CZioZRBcZd5whlF5MWdCLlQ36I2SJFAe9KM1yZ_gU",
							"type": "string"
						}
					]
				},
				"method": "GET",
				"header": [],
				"url": {
					"raw": "localhost:6000/status/63cdf6f602fed0f5eef42b89",
					"host": [
						"localhost"
					],
					"port": "6000",
					"path": [
						"status",
						"63cdf6f602fed0f5eef42b89"
					]
				}
			},
			"response": []
		},
		{
			"name": "USER - GET DETAILS",
			"request": {
				"auth": {
					"type": "bearer",
					"bearer": [
						{
							"key": "token",
							"value": "eyJhbGciOiJIUzI1NiIsInR5cCI6IkpXVCJ9.eyJpZCI6IjYzY2UyMmYyYTI4NTBmMWU1YmQ4MWQ3YyIsImVtYWlsIjoidXNlcjFAZ21haWwuY29tIiwiaXNBZG1pbiI6ZmFsc2UsImlzVXNlckFkbWluIjpmYWxzZSwiaWF0IjoxNjc0NDUzNzUyfQ.MViY3yxjT3DYDQ1jCKuhBnmLRWKlSINkmUpcr9yln1Y",
							"type": "string"
						}
					]
				},
				"method": "GET",
				"header": [],
				"url": {
					"raw": "localhost:6000/users/details",
					"host": [
						"localhost"
					],
					"port": "6000",
					"path": [
						"users",
						"details"
					]
				}
			},
			"response": []
		},
		{
			"name": "USER - UPDATE",
			"request": {
				"auth": {
					"type": "bearer",
					"bearer": [
						{
							"key": "token",
							"value": "eyJhbGciOiJIUzI1NiIsInR5cCI6IkpXVCJ9.eyJpZCI6IjYzY2UyOTJmY2Y5NjVhODM4NWMzOTQzYSIsImVtYWlsIjoidXNlcjJAZ21haWwuY29tIiwiaXNBZG1pbiI6ZmFsc2UsImlzVXNlckFkbWluIjpmYWxzZSwiaWF0IjoxNjc0NDU1MzU1fQ.9IZOEdVYz0LBXKNlwXBXez4kDYj0PTPDYL92yTqPC0o",
							"type": "string"
						}
					]
				},
				"method": "PUT",
				"header": [],
				"body": {
					"mode": "raw",
					"raw": "{\r\n    \"email\" : \"user200@gmail.com\",\r\n    \"password\" : \"pass1234\"\r\n}",
					"options": {
						"raw": {
							"language": "json"
						}
					}
				},
				"url": {
					"raw": "localhost:6000/users/update",
					"host": [
						"localhost"
					],
					"port": "6000",
					"path": [
						"users",
						"update"
					]
				}
			},
			"response": []
		}
	]
}