<svg width="24" height="24" viewBox="0 0 24 24" fill="none" xmlns="http://www.w3.org/2000/svg">
<path d="M7 15L7 9" stroke="#1C274C" stroke-width="1.5" stroke-linecap="round" stroke-linejoin="round"/>
<path d="M20.8333 9H18.2308C16.4465 9 15 10.3431 15 12C15 13.6569 16.4465 15 18.2308 15H20.8333C20.9167 15 20.9583 15 20.9935 14.9979C21.5328 14.965 21.9623 14.5662 21.9977 14.0654C22 14.0327 22 13.994 22 13.9167V10.0833C22 10.006 22 9.96726 21.9977 9.9346C21.9623 9.43384 21.5328 9.03496 20.9935 9.00214C20.9583 9 20.9167 9 20.8333 9Z" stroke="#1C274C" stroke-width="1.5"/>
<circle cx="18" cy="12" r="1" fill="#1C274C"/>
<path d="M20.965 9C20.8873 7.1277 20.6366 5.97975 19.8284 5.17157C18.6569 4 16.7712 4 13 4L10 4C6.22876 4 4.34315 4 3.17157 5.17157C2 6.34315 2 8.22876 2 12C2 15.7712 2 17.6569 3.17157 18.8284C4.34315 20 6.22876 20 10 20H13C16.7712 20 18.6569 20 19.8284 18.8284C20.6366 18.0203 20.8873 16.8723 20.965 15" stroke="#1C274C" stroke-width="1.5"/>
</svg>
