<svg width="72" height="70" viewBox="0 0 72 70" fill="none" xmlns="http://www.w3.org/2000/svg">
<path d="M64.772 24.4589H63.1743C62.9677 26.019 62.1897 27.4469 60.9907 28.4662C59.7918 29.4856 58.2573 30.0238 56.6844 29.9768C55.1114 29.9298 53.6118 29.3008 52.476 28.2116C51.3401 27.1225 50.6487 25.6506 50.5357 24.081C50.4227 22.5114 50.8961 20.9557 51.8642 19.715C52.8323 18.4744 54.2263 17.6371 55.7763 17.3652C57.3263 17.0933 58.9221 17.4062 60.2547 18.2433C61.5873 19.0803 62.5619 20.3821 62.9898 21.8964H64.772C65.2403 21.8929 65.7023 21.788 66.1262 21.5892C66.5502 21.3903 66.9261 21.102 67.2282 20.7442C67.5303 20.3864 67.7514 19.9674 67.8764 19.5161C68.0013 19.0648 68.0271 18.5918 67.9521 18.1295L67.5383 15.699C67.4034 14.9367 67.0413 14.233 66.4994 13.6801C65.9575 13.1272 65.2611 12.7511 64.5017 12.6009L56.9731 11.1442C56.7289 11.0977 56.5036 10.9811 56.3248 10.8085L49.3906 4.10498C49.0186 3.74203 48.5785 3.45615 48.0956 3.26376C47.6128 3.07137 47.0967 2.97626 46.577 2.98389L34.5832 3.1402C33.9834 3.14857 33.3932 3.29194 32.8565 3.55966C32.3197 3.82739 31.8501 4.21259 31.4826 4.68667C29.8605 6.8097 28.0488 9.69636 25.1673 10.1704L22.3639 10.7854C21.9163 10.8844 21.5161 11.1336 21.2298 11.4917C20.9436 11.8497 20.7885 12.295 20.7906 12.7534V19.8861C20.7909 20.4192 21.0028 20.9303 21.3797 21.3072C21.7567 21.6842 22.2678 21.8961 22.8008 21.8964H25.799C26.1789 20.5716 26.9798 19.4065 28.0805 18.5771C29.1813 17.7477 30.5221 17.2991 31.9003 17.2991C33.2785 17.2991 34.6193 17.7477 35.72 18.5771C36.8208 19.4065 37.6216 20.5716 38.0016 21.8964H45.3585C45.6983 21.8964 46.0242 22.0314 46.2645 22.2717C46.5048 22.512 46.6398 22.8379 46.6398 23.1777C46.6398 23.5175 46.5048 23.8434 46.2645 24.0836C46.0242 24.3239 45.6983 24.4589 45.3585 24.4589H38.1861C37.9927 25.9896 37.2475 27.397 36.0902 28.4173C34.9329 29.4376 33.4431 30.0005 31.9003 30.0005C30.3575 30.0005 28.8677 29.4376 27.7104 28.4173C26.5531 27.397 25.8079 25.9896 25.6145 24.4589H22.8008C21.5886 24.4579 20.4263 23.976 19.569 23.1189C18.7117 22.2618 18.2294 21.0997 18.2281 19.8874V12.7534C18.2244 11.7122 18.5774 10.701 19.2282 9.88821C19.879 9.07539 20.7885 8.50987 21.8053 8.2857C23.5683 7.87057 26.1359 7.64251 27.2327 6.00764L29.4557 3.1197C30.0584 2.34083 30.829 1.70782 31.71 1.26773C32.5911 0.82764 33.56 0.591786 34.5448 0.577699L46.5437 0.421387C48.2662 0.422161 49.9231 1.08234 51.1741 2.26639L57.8328 8.70082L64.9898 10.0859C66.2593 10.3368 67.4233 10.9658 68.3288 11.8903C69.2343 12.8148 69.839 13.9915 70.0636 15.2659L70.4774 17.6978C70.6131 18.5274 70.5674 19.3765 70.3437 20.1868C70.1199 20.9971 69.7233 21.7493 69.1812 22.3918C68.6391 23.0342 67.9642 23.5516 67.2031 23.9085C66.442 24.2653 65.6126 24.4531 64.772 24.4589ZM56.8872 19.8195C55.8773 19.8195 54.9088 20.2207 54.1946 20.9348C53.4805 21.6489 53.0793 22.6175 53.0793 23.6274C53.0793 24.6373 53.4805 25.6058 54.1946 26.32C54.9088 27.0341 55.8773 27.4353 56.8872 27.4353C57.8971 27.4353 58.8657 27.0341 59.5798 26.32C60.2939 25.6058 60.6951 24.6373 60.6951 23.6274C60.6951 22.6175 60.2939 21.6489 59.5798 20.9348C58.8657 20.2207 57.8971 19.8195 56.8872 19.8195ZM31.9003 27.4353C32.9102 27.4353 33.8787 27.0341 34.5929 26.32C35.307 25.6058 35.7082 24.6373 35.7082 23.6274C35.7082 22.6175 35.307 21.6489 34.5929 20.9348C33.8787 20.2207 32.9102 19.8195 31.9003 19.8195C30.8904 19.8195 29.9218 20.2207 29.2077 20.9348C28.4936 21.6489 28.0924 22.6175 28.0924 23.6274C28.0924 24.6373 28.4936 25.6058 29.2077 26.32C29.9218 27.0341 30.8904 27.4353 31.9003 27.4353Z" fill="#004ADD"/>
<path d="M31.8935 25.0101C32.2498 24.9947 32.5865 24.8423 32.8332 24.5848C33.0799 24.3272 33.2177 23.9843 33.2177 23.6276C33.2177 23.2709 33.0799 22.928 32.8332 22.6704C32.5865 22.4128 32.2498 22.2605 31.8935 22.2451C31.5371 22.2605 31.2004 22.4128 30.9537 22.6704C30.707 22.928 30.5692 23.2709 30.5692 23.6276C30.5692 23.9843 30.707 24.3272 30.9537 24.5848C31.2004 24.8423 31.5371 24.9947 31.8935 25.0101ZM56.8817 22.2451C56.5253 22.2605 56.1886 22.4128 55.9419 22.6704C55.6952 22.928 55.5575 23.2709 55.5575 23.6276C55.5575 23.9843 55.6952 24.3272 55.9419 24.5848C56.1886 24.8423 56.5253 24.9947 56.8817 25.0101C57.238 24.9947 57.5747 24.8423 57.8214 24.5848C58.0682 24.3272 58.2059 23.9843 58.2059 23.6276C58.2059 23.2709 58.0682 22.928 57.8214 22.6704C57.5747 22.4128 57.238 22.2605 56.8817 22.2451ZM69.2893 34.7847C68.3801 34.1996 67.2955 33.9496 66.2219 34.0778C65.1483 34.2059 64.153 34.7042 63.4071 35.4868L53.8669 45.0796C53.5835 44.5362 53.1944 44.0549 52.7224 43.6639C52.2505 43.273 51.7052 42.9802 51.1186 42.8028L41.1377 39.7483C37.9665 38.8277 34.9455 37.4522 32.1689 35.6649C25.9946 31.6213 19.5832 32.5771 14.0162 38.2953C13.794 37.6968 13.4483 37.1518 13.0016 36.6957C12.5548 36.2397 12.017 35.8829 11.4232 35.6485C10.8293 35.4141 10.1928 35.3075 9.55496 35.3355C8.91716 35.3635 8.29241 35.5255 7.72139 35.811L3.15758 37.9161C2.0029 38.4324 1.0832 39.362 0.57935 40.5222C0.0755017 41.6823 0.0239809 42.989 0.43492 44.1852L9.22558 66.7993C9.46645 67.3735 9.82254 67.8921 10.2718 68.3231C10.7211 68.7542 11.2541 69.0885 11.8377 69.3053C12.4213 69.5222 13.0432 69.6171 13.665 69.584C14.2867 69.551 14.8951 69.3908 15.4525 69.1132L20.0175 67.0081C21.0589 66.5344 21.9112 65.7249 22.4378 64.7093C22.9644 63.6936 23.135 62.5306 22.9221 61.4065C25.3386 62.6019 35.9525 66.529 38.6405 67.595C39.9447 68.0897 41.3464 68.2735 42.734 68.1316C44.1217 67.9897 45.4572 67.526 46.6342 66.7775C52.1782 63.4616 57.8964 59.6896 62.2783 54.8581C65.6482 51.3069 68.5833 47.3671 71.0215 43.1218C71.8067 41.7618 72.0643 40.1607 71.7453 38.6231C71.4264 37.0855 70.5531 35.7189 69.2919 34.7834L69.2893 34.7847ZM18.9426 64.6814L14.3788 66.7878C14.1038 66.9218 13.8044 66.9984 13.4989 67.0129C13.1934 67.0275 12.8881 66.9796 12.6017 66.8723C12.3762 66.784 12.1717 66.6494 12.0014 66.4773C11.8311 66.3052 11.6986 66.0993 11.6125 65.873L2.82061 43.2589C2.64564 42.671 2.69248 42.0393 2.95226 41.4836C3.21203 40.9279 3.66667 40.4869 4.22998 40.2441L8.79379 38.1403C9.03226 38.0037 9.29681 37.9188 9.57023 37.8911C9.84366 37.8634 10.1199 37.8936 10.3809 37.9796C10.6419 38.0657 10.8819 38.2057 11.0852 38.3905C11.2886 38.5753 11.4508 38.8009 11.5613 39.0526L20.352 61.6692C20.5271 62.2567 20.4803 62.8882 20.2205 63.4435C19.9606 63.9988 19.5059 64.4393 18.9426 64.6814ZM68.7999 41.8431C64.2588 49.8521 57.838 56.6366 50.091 61.6115L45.2774 64.6045C44.4387 65.1496 43.4828 65.4883 42.4879 65.5927C41.4931 65.6972 40.4877 65.5645 39.554 65.2054C35.4797 63.7 25.5884 59.8101 21.7421 58.1752L15.0437 40.945C18.4711 37.0538 23.9382 33.3587 30.7608 37.8097C33.7424 39.7313 36.9864 41.2111 40.392 42.2032L50.3832 45.2602C52.897 46.0533 52.1641 50.439 49.4876 50.0713L37.9871 48.1007C35.1004 47.6163 32.1351 48.1489 29.5975 49.6075C29.3075 49.7774 29.0958 50.0545 29.0082 50.3789C28.9206 50.7034 28.964 51.0494 29.129 51.3421C29.2941 51.6349 29.5676 51.8512 29.8906 51.9442C30.2135 52.0372 30.5601 51.9996 30.8556 51.8394C32.8824 50.6739 35.25 50.2457 37.5566 50.6274L49.0763 52.6005C49.7312 52.6835 50.3963 52.6307 51.0299 52.4455C51.6636 52.2603 52.2524 51.9467 52.7596 51.5241C53.2668 51.1015 53.6816 50.579 53.9781 49.9892C54.2746 49.3993 54.4465 48.7548 54.4832 48.0956L65.22 37.2985C67.994 34.8167 70.4219 39.4626 68.7999 41.8431Z" fill="#004ADD"/>
</svg>
