<?xml version="1.0" encoding="UTF-8"?>
<svg width="98px" height="102px" viewBox="0 0 98 102" version="1.1" xmlns="http://www.w3.org/2000/svg" xmlns:xlink="http://www.w3.org/1999/xlink">
    <!-- Generator: Sketch 60 (88103) - https://sketch.com -->
    <title>Combined Shape</title>
    <desc>Created with Sketch.</desc>
    <g id="Web" stroke="none" stroke-width="1" fill="none" fill-rule="evenodd">
        <g id="Landing-page-Copy-29" transform="translate(-376.000000, -2467.000000)" fill="#3F52FF">
            <g id="Group-16" transform="translate(318.000000, 2369.000000)">
                <g id="Group-18" transform="translate(0.000000, 51.000000)">
                    <g id="Combined-Shape-3" transform="translate(58.000000, 47.000000)">
                        <path d="M74.4127311,91.1521527 C74.6404862,91.4494033 74.695468,91.8638864 74.6112902,92.2490958 C74.5295854,92.6229887 74.3106161,92.9795297 73.9452705,93.1939216 C66.0220262,98.866575 56.4435777,102 46.6521544,102 C30.0600454,102 14.8457674,93.1987786 6.75083866,79.3509159 L5.69999515,89.4024989 C5.6137147,89.7969392 5.40930017,90.1523225 5.12244426,90.4059474 C4.87109876,90.6281755 4.55478685,90.770832 4.20241685,90.7813503 C3.65160694,90.6951059 3.20710332,90.4737462 2.91950634,90.1630221 C2.66141685,89.8841785 2.53793086,89.5314155 2.62110036,89.1742283 L4.13304446,74.1276399 C4.21017131,73.6139707 4.41462169,73.2277461 4.75266385,72.9978373 C5.12169624,72.7468516 5.61941867,72.6838443 6.19016748,72.7569834 L21.0665636,76.9883613 C21.5123632,77.0527163 21.8545389,77.2932565 22.04621,77.6156922 C22.2343675,77.9322171 22.2775139,78.3242002 22.1322157,78.6806541 C22.0236786,79.2313435 21.7817623,79.550599 21.4646221,79.7323979 C21.1262579,79.9263633 20.705348,79.9667998 20.326385,79.8093139 L8.71848018,76.4138643 C12.4476833,83.5866483 18.1628106,89.381843 25.0324497,93.3079962 C31.4566455,96.9795684 38.8904757,99.0165125 46.6521544,99.0165125 C55.8447994,99.0165125 64.8135794,96.2235274 72.2608137,90.8515377 C72.5680431,90.6248571 72.993415,90.5673912 73.392778,90.6234163 C73.7907174,90.6792418 74.1819697,90.8502242 74.4127311,91.1521527 Z M3.54791467e-07,57.6756228 C3.54791467e-07,44.8113397 5.06098636,33.1442581 13.2752945,24.6044313 C21.8668279,15.6724307 33.9081433,10.1615269 47.2146221,10.2827629 L38.5001668,2.76895454 C38.175445,2.53092237 37.9914706,2.11521792 37.9616486,1.69316677 C37.9341919,1.30458941 38.0397765,0.896833762 38.3340547,0.599352994 C38.627095,0.214883416 39.0294555,0.0337089945 39.4385002,0.00417355092 C39.8271875,-0.0238919674 40.2350827,0.0877095817 40.5280411,0.396064087 L52.615535,10.6156241 C53.1006448,10.9280706 53.2411751,11.4124821 53.2411751,11.8840763 C53.2411751,12.3823861 52.8891875,12.8630273 52.5652687,13.1950269 L40.5237463,23.3757196 C40.394566,23.5292375 39.9311155,23.6472628 39.6411923,23.6472628 C39.1412454,23.6472628 38.6608391,23.2779251 38.3340547,22.9475844 C38.0490561,22.6594843 37.9356401,22.3019631 37.9610839,21.9418735 C37.9911658,21.5161435 38.2024977,21.0924288 38.5330136,20.7502676 L47.3146006,13.4396695 C34.8188291,13.4129919 23.5132633,18.6389691 15.466287,27.0290543 C7.82984432,34.9911013 3.12826071,45.8022181 3.12826071,57.6756228 C3.12826071,58.3542403 3.18353677,59.0894426 3.23948074,59.8246289 C3.29295362,60.5273414 3.3470944,61.2300379 3.3470944,61.8787116 C3.42306637,62.3907235 3.30585091,62.738807 3.08663444,63.009654 C2.80475844,63.3579184 2.37296339,63.5865763 1.9394606,63.6863454 C1.49805415,63.6739834 1.12327367,63.5302579 0.835134098,63.2919417 C0.510203284,63.023196 0.297474524,62.6401492 0.210154647,62.2156711 C-0.00201423306,60.7023209 3.54791467e-07,59.1888774 3.54791467e-07,57.6756228 Z M97.9036349,77.9972027 C98.0472339,78.4565177 98.0262271,78.8809331 97.8680433,79.2338477 C97.6997648,79.609284 97.3822377,79.8963982 96.9881287,80.0627004 L82.5691562,85.0898514 C82.049947,85.1574732 81.6287575,85.100873 81.3006853,84.8927976 C80.9489327,84.6697031 80.7189022,84.2872888 80.5537687,83.7969623 L78.212334,68.2330393 C78.1368418,67.8595352 78.2509617,67.4889194 78.4626407,67.1895912 C78.691727,66.8656477 79.0389376,66.6171561 79.4319441,66.536952 C79.7783592,66.4648325 80.1199509,66.5807275 80.3968564,66.7880233 C80.7129536,67.0246586 80.9530816,67.3846703 81.0347079,67.7872743 L82.7772487,79.5890558 C87.273588,72.5104141 89.5227424,64.6403868 89.5227424,56.2551153 C89.5227424,47.4668065 86.9895925,39.1229973 82.5161933,32.1108652 C78.0261658,25.0726678 71.5815919,19.3761081 63.7814518,15.9159471 C63.4077725,15.7609196 63.1601158,15.4622556 63.0302755,15.1140615 C62.8847077,14.7236906 62.8830355,14.2687006 63.0444323,13.8549141 C63.1873816,13.486593 63.471725,13.2290879 63.8081311,13.0956345 C64.1741666,12.9504271 64.6008971,12.9483352 64.9890143,13.1056441 C73.3610289,16.7745327 80.2220301,22.8601586 85.0029201,30.3446485 C89.831056,37.9031018 92.5381898,46.8882702 92.5381898,56.2551153 C92.5381898,65.0810116 90.1246353,73.4118419 85.8126018,80.7098503 L95.9253272,77.0593602 C96.3620109,76.910644 96.7660369,76.9290601 97.1015646,77.0885405 C97.4663985,77.2619504 97.7421483,77.5915458 97.9036349,77.9972027 Z M54.4337541,63.4987169 C52.3734052,65.6169811 49.5321817,66.9340603 46.4054979,66.9340603 C43.2788141,66.9340603 40.4375906,65.6169811 38.3772417,63.4987169 C36.3109314,61.3743238 35.0290217,58.4439556 35.0290217,55.2209093 C35.0290217,51.997863 36.3109314,49.0674948 38.3772417,46.9431017 C40.4375906,44.8248375 43.2788141,43.5077582 46.4054979,43.5077582 C49.5321817,43.5077582 52.3734052,44.8248375 54.4337541,46.9431017 C56.5000643,49.0674948 57.7819741,51.997863 57.7819741,55.2209093 C57.7819741,58.4439556 56.5000643,61.3743238 54.4337541,63.4987169 Z M40.4698863,49.0212643 C38.8956459,50.6123236 37.9187745,52.8069549 37.9187745,55.2209093 C37.9187745,57.6348637 38.8956459,59.829495 40.4698863,61.4205543 C42.0462852,63.0137953 44.2209848,64.0014116 46.6124062,64.0014116 C49.0038276,64.0014116 51.1785272,63.0137953 52.7549262,61.4205543 C54.3291665,59.829495 55.3060379,57.6348637 55.3060379,55.2209093 C55.3060379,52.8069549 54.3291665,50.6123236 52.7549262,49.0212643 C51.1785272,47.4280233 49.0038276,46.440407 46.6124062,46.440407 C44.2209848,46.440407 42.0462852,47.4280233 40.4698863,49.0212643 Z M63.9106051,61.4969909 C63.6768709,62.1854138 63.4485249,62.9288386 63.2162137,63.3939508 C63.1700626,63.4863503 63.1150397,63.5852148 63.0532775,63.6890351 L66.1042528,68.7066344 C66.2379736,68.9864154 66.2691936,69.298444 66.2199968,69.5936899 C66.1674185,69.9092288 66.0231608,70.2084426 65.7996469,70.4314478 L61.2430331,74.9949375 C61.0591889,75.2573237 60.813062,75.3977869 60.5471682,75.4421492 C60.2177551,75.4971093 59.8662484,75.4178247 59.5534881,75.2655913 L54.6057177,72.2485773 C54.1574138,72.3859418 53.8180673,72.5217064 53.4799452,72.6574405 C53.1444989,72.7921005 52.8103827,72.9267893 52.3525515,73.0608109 L51.0365951,78.769299 C50.9674619,79.1242549 50.7976251,79.4130295 50.55078,79.6107137 C50.2937212,79.8165775 49.9595048,79.9214454 49.5915318,79.9214454 L43.219464,79.9214454 C42.8811168,79.9214454 42.5769948,79.7888515 42.3336572,79.5939763 C42.0547802,79.3706395 41.8496707,79.0640709 41.7707747,78.7535698 L40.4603762,73.0691913 C39.7735964,72.8353295 39.0316902,72.6076867 38.5676306,72.3730896 C38.4750561,72.3262902 38.3761406,72.2704188 38.2723692,72.207667 L33.2582402,75.2651446 C32.9791589,75.3987662 32.6679458,75.4296027 32.3732704,75.3804384 C32.0565983,75.327604 31.7561578,75.1825706 31.5334614,74.9603842 L26.9763295,70.3963756 C26.7143306,70.2132866 26.5741557,69.9675066 26.5298841,69.7018189 C26.4749744,69.3722881 26.5542221,69.0204276 26.7063029,68.707358 L29.7173732,63.7553861 C29.5805199,63.3022344 29.4443301,62.9601707 29.3077102,62.618261 C29.1747672,62.2855532 29.0413429,61.9530178 28.908732,61.4989179 L23.2062436,60.181572 C22.8516614,60.112366 22.5631908,59.9423502 22.3657148,59.695245 C22.1600677,59.4379152 22.0553102,59.1033466 22.0553102,58.7349857 L22.0553102,52.3562021 C22.0553102,52.0174983 22.1877645,51.7130558 22.3824345,51.4694618 C22.6055362,51.1902908 22.911782,50.9849652 23.2219562,50.905986 L28.9003907,49.5941969 C29.1341249,48.905774 29.3624708,48.1623493 29.5947821,47.6972371 C29.6409332,47.6048376 29.6959561,47.5059731 29.7577183,47.4021528 L26.706743,42.3845536 C26.5730131,42.1047522 26.5418101,41.7926976 26.590997,41.4972651 C26.6436467,41.1810336 26.788231,40.8810353 27.0112485,40.6577828 L31.5679258,36.096303 C31.751774,35.8338829 31.997916,35.6934039 32.2638276,35.6490386 C32.5932701,35.5940737 32.9448101,35.6733773 33.2575913,35.8256373 L38.2043493,38.8398809 C38.6570239,38.7028834 38.9987274,38.56655 39.3402772,38.4297861 C39.6726347,38.296703 40.00482,38.1631381 40.4584418,38.0303874 L41.7744007,32.3218888 C41.8435338,31.966933 42.0133707,31.6781584 42.2602158,31.4804742 C42.5172746,31.2746104 42.851491,31.1697424 43.219464,31.1697424 L49.5915318,31.1697424 C49.9595048,31.1697424 50.2937212,31.2746104 50.55078,31.4804742 C50.7976251,31.6781584 50.9674619,31.966933 51.0365951,32.3218888 L52.350629,38.0220373 C53.0383271,38.2560179 53.7809692,38.4846045 54.2455917,38.7171606 C54.3378939,38.7633603 54.4366543,38.8184412 54.5403653,38.8802685 L59.5526818,35.8260776 C59.8321886,35.6922067 60.1439147,35.6609709 60.4390361,35.7102096 C60.7549347,35.7629149 61.0546171,35.9076515 61.2776346,36.1309041 L65.8343119,40.6923839 C66.0964557,40.8764258 66.2367868,41.1228273 66.2811054,41.3890191 C66.3360124,41.7188088 66.2567923,42.0707193 66.1046926,42.3838302 L63.0936225,47.3358017 C63.2304758,47.7889534 63.3666657,48.1310171 63.5032856,48.4729269 C63.6362286,48.8056346 63.7696529,49.1381701 63.9022638,49.59227 L69.6047522,50.9096158 C69.9593344,50.9788218 70.2478049,51.1488377 70.445281,51.3959429 C70.650928,51.6532726 70.7556856,51.9878413 70.7556856,52.3562021 L70.7556856,58.7349857 C70.7556856,59.0736895 70.6232313,59.378132 70.4285612,59.6217261 C70.2054596,59.900897 69.8992138,60.1062227 69.5890396,60.1852018 L63.9106051,61.4969909 Z M62.3140629,58.6997934 L67.6981692,57.3523482 L67.6981692,53.2884922 L62.3153042,51.9413576 C61.874361,51.7853721 61.4377932,51.3438969 61.2781766,50.8679524 C60.8600455,49.821523 60.4411059,48.7754738 59.9840484,47.8711852 C59.8476416,47.6663593 59.7803993,47.4272087 59.7803993,47.1884322 C59.7803993,46.946612 59.8493668,46.7044081 59.9892986,46.4978632 L62.9291707,41.7438338 L59.9677904,38.7793323 L55.2187662,41.7223029 C55.0124388,41.8623821 54.7704898,41.9314224 54.5289242,41.9314224 C54.2903991,41.9314224 54.0515003,41.8641092 53.8217942,41.7116604 C53.0987363,41.2773684 52.3761351,40.9410966 51.720581,40.6370419 C51.4313327,40.5028847 51.155846,40.3752236 50.7728457,40.2001578 C50.1978578,40.0562594 49.9267457,39.6140259 49.7813132,39.1892153 L48.4352866,33.7994344 L44.3757092,33.7994344 L43.0299929,39.1879727 C42.8741716,39.6293806 42.4331612,40.0664086 41.9577178,40.2261933 C40.9123901,40.6447651 39.8674423,41.0641463 38.9641057,41.5216855 C38.7594955,41.6582361 38.5205966,41.7255493 38.2820716,41.7255493 C38.0405059,41.7255493 37.798557,41.656509 37.5922296,41.5164298 L32.8432054,38.5734592 L29.8818251,41.5379606 L32.8216972,46.2919901 C32.9616289,46.498535 33.0305965,46.7407389 33.0305965,46.9825591 C33.0305965,47.2164643 32.9660698,47.4507286 32.8352095,47.6527336 C32.1737186,48.5416046 31.7271727,49.646962 31.5035377,50.7554531 C31.3564606,51.3222406 30.9181241,51.5906763 30.4969328,51.7351739 L25.1128265,53.0826191 L25.1128265,57.141364 L30.2873397,58.4926597 C30.7291981,58.6477961 31.1672467,59.0901708 31.3271628,59.5670149 C31.7452939,60.6134443 32.1642335,61.6594935 32.621291,62.5637821 C32.7576978,62.768608 32.8249402,63.0077586 32.8249402,63.2465351 C32.8249402,63.4883553 32.7559726,63.7305592 32.6160408,63.9371041 L29.6760471,68.6913302 L32.6376217,71.6533309 L37.3871708,68.7122991 C37.5932704,68.5714882 37.8350193,68.5020008 38.0764152,68.5020008 C38.3100195,68.5020008 38.5439545,68.5670749 38.7455925,68.6988871 C39.6334723,69.3591703 40.7378963,69.8082988 41.8453349,70.0322126 C42.411381,70.1794038 42.679696,70.6178897 42.8240975,71.0381161 L44.1700036,76.4296598 L48.2047644,76.4296598 L49.7763786,71.260342 C49.9277168,70.8150385 50.3719921,70.3690201 50.8532779,70.208774 C51.8981942,69.7903669 52.9427624,69.3691236 53.8468901,68.9132818 C54.0515003,68.7767312 54.2903991,68.709418 54.5289242,68.709418 C54.7704898,68.709418 55.0124388,68.7784583 55.2187662,68.9185375 L59.9679866,71.8616297 L62.9291258,68.8946749 L59.9892652,64.1429279 C59.8493559,63.9363938 59.7803993,63.6942091 59.7803993,63.4524082 C59.7803993,63.218503 59.844926,62.9842387 59.9757863,62.7822337 C60.6372772,61.8933627 61.083823,60.7880053 61.3074581,59.6795142 C61.4545352,59.1127267 61.8928716,58.844291 62.3140629,58.6997934 Z" id="Combined-Shape"></path>
                    </g>
                </g>
            </g>
        </g>
    </g>
</svg>