module day12

go 1.20

require (
	github.com/jwalton/go-supportscolor v1.2.0 // indirect
	golang.org/x/sys v0.0.0-20210220050731-9a76102bfb43 // indirect
	golang.org/x/term v0.0.0-20210220032956-6a3ed077a48d // indirect
)
