<?xml version="1.0" encoding="UTF-8" standalone="no"?>
<!DOCTYPE svg PUBLIC "-//W3C//DTD SVG 1.1//EN"
 "http://www.w3.org/Graphics/SVG/1.1/DTD/svg11.dtd">
<!-- Generated by graphviz version 2.47.3 (20210619.1520)
 -->
<!-- Title: dependencies Pages: 1 -->
<svg width="596pt" height="174pt"
 viewBox="0.00 0.00 596.00 173.80" xmlns="http://www.w3.org/2000/svg" xmlns:xlink="http://www.w3.org/1999/xlink">
<g id="graph0" class="graph" transform="scale(1 1) rotate(0) translate(4 169.8)">
<title>dependencies</title>
<polygon fill="white" stroke="transparent" points="-4,4 -4,-169.8 592,-169.8 592,4 -4,4"/>
<text text-anchor="middle" x="294" y="-8.2" font-family="sans-serif" font-size="14.00">dependencies</text>
<g id="clust1" class="cluster">
<title>cluster_AboutModule</title>
<polygon fill="none" stroke="black" stroke-dasharray="1,5" points="8,-32.8 8,-157.8 580,-157.8 580,-32.8 8,-32.8"/>
</g>
<g id="clust4" class="cluster">
<title>cluster_AboutModule_imports</title>
<polygon fill="none" stroke="black" points="156,-40.8 156,-92.8 572,-92.8 572,-40.8 156,-40.8"/>
</g>
<g id="clust2" class="cluster">
<title>cluster_AboutModule_declarations</title>
<polygon fill="none" stroke="black" points="16,-40.8 16,-92.8 148,-92.8 148,-40.8 16,-40.8"/>
</g>
<!-- AboutComponent -->
<g id="node1" class="node">
<title>AboutComponent</title>
<polygon fill="#ffffb3" stroke="black" points="140.33,-84.8 23.67,-84.8 23.67,-48.8 140.33,-48.8 140.33,-84.8"/>
<text text-anchor="middle" x="82" y="-62.6" font-family="Times,serif" font-size="14.00">AboutComponent</text>
</g>
<!-- AboutModule -->
<g id="node2" class="node">
<title>AboutModule</title>
<polygon fill="#8dd3c7" stroke="black" points="353.05,-149.8 350.05,-153.8 329.05,-153.8 326.05,-149.8 258.95,-149.8 258.95,-113.8 353.05,-113.8 353.05,-149.8"/>
<text text-anchor="middle" x="306" y="-127.6" font-family="Times,serif" font-size="14.00">AboutModule</text>
</g>
<!-- AboutComponent&#45;&gt;AboutModule -->
<g id="edge1" class="edge">
<title>AboutComponent&#45;&gt;AboutModule</title>
<path fill="none" stroke="black" d="M82,-84.91C82,-104.14 82,-131.8 82,-131.8 82,-131.8 248.77,-131.8 248.77,-131.8"/>
<polygon fill="black" stroke="black" points="248.77,-135.3 258.77,-131.8 248.77,-128.3 248.77,-135.3"/>
</g>
<!-- CommonModule -->
<g id="node3" class="node">
<title>CommonModule</title>
<polygon fill="#8dd3c7" stroke="black" points="563.67,-84.8 560.67,-88.8 539.67,-88.8 536.67,-84.8 452.33,-84.8 452.33,-48.8 563.67,-48.8 563.67,-84.8"/>
<text text-anchor="middle" x="508" y="-62.6" font-family="Times,serif" font-size="14.00">CommonModule</text>
</g>
<!-- CommonModule&#45;&gt;AboutModule -->
<g id="edge2" class="edge">
<title>CommonModule&#45;&gt;AboutModule</title>
<path fill="none" stroke="black" d="M508,-84.91C508,-104.14 508,-131.8 508,-131.8 508,-131.8 363.11,-131.8 363.11,-131.8"/>
<polygon fill="black" stroke="black" points="363.11,-128.3 353.11,-131.8 363.11,-135.3 363.11,-128.3"/>
</g>
<!-- TranslateModule -->
<g id="node4" class="node">
<title>TranslateModule</title>
<polygon fill="#8dd3c7" stroke="black" points="433.63,-84.8 430.63,-88.8 409.63,-88.8 406.63,-84.8 322.37,-84.8 322.37,-48.8 433.63,-48.8 433.63,-84.8"/>
<text text-anchor="middle" x="378" y="-62.6" font-family="Times,serif" font-size="14.00">TranslateModule</text>
</g>
<!-- TranslateModule&#45;&gt;AboutModule -->
<g id="edge3" class="edge">
<title>TranslateModule&#45;&gt;AboutModule</title>
<path fill="none" stroke="black" d="M337.73,-84.91C337.73,-84.91 337.73,-103.79 337.73,-103.79"/>
<polygon fill="black" stroke="black" points="334.23,-103.79 337.73,-113.79 341.23,-103.79 334.23,-103.79"/>
</g>
<!-- AboutRoutingModule -->
<g id="node5" class="node">
<title>AboutRoutingModule</title>
<polygon fill="#8dd3c7" stroke="black" points="303.67,-84.8 300.67,-88.8 279.67,-88.8 276.67,-84.8 164.33,-84.8 164.33,-48.8 303.67,-48.8 303.67,-84.8"/>
<text text-anchor="middle" x="234" y="-62.6" font-family="Times,serif" font-size="14.00">AboutRoutingModule</text>
</g>
<!-- AboutRoutingModule&#45;&gt;AboutModule -->
<g id="edge4" class="edge">
<title>AboutRoutingModule&#45;&gt;AboutModule</title>
<path fill="none" stroke="black" d="M281.28,-84.91C281.28,-84.91 281.28,-103.79 281.28,-103.79"/>
<polygon fill="black" stroke="black" points="277.78,-103.79 281.28,-113.79 284.78,-103.79 277.78,-103.79"/>
</g>
</g>
</svg>
