[
    {
        "code": "code 1",
        "firstName": "firstName 1",
        "lastName": "lastName 1",
        "dateOfBirth": "01/01/2000",
        "numPI": "azerty 1"
    },
    {
        "code": "code 2",
        "firstName": "firstName 2",
        "lastName": "lastName 2",
        "dateOfBirth": "01/01/1900",
        "numPI": "azerty 2"
    },
    {
        "code": "code 3",
        "firstName": "firstName 3",
        "lastName": "lastName 3",
        "dateOfBirth": "01/01/1800",
        "numPI": "azerty 3"
    },
    {
        "code": "code 1",
        "firstName": "firstName 1",
        "lastName": "lastName 1",
        "dateOfBirth": "01/01/2000",
        "numPI": "azerty 1"
    },
    {
        "code": "code 2",
        "firstName": "firstName 2",
        "lastName": "lastName 2",
        "dateOfBirth": "01/01/1900",
        "numPI": "azerty 2"
    },
    {
        "code": "code 3",
        "firstName": "firstName 3",
        "lastName": "lastName 3",
        "dateOfBirth": "01/01/1800",
        "numPI": "azerty 3"
    },
    {
        "code": "code 1",
        "firstName": "firstName 1",
        "lastName": "lastName 1",
        "dateOfBirth": "01/01/2000",
        "numPI": "azerty 1"
    },
    {
        "code": "code 2",
        "firstName": "firstName 2",
        "lastName": "lastName 2",
        "dateOfBirth": "01/01/1900",
        "numPI": "azerty 2"
    },
    {
        "code": "code 3",
        "firstName": "firstName 3",
        "lastName": "lastName 3",
        "dateOfBirth": "01/01/1800",
        "numPI": "azerty 3"
    },
    {
        "code": "code 1",
        "firstName": "firstName 1",
        "lastName": "lastName 1",
        "dateOfBirth": "01/01/2000",
        "numPI": "azerty 1"
    },
    {
        "code": "code 2",
        "firstName": "firstName 2",
        "lastName": "lastName 2",
        "dateOfBirth": "01/01/1900",
        "numPI": "azerty 2"
    },
    {
        "code": "code 3",
        "firstName": "firstName 3",
        "lastName": "lastName 3",
        "dateOfBirth": "01/01/1800",
        "numPI": "azerty 3"
    },
    {
        "code": "code 1",
        "firstName": "firstName 1",
        "lastName": "lastName 1",
        "dateOfBirth": "01/01/2000",
        "numPI": "azerty 1"
    },
    {
        "code": "code 2",
        "firstName": "firstName 2",
        "lastName": "lastName 2",
        "dateOfBirth": "01/01/1900",
        "numPI": "azerty 2"
    },
    {
        "code": "code 3",
        "firstName": "firstName 3",
        "lastName": "lastName 3",
        "dateOfBirth": "01/01/1800",
        "numPI": "azerty 3"
    },
    {
        "code": "code 1",
        "firstName": "firstName 1",
        "lastName": "lastName 1",
        "dateOfBirth": "01/01/2000",
        "numPI": "azerty 1"
    },
    {
        "code": "code 2",
        "firstName": "firstName 2",
        "lastName": "lastName 2",
        "dateOfBirth": "01/01/1900",
        "numPI": "azerty 2"
    },
    {
        "code": "code 3",
        "firstName": "firstName 3",
        "lastName": "lastName 3",
        "dateOfBirth": "01/01/1800",
        "numPI": "azerty 3"
    },
    {
        "code": "code 1",
        "firstName": "firstName 1",
        "lastName": "lastName 1",
        "dateOfBirth": "01/01/2000",
        "numPI": "azerty 1"
    },
    {
        "code": "code 2",
        "firstName": "firstName 2",
        "lastName": "lastName 2",
        "dateOfBirth": "01/01/1900",
        "numPI": "azerty 2"
    },
    {
        "code": "code 3",
        "firstName": "firstName 3",
        "lastName": "lastName 3",
        "dateOfBirth": "01/01/1800",
        "numPI": "azerty 3"
    },
    {
        "code": "code 1",
        "firstName": "firstName 1",
        "lastName": "lastName 1",
        "dateOfBirth": "01/01/2000",
        "numPI": "azerty 1"
    },
    {
        "code": "code 2",
        "firstName": "firstName 2",
        "lastName": "lastName 2",
        "dateOfBirth": "01/01/1900",
        "numPI": "azerty 2"
    },
    {
        "code": "code 3",
        "firstName": "firstName 3",
        "lastName": "lastName 3",
        "dateOfBirth": "01/01/1800",
        "numPI": "azerty 3"
    },
    {
        "code": "code 1",
        "firstName": "firstName 1",
        "lastName": "lastName 1",
        "dateOfBirth": "01/01/2000",
        "numPI": "azerty 1"
    },
    {
        "code": "code 2",
        "firstName": "firstName 2",
        "lastName": "lastName 2",
        "dateOfBirth": "01/01/1900",
        "numPI": "azerty 2"
    },
    {
        "code": "code 3",
        "firstName": "firstName 3",
        "lastName": "lastName 3",
        "dateOfBirth": "01/01/1800",
        "numPI": "azerty 3"
    },
    {
        "code": "code 1",
        "firstName": "firstName 1",
        "lastName": "lastName 1",
        "dateOfBirth": "01/01/2000",
        "numPI": "azerty 1"
    },
    {
        "code": "code 2",
        "firstName": "firstName 2",
        "lastName": "lastName 2",
        "dateOfBirth": "01/01/1900",
        "numPI": "azerty 2"
    },
    {
        "code": "code 3",
        "firstName": "firstName 3",
        "lastName": "lastName 3",
        "dateOfBirth": "01/01/1800",
        "numPI": "azerty 3"
    }
]