{
  "MONGO_DB_NAME": "transfer_db",
  "MONGO_HOSTS": ["dev-banking-app-mongo-0.dkatalis.io:3717"],
  "MONGO_USER": "user",
  "db": {
    "database": "seed_db",
    "type": "postgres",
    "migrations": [
      "migrations/**/*.ts"
    ],
    "synchronize": false,
    "username": "seed_user",
    "host": "postgres",
    "port": 5432
  },
  "server": {
    "host": "0.0.0.0",
    "port": 8080
  }
}