{
  "root": "libs/sample-lib",
  "sourceRoot": "libs/sample-lib/src",
  "targets": {
    "build": {
      "executor": "@nrwl/js:tsc",
      "outputs": ["{options.outputPath}"],
      "options": {
        "outputPath": "dist/libs/sample-lib",
        "tsConfig": "libs/sample-lib/tsconfig.lib.json",
        "packageJson": "libs/sample-lib/package.json",
        "main": "libs/sample-lib/src/index.ts",
        "assets": ["libs/sample-lib/*.md"]
      }
    },
    "lint": {
      "executor": "@nrwl/linter:eslint",
      "outputs": ["{options.outputFile}"],
      "options": {
        "lintFilePatterns": ["libs/sample-lib/**/*.ts"]
      }
    },
    "test": {
      "executor": "@nrwl/jest:jest",
      "outputs": ["coverage/libs/sample-lib"],
      "options": {
        "jestConfig": "libs/sample-lib/jest.config.js",
        "passWithNoTests": true
      }
    }
  },
  "tags": []
}
