%YAML 1.1
%TAG !u! tag:unity3d.com,2011:
--- !u!1045 &1
EditorBuildSettings:
  m_ObjectHideFlags: 0
  serializedVersion: 2
  m_Scenes:
  - enabled: 1
    path: Assets/TurnTheGameOn/Racing Game Template/Scenes/Intro.unity
    guid: 722609a9820eab9448c34033bbbce588
  - enabled: 1
    path: Assets/TurnTheGameOn/Racing Game Template/Scenes/Garage.unity
    guid: b32e7a3dd82e3e94b98f68266ed56f66
  - enabled: 1
    path: Assets/TurnTheGameOn/Racing Game Template/Scenes/0United Arab Emirates.unity
    guid: f21c94d7f833f1640853e0be070b8b6f
  - enabled: 1
    path: Assets/TurnTheGameOn/Racing Game Template/Scenes/1Lebanon.unity
    guid: 7cf86ac69d1783046ac4b1d73d837c16
  - enabled: 1
    path: Assets/TurnTheGameOn/Racing Game Template/Scenes/2Kuwait.unity
    guid: 06747bc7e8487f04c96276eb21b95742
  - enabled: 1
    path: Assets/TurnTheGameOn/Racing Game Template/Scenes/3Qatar.unity
    guid: 8968a25e4d9b931439df29435be5af4c
  - enabled: 1
    path: Assets/TurnTheGameOn/Racing Game Template/Scenes/4Iran.unity
    guid: 2187275825da18b478e3781525f47b7f
  - enabled: 1
    path: Assets/TurnTheGameOn/Racing Game Template/Scenes/5Oman.unity
    guid: 2696e4cf3d609f744ab9e50b6277b448
  - enabled: 1
    path: Assets/TurnTheGameOn/Racing Game Template/Scenes/ExitScene.unity
    guid: 8d57723f43d6a204da84bb5c2e78733a
