%YAML 1.1
%TAG !u! tag:unity3d.com,2011:
--- !u!29 &1
OcclusionCullingSettings:
  m_ObjectHideFlags: 0
  serializedVersion: 2
  m_OcclusionBakeSettings:
    smallestOccluder: 5
    smallestHole: 0.25
    backfaceThreshold: 100
  m_SceneGUID: 00000000000000000000000000000000
  m_OcclusionCullingData: {fileID: 0}
--- !u!104 &2
RenderSettings:
  m_ObjectHideFlags: 0
  serializedVersion: 8
  m_Fog: 0
  m_FogColor: {r: 0.5, g: 0.5, b: 0.5, a: 1}
  m_FogMode: 3
  m_FogDensity: 0.01
  m_LinearFogStart: 0
  m_LinearFogEnd: 300
  m_AmbientSkyColor: {r: 0.212, g: 0.227, b: 0.259, a: 1}
  m_AmbientEquatorColor: {r: 0.114, g: 0.125, b: 0.133, a: 1}
  m_AmbientGroundColor: {r: 0.047, g: 0.043, b: 0.035, a: 1}
  m_AmbientIntensity: 1
  m_AmbientMode: 0
  m_SubtractiveShadowColor: {r: 0.42, g: 0.478, b: 0.627, a: 1}
  m_SkyboxMaterial: {fileID: 10304, guid: 0000000000000000f000000000000000, type: 0}
  m_HaloStrength: 0.5
  m_FlareStrength: 1
  m_FlareFadeSpeed: 3
  m_HaloTexture: {fileID: 0}
  m_SpotCookie: {fileID: 10001, guid: 0000000000000000e000000000000000, type: 0}
  m_DefaultReflectionMode: 0
  m_DefaultReflectionResolution: 128
  m_ReflectionBounces: 1
  m_ReflectionIntensity: 1
  m_CustomReflection: {fileID: 0}
  m_Sun: {fileID: 0}
  m_IndirectSpecularColor: {r: 0, g: 0, b: 0, a: 1}
--- !u!157 &4
LightmapSettings:
  m_ObjectHideFlags: 0
  serializedVersion: 9
  m_GIWorkflowMode: 0
  m_GISettings:
    serializedVersion: 2
    m_BounceScale: 1
    m_IndirectOutputScale: 1
    m_AlbedoBoost: 1
    m_TemporalCoherenceThreshold: 1
    m_EnvironmentLightingMode: 0
    m_EnableBakedLightmaps: 1
    m_EnableRealtimeLightmaps: 1
  m_LightmapEditorSettings:
    serializedVersion: 8
    m_Resolution: 2
    m_BakeResolution: 40
    m_TextureWidth: 1024
    m_TextureHeight: 1024
    m_AO: 0
    m_AOMaxDistance: 1
    m_CompAOExponent: 0
    m_CompAOExponentDirect: 0
    m_Padding: 2
    m_LightmapParameters: {fileID: 0}
    m_LightmapsBakeMode: 1
    m_TextureCompression: 1
    m_FinalGather: 0
    m_FinalGatherFiltering: 1
    m_FinalGatherRayCount: 1024
    m_ReflectionCompression: 2
    m_MixedBakeMode: 1
    m_BakeBackend: 0
    m_PVRSampling: 1
    m_PVRDirectSampleCount: 32
    m_PVRSampleCount: 500
    m_PVRBounces: 2
    m_PVRFiltering: 0
    m_PVRFilteringMode: 1
    m_PVRCulling: 1
    m_PVRFilteringGaussRadiusDirect: 1
    m_PVRFilteringGaussRadiusIndirect: 5
    m_PVRFilteringGaussRadiusAO: 2
    m_PVRFilteringAtrousColorSigma: 1
    m_PVRFilteringAtrousNormalSigma: 1
    m_PVRFilteringAtrousPositionSigma: 1
  m_LightingDataAsset: {fileID: 0}
  m_ShadowMaskMode: 2
--- !u!196 &5
NavMeshSettings:
  serializedVersion: 2
  m_ObjectHideFlags: 0
  m_BuildSettings:
    serializedVersion: 2
    agentTypeID: 0
    agentRadius: 0.5
    agentHeight: 2
    agentSlope: 45
    agentClimb: 0.4
    ledgeDropHeight: 0
    maxJumpAcrossDistance: 0
    minRegionArea: 2
    manualCellSize: 0
    cellSize: 0.16666667
    manualTileSize: 0
    tileSize: 256
    accuratePlacement: 0
  m_NavMeshData: {fileID: 0}
--- !u!1 &95255513
GameObject:
  m_ObjectHideFlags: 0
  m_PrefabParentObject: {fileID: 158560, guid: c9de0c641e2673741a4d334e7fbd2e48, type: 2}
  m_PrefabInternal: {fileID: 498307449}
  serializedVersion: 5
  m_Component:
  - component: {fileID: 95255514}
  - component: {fileID: 95255516}
  - component: {fileID: 95255515}
  m_Layer: 5
  m_Name: Panel
  m_TagString: Untagged
  m_Icon: {fileID: 0}
  m_NavMeshLayer: 0
  m_StaticEditorFlags: 0
  m_IsActive: 1
--- !u!224 &95255514
RectTransform:
  m_ObjectHideFlags: 0
  m_PrefabParentObject: {fileID: 22458560, guid: c9de0c641e2673741a4d334e7fbd2e48,
    type: 2}
  m_PrefabInternal: {fileID: 498307449}
  m_GameObject: {fileID: 95255513}
  m_LocalRotation: {x: 0, y: 0, z: 0.3826835, w: 0.92387956}
  m_LocalPosition: {x: 0, y: 0, z: 0}
  m_LocalScale: {x: 1, y: 1, z: 1}
  m_Children: []
  m_Father: {fileID: 216789161}
  m_RootOrder: 5
  m_LocalEulerAnglesHint: {x: 0, y: 0, z: 0}
  m_AnchorMin: {x: 0.5, y: 0.5}
  m_AnchorMax: {x: 0.5, y: 0.5}
  m_AnchoredPosition: {x: -215.75, y: 40}
  m_SizeDelta: {x: 642, y: 20}
  m_Pivot: {x: 0.5, y: 0.5}
--- !u!114 &95255515
MonoBehaviour:
  m_ObjectHideFlags: 0
  m_PrefabParentObject: {fileID: 11458562, guid: c9de0c641e2673741a4d334e7fbd2e48,
    type: 2}
  m_PrefabInternal: {fileID: 498307449}
  m_GameObject: {fileID: 95255513}
  m_Enabled: 1
  m_EditorHideFlags: 0
  m_Script: {fileID: -765806418, guid: f5f67c52d1564df4a8936ccd202a3bd8, type: 3}
  m_Name: 
  m_EditorClassIdentifier: 
  m_Material: {fileID: 0}
  m_Color: {r: 1, g: 0.32352942, b: 0.39350888, a: 1}
  m_RaycastTarget: 1
  m_OnCullStateChanged:
    m_PersistentCalls:
      m_Calls: []
    m_TypeName: UnityEngine.UI.MaskableGraphic+CullStateChangedEvent, UnityEngine.UI,
      Version=1.0.0.0, Culture=neutral, PublicKeyToken=null
  m_Sprite: {fileID: 21300000, guid: 7ed1238760b863f4aafde32ab3a6f28c, type: 3}
  m_Type: 1
  m_PreserveAspect: 0
  m_FillCenter: 1
  m_FillMethod: 4
  m_FillAmount: 1
  m_FillClockwise: 1
  m_FillOrigin: 0
--- !u!222 &95255516
CanvasRenderer:
  m_ObjectHideFlags: 0
  m_PrefabParentObject: {fileID: 22258558, guid: c9de0c641e2673741a4d334e7fbd2e48,
    type: 2}
  m_PrefabInternal: {fileID: 498307449}
  m_GameObject: {fileID: 95255513}
--- !u!1 &122018913
GameObject:
  m_ObjectHideFlags: 0
  m_PrefabParentObject: {fileID: 158570, guid: c9de0c641e2673741a4d334e7fbd2e48, type: 2}
  m_PrefabInternal: {fileID: 498307449}
  serializedVersion: 5
  m_Component:
  - component: {fileID: 122018914}
  - component: {fileID: 122018916}
  - component: {fileID: 122018915}
  m_Layer: 5
  m_Name: AppTitle
  m_TagString: Untagged
  m_Icon: {fileID: 0}
  m_NavMeshLayer: 0
  m_StaticEditorFlags: 0
  m_IsActive: 1
--- !u!224 &122018914
RectTransform:
  m_ObjectHideFlags: 0
  m_PrefabParentObject: {fileID: 22458570, guid: c9de0c641e2673741a4d334e7fbd2e48,
    type: 2}
  m_PrefabInternal: {fileID: 498307449}
  m_GameObject: {fileID: 122018913}
  m_LocalRotation: {x: 0, y: 0, z: 0, w: 1}
  m_LocalPosition: {x: 0, y: 0, z: 0}
  m_LocalScale: {x: 1, y: 1, z: 1}
  m_Children: []
  m_Father: {fileID: 143083436}
  m_RootOrder: 0
  m_LocalEulerAnglesHint: {x: 0, y: 0, z: 0}
  m_AnchorMin: {x: 0.5, y: 0.5}
  m_AnchorMax: {x: 0.5, y: 0.5}
  m_AnchoredPosition: {x: 295, y: -68}
  m_SizeDelta: {x: 695, y: 109}
  m_Pivot: {x: 0.5, y: 0.5}
--- !u!114 &122018915
MonoBehaviour:
  m_ObjectHideFlags: 0
  m_PrefabParentObject: {fileID: 11458572, guid: c9de0c641e2673741a4d334e7fbd2e48,
    type: 2}
  m_PrefabInternal: {fileID: 498307449}
  m_GameObject: {fileID: 122018913}
  m_Enabled: 1
  m_EditorHideFlags: 0
  m_Script: {fileID: 708705254, guid: f5f67c52d1564df4a8936ccd202a3bd8, type: 3}
  m_Name: 
  m_EditorClassIdentifier: 
  m_Material: {fileID: 0}
  m_Color: {r: 0.85490197, g: 0.85490197, b: 0.85490197, a: 1}
  m_RaycastTarget: 1
  m_OnCullStateChanged:
    m_PersistentCalls:
      m_Calls: []
    m_TypeName: UnityEngine.UI.MaskableGraphic+CullStateChangedEvent, UnityEngine.UI,
      Version=1.0.0.0, Culture=neutral, PublicKeyToken=null
  m_FontData:
    m_Font: {fileID: 12800000, guid: 218956a5c2a6e42d6a60afccf80b002b, type: 3}
    m_FontSize: 40
    m_FontStyle: 0
    m_BestFit: 0
    m_MinSize: 10
    m_MaxSize: 40
    m_Alignment: 0
    m_AlignByGeometry: 0
    m_RichText: 1
    m_HorizontalOverflow: 0
    m_VerticalOverflow: 1
    m_LineSpacing: 1
  m_Text: EXAMPLE
--- !u!222 &122018916
CanvasRenderer:
  m_ObjectHideFlags: 0
  m_PrefabParentObject: {fileID: 22258568, guid: c9de0c641e2673741a4d334e7fbd2e48,
    type: 2}
  m_PrefabInternal: {fileID: 498307449}
  m_GameObject: {fileID: 122018913}
--- !u!1 &143083435
GameObject:
  m_ObjectHideFlags: 0
  m_PrefabParentObject: {fileID: 158578, guid: c9de0c641e2673741a4d334e7fbd2e48, type: 2}
  m_PrefabInternal: {fileID: 498307449}
  serializedVersion: 5
  m_Component:
  - component: {fileID: 143083436}
  - component: {fileID: 143083438}
  - component: {fileID: 143083437}
  m_Layer: 5
  m_Name: AppTitle
  m_TagString: Untagged
  m_Icon: {fileID: 0}
  m_NavMeshLayer: 0
  m_StaticEditorFlags: 0
  m_IsActive: 1
--- !u!224 &143083436
RectTransform:
  m_ObjectHideFlags: 0
  m_PrefabParentObject: {fileID: 22458578, guid: c9de0c641e2673741a4d334e7fbd2e48,
    type: 2}
  m_PrefabInternal: {fileID: 498307449}
  m_GameObject: {fileID: 143083435}
  m_LocalRotation: {x: 0, y: 0, z: 0, w: 1}
  m_LocalPosition: {x: 0, y: 0, z: 0}
  m_LocalScale: {x: 1, y: 1, z: 1}
  m_Children:
  - {fileID: 122018914}
  m_Father: {fileID: 1343329922}
  m_RootOrder: 0
  m_LocalEulerAnglesHint: {x: 0, y: 0, z: 0}
  m_AnchorMin: {x: 0.5, y: 0.5}
  m_AnchorMax: {x: 0.5, y: 0.5}
  m_AnchoredPosition: {x: 27.495, y: 633}
  m_SizeDelta: {x: 695, y: 109}
  m_Pivot: {x: 0.5, y: 0.5}
--- !u!114 &143083437
MonoBehaviour:
  m_ObjectHideFlags: 0
  m_PrefabParentObject: {fileID: 11458582, guid: c9de0c641e2673741a4d334e7fbd2e48,
    type: 2}
  m_PrefabInternal: {fileID: 498307449}
  m_GameObject: {fileID: 143083435}
  m_Enabled: 1
  m_EditorHideFlags: 0
  m_Script: {fileID: 708705254, guid: f5f67c52d1564df4a8936ccd202a3bd8, type: 3}
  m_Name: 
  m_EditorClassIdentifier: 
  m_Material: {fileID: 0}
  m_Color: {r: 0.85490197, g: 0.85490197, b: 0.85490197, a: 1}
  m_RaycastTarget: 1
  m_OnCullStateChanged:
    m_PersistentCalls:
      m_Calls: []
    m_TypeName: UnityEngine.UI.MaskableGraphic+CullStateChangedEvent, UnityEngine.UI,
      Version=1.0.0.0, Culture=neutral, PublicKeyToken=null
  m_FontData:
    m_Font: {fileID: 12800000, guid: 218956a5c2a6e42d6a60afccf80b002b, type: 3}
    m_FontSize: 102
    m_FontStyle: 0
    m_BestFit: 0
    m_MinSize: 10
    m_MaxSize: 102
    m_Alignment: 0
    m_AlignByGeometry: 0
    m_RichText: 1
    m_HorizontalOverflow: 0
    m_VerticalOverflow: 1
    m_LineSpacing: 1
  m_Text: GAME
--- !u!222 &143083438
CanvasRenderer:
  m_ObjectHideFlags: 0
  m_PrefabParentObject: {fileID: 22258576, guid: c9de0c641e2673741a4d334e7fbd2e48,
    type: 2}
  m_PrefabInternal: {fileID: 498307449}
  m_GameObject: {fileID: 143083435}
--- !u!1 &213733845
GameObject:
  m_ObjectHideFlags: 0
  m_PrefabParentObject: {fileID: 158550, guid: c9de0c641e2673741a4d334e7fbd2e48, type: 2}
  m_PrefabInternal: {fileID: 498307449}
  serializedVersion: 5
  m_Component:
  - component: {fileID: 213733846}
  - component: {fileID: 213733848}
  - component: {fileID: 213733847}
  m_Layer: 5
  m_Name: Panel_3
  m_TagString: Untagged
  m_Icon: {fileID: 0}
  m_NavMeshLayer: 0
  m_StaticEditorFlags: 0
  m_IsActive: 1
--- !u!224 &213733846
RectTransform:
  m_ObjectHideFlags: 0
  m_PrefabParentObject: {fileID: 22458550, guid: c9de0c641e2673741a4d334e7fbd2e48,
    type: 2}
  m_PrefabInternal: {fileID: 498307449}
  m_GameObject: {fileID: 213733845}
  m_LocalRotation: {x: 0, y: 0, z: 0, w: 1}
  m_LocalPosition: {x: 0, y: 0, z: 0}
  m_LocalScale: {x: 1, y: 1, z: 1}
  m_Children:
  - {fileID: 2079183028}
  m_Father: {fileID: 1950878577}
  m_RootOrder: 2
  m_LocalEulerAnglesHint: {x: 0, y: 0, z: 0}
  m_AnchorMin: {x: 0.5, y: 0.5}
  m_AnchorMax: {x: 0.5, y: 0.5}
  m_AnchoredPosition: {x: -1, y: -79}
  m_SizeDelta: {x: 642, y: 158}
  m_Pivot: {x: 0.5, y: 0.5}
--- !u!114 &213733847
MonoBehaviour:
  m_ObjectHideFlags: 0
  m_PrefabParentObject: {fileID: 11458552, guid: c9de0c641e2673741a4d334e7fbd2e48,
    type: 2}
  m_PrefabInternal: {fileID: 498307449}
  m_GameObject: {fileID: 213733845}
  m_Enabled: 1
  m_EditorHideFlags: 0
  m_Script: {fileID: -765806418, guid: f5f67c52d1564df4a8936ccd202a3bd8, type: 3}
  m_Name: 
  m_EditorClassIdentifier: 
  m_Material: {fileID: 0}
  m_Color: {r: 1, g: 0.32352942, b: 0.39350888, a: 1}
  m_RaycastTarget: 1
  m_OnCullStateChanged:
    m_PersistentCalls:
      m_Calls: []
    m_TypeName: UnityEngine.UI.MaskableGraphic+CullStateChangedEvent, UnityEngine.UI,
      Version=1.0.0.0, Culture=neutral, PublicKeyToken=null
  m_Sprite: {fileID: 21300000, guid: 7ed1238760b863f4aafde32ab3a6f28c, type: 3}
  m_Type: 1
  m_PreserveAspect: 0
  m_FillCenter: 1
  m_FillMethod: 4
  m_FillAmount: 1
  m_FillClockwise: 1
  m_FillOrigin: 0
--- !u!222 &213733848
CanvasRenderer:
  m_ObjectHideFlags: 0
  m_PrefabParentObject: {fileID: 22258548, guid: c9de0c641e2673741a4d334e7fbd2e48,
    type: 2}
  m_PrefabInternal: {fileID: 498307449}
  m_GameObject: {fileID: 213733845}
--- !u!1 &216789160
GameObject:
  m_ObjectHideFlags: 0
  m_PrefabParentObject: {fileID: 158568, guid: c9de0c641e2673741a4d334e7fbd2e48, type: 2}
  m_PrefabInternal: {fileID: 498307449}
  serializedVersion: 5
  m_Component:
  - component: {fileID: 216789161}
  - component: {fileID: 216789163}
  - component: {fileID: 216789162}
  m_Layer: 5
  m_Name: Panel_4
  m_TagString: Untagged
  m_Icon: {fileID: 0}
  m_NavMeshLayer: 0
  m_StaticEditorFlags: 0
  m_IsActive: 1
--- !u!224 &216789161
RectTransform:
  m_ObjectHideFlags: 0
  m_PrefabParentObject: {fileID: 22458568, guid: c9de0c641e2673741a4d334e7fbd2e48,
    type: 2}
  m_PrefabInternal: {fileID: 498307449}
  m_GameObject: {fileID: 216789160}
  m_LocalRotation: {x: 0, y: 0, z: 0, w: 1}
  m_LocalPosition: {x: 0, y: 0, z: 0}
  m_LocalScale: {x: 1, y: 1, z: 1}
  m_Children:
  - {fileID: 1682852850}
  - {fileID: 652884403}
  - {fileID: 1215815895}
  - {fileID: 697838251}
  - {fileID: 1978064911}
  - {fileID: 95255514}
  - {fileID: 1418109215}
  m_Father: {fileID: 1950878577}
  m_RootOrder: 3
  m_LocalEulerAnglesHint: {x: 0, y: 0, z: 0}
  m_AnchorMin: {x: 0.5, y: 0.5}
  m_AnchorMax: {x: 0.5, y: 0.5}
  m_AnchoredPosition: {x: -1.25, y: -363}
  m_SizeDelta: {x: 642.5, y: 410}
  m_Pivot: {x: 0.5, y: 0.5}
--- !u!114 &216789162
MonoBehaviour:
  m_ObjectHideFlags: 0
  m_PrefabParentObject: {fileID: 11458570, guid: c9de0c641e2673741a4d334e7fbd2e48,
    type: 2}
  m_PrefabInternal: {fileID: 498307449}
  m_GameObject: {fileID: 216789160}
  m_Enabled: 1
  m_EditorHideFlags: 0
  m_Script: {fileID: -765806418, guid: f5f67c52d1564df4a8936ccd202a3bd8, type: 3}
  m_Name: 
  m_EditorClassIdentifier: 
  m_Material: {fileID: 0}
  m_Color: {r: 0.25490198, g: 0.2784314, b: 0.30980393, a: 1}
  m_RaycastTarget: 1
  m_OnCullStateChanged:
    m_PersistentCalls:
      m_Calls: []
    m_TypeName: UnityEngine.UI.MaskableGraphic+CullStateChangedEvent, UnityEngine.UI,
      Version=1.0.0.0, Culture=neutral, PublicKeyToken=null
  m_Sprite: {fileID: 21300000, guid: 7ed1238760b863f4aafde32ab3a6f28c, type: 3}
  m_Type: 1
  m_PreserveAspect: 0
  m_FillCenter: 1
  m_FillMethod: 4
  m_FillAmount: 1
  m_FillClockwise: 1
  m_FillOrigin: 0
--- !u!222 &216789163
CanvasRenderer:
  m_ObjectHideFlags: 0
  m_PrefabParentObject: {fileID: 22258566, guid: c9de0c641e2673741a4d334e7fbd2e48,
    type: 2}
  m_PrefabInternal: {fileID: 498307449}
  m_GameObject: {fileID: 216789160}
--- !u!1 &448430704
GameObject:
  m_ObjectHideFlags: 0
  m_PrefabParentObject: {fileID: 158562, guid: c9de0c641e2673741a4d334e7fbd2e48, type: 2}
  m_PrefabInternal: {fileID: 498307449}
  serializedVersion: 5
  m_Component:
  - component: {fileID: 448430705}
  - component: {fileID: 448430707}
  - component: {fileID: 448430706}
  m_Layer: 5
  m_Name: Text
  m_TagString: Untagged
  m_Icon: {fileID: 0}
  m_NavMeshLayer: 0
  m_StaticEditorFlags: 0
  m_IsActive: 1
--- !u!224 &448430705
RectTransform:
  m_ObjectHideFlags: 0
  m_PrefabParentObject: {fileID: 22458562, guid: c9de0c641e2673741a4d334e7fbd2e48,
    type: 2}
  m_PrefabInternal: {fileID: 498307449}
  m_GameObject: {fileID: 448430704}
  m_LocalRotation: {x: 0, y: 0, z: 0, w: 1}
  m_LocalPosition: {x: 0, y: 0, z: 0}
  m_LocalScale: {x: 1, y: 1, z: 1}
  m_Children: []
  m_Father: {fileID: 1233608512}
  m_RootOrder: 0
  m_LocalEulerAnglesHint: {x: 0, y: 0, z: 0}
  m_AnchorMin: {x: 0.5, y: 0.5}
  m_AnchorMax: {x: 0.5, y: 0.5}
  m_AnchoredPosition: {x: 0, y: 0}
  m_SizeDelta: {x: 362, y: 158}
  m_Pivot: {x: 0.5, y: 0.5}
--- !u!114 &448430706
MonoBehaviour:
  m_ObjectHideFlags: 0
  m_PrefabParentObject: {fileID: 11458564, guid: c9de0c641e2673741a4d334e7fbd2e48,
    type: 2}
  m_PrefabInternal: {fileID: 498307449}
  m_GameObject: {fileID: 448430704}
  m_Enabled: 1
  m_EditorHideFlags: 0
  m_Script: {fileID: 708705254, guid: f5f67c52d1564df4a8936ccd202a3bd8, type: 3}
  m_Name: 
  m_EditorClassIdentifier: 
  m_Material: {fileID: 0}
  m_Color: {r: 0.27412534, g: 0.60784316, b: 0.42099836, a: 1}
  m_RaycastTarget: 1
  m_OnCullStateChanged:
    m_PersistentCalls:
      m_Calls: []
    m_TypeName: UnityEngine.UI.MaskableGraphic+CullStateChangedEvent, UnityEngine.UI,
      Version=1.0.0.0, Culture=neutral, PublicKeyToken=null
  m_FontData:
    m_Font: {fileID: 12800000, guid: 218956a5c2a6e42d6a60afccf80b002b, type: 3}
    m_FontSize: 60
    m_FontStyle: 0
    m_BestFit: 0
    m_MinSize: 10
    m_MaxSize: 60
    m_Alignment: 4
    m_AlignByGeometry: 0
    m_RichText: 1
    m_HorizontalOverflow: 0
    m_VerticalOverflow: 0
    m_LineSpacing: 1
  m_Text: 46
--- !u!222 &448430707
CanvasRenderer:
  m_ObjectHideFlags: 0
  m_PrefabParentObject: {fileID: 22258560, guid: c9de0c641e2673741a4d334e7fbd2e48,
    type: 2}
  m_PrefabInternal: {fileID: 498307449}
  m_GameObject: {fileID: 448430704}
--- !u!1001 &498307449
Prefab:
  m_ObjectHideFlags: 0
  serializedVersion: 2
  m_Modification:
    m_TransformParent: {fileID: 0}
    m_Modifications:
    - target: {fileID: 22458548, guid: c9de0c641e2673741a4d334e7fbd2e48, type: 2}
      propertyPath: m_LocalPosition.x
      value: 0
      objectReference: {fileID: 0}
    - target: {fileID: 22458548, guid: c9de0c641e2673741a4d334e7fbd2e48, type: 2}
      propertyPath: m_LocalPosition.y
      value: 0
      objectReference: {fileID: 0}
    - target: {fileID: 22458548, guid: c9de0c641e2673741a4d334e7fbd2e48, type: 2}
      propertyPath: m_LocalPosition.z
      value: 0
      objectReference: {fileID: 0}
    - target: {fileID: 22458548, guid: c9de0c641e2673741a4d334e7fbd2e48, type: 2}
      propertyPath: m_LocalRotation.x
      value: 0
      objectReference: {fileID: 0}
    - target: {fileID: 22458548, guid: c9de0c641e2673741a4d334e7fbd2e48, type: 2}
      propertyPath: m_LocalRotation.y
      value: 0
      objectReference: {fileID: 0}
    - target: {fileID: 22458548, guid: c9de0c641e2673741a4d334e7fbd2e48, type: 2}
      propertyPath: m_LocalRotation.z
      value: 0
      objectReference: {fileID: 0}
    - target: {fileID: 22458548, guid: c9de0c641e2673741a4d334e7fbd2e48, type: 2}
      propertyPath: m_LocalRotation.w
      value: 1
      objectReference: {fileID: 0}
    - target: {fileID: 22458548, guid: c9de0c641e2673741a4d334e7fbd2e48, type: 2}
      propertyPath: m_RootOrder
      value: 0
      objectReference: {fileID: 0}
    - target: {fileID: 22458548, guid: c9de0c641e2673741a4d334e7fbd2e48, type: 2}
      propertyPath: m_AnchoredPosition.x
      value: 0
      objectReference: {fileID: 0}
    - target: {fileID: 22458548, guid: c9de0c641e2673741a4d334e7fbd2e48, type: 2}
      propertyPath: m_AnchoredPosition.y
      value: 0
      objectReference: {fileID: 0}
    - target: {fileID: 22458548, guid: c9de0c641e2673741a4d334e7fbd2e48, type: 2}
      propertyPath: m_SizeDelta.x
      value: 0
      objectReference: {fileID: 0}
    - target: {fileID: 22458548, guid: c9de0c641e2673741a4d334e7fbd2e48, type: 2}
      propertyPath: m_SizeDelta.y
      value: 0
      objectReference: {fileID: 0}
    - target: {fileID: 22458548, guid: c9de0c641e2673741a4d334e7fbd2e48, type: 2}
      propertyPath: m_AnchorMin.x
      value: 0
      objectReference: {fileID: 0}
    - target: {fileID: 22458548, guid: c9de0c641e2673741a4d334e7fbd2e48, type: 2}
      propertyPath: m_AnchorMin.y
      value: 0
      objectReference: {fileID: 0}
    - target: {fileID: 22458548, guid: c9de0c641e2673741a4d334e7fbd2e48, type: 2}
      propertyPath: m_AnchorMax.x
      value: 0
      objectReference: {fileID: 0}
    - target: {fileID: 22458548, guid: c9de0c641e2673741a4d334e7fbd2e48, type: 2}
      propertyPath: m_AnchorMax.y
      value: 0
      objectReference: {fileID: 0}
    - target: {fileID: 22458548, guid: c9de0c641e2673741a4d334e7fbd2e48, type: 2}
      propertyPath: m_Pivot.x
      value: 0
      objectReference: {fileID: 0}
    - target: {fileID: 22458548, guid: c9de0c641e2673741a4d334e7fbd2e48, type: 2}
      propertyPath: m_Pivot.y
      value: 0
      objectReference: {fileID: 0}
    m_RemovedComponents: []
  m_ParentPrefab: {fileID: 100100000, guid: c9de0c641e2673741a4d334e7fbd2e48, type: 2}
  m_RootGameObject: {fileID: 1343329918}
  m_IsPrefabParent: 0
--- !u!1 &652884402
GameObject:
  m_ObjectHideFlags: 0
  m_PrefabParentObject: {fileID: 158580, guid: c9de0c641e2673741a4d334e7fbd2e48, type: 2}
  m_PrefabInternal: {fileID: 498307449}
  serializedVersion: 5
  m_Component:
  - component: {fileID: 652884403}
  - component: {fileID: 652884405}
  - component: {fileID: 652884404}
  m_Layer: 5
  m_Name: Panel
  m_TagString: Untagged
  m_Icon: {fileID: 0}
  m_NavMeshLayer: 0
  m_StaticEditorFlags: 0
  m_IsActive: 1
--- !u!224 &652884403
RectTransform:
  m_ObjectHideFlags: 0
  m_PrefabParentObject: {fileID: 22458580, guid: c9de0c641e2673741a4d334e7fbd2e48,
    type: 2}
  m_PrefabInternal: {fileID: 498307449}
  m_GameObject: {fileID: 652884402}
  m_LocalRotation: {x: 0, y: 0, z: -0.3826835, w: 0.92387956}
  m_LocalPosition: {x: 0, y: 0, z: 0}
  m_LocalScale: {x: 1, y: 1, z: 1}
  m_Children: []
  m_Father: {fileID: 216789161}
  m_RootOrder: 1
  m_LocalEulerAnglesHint: {x: 0, y: 0, z: 0}
  m_AnchorMin: {x: 0.5, y: 0.5}
  m_AnchorMax: {x: 0.5, y: 0.5}
  m_AnchoredPosition: {x: -130.75, y: -126}
  m_SizeDelta: {x: 254, y: 9}
  m_Pivot: {x: 0.5, y: 0.5}
--- !u!114 &652884404
MonoBehaviour:
  m_ObjectHideFlags: 0
  m_PrefabParentObject: {fileID: 11458584, guid: c9de0c641e2673741a4d334e7fbd2e48,
    type: 2}
  m_PrefabInternal: {fileID: 498307449}
  m_GameObject: {fileID: 652884402}
  m_Enabled: 1
  m_EditorHideFlags: 0
  m_Script: {fileID: -765806418, guid: f5f67c52d1564df4a8936ccd202a3bd8, type: 3}
  m_Name: 
  m_EditorClassIdentifier: 
  m_Material: {fileID: 0}
  m_Color: {r: 1, g: 0.32352942, b: 0.39350888, a: 1}
  m_RaycastTarget: 1
  m_OnCullStateChanged:
    m_PersistentCalls:
      m_Calls: []
    m_TypeName: UnityEngine.UI.MaskableGraphic+CullStateChangedEvent, UnityEngine.UI,
      Version=1.0.0.0, Culture=neutral, PublicKeyToken=null
  m_Sprite: {fileID: 21300000, guid: 7ed1238760b863f4aafde32ab3a6f28c, type: 3}
  m_Type: 1
  m_PreserveAspect: 0
  m_FillCenter: 1
  m_FillMethod: 4
  m_FillAmount: 1
  m_FillClockwise: 1
  m_FillOrigin: 0
--- !u!222 &652884405
CanvasRenderer:
  m_ObjectHideFlags: 0
  m_PrefabParentObject: {fileID: 22258578, guid: c9de0c641e2673741a4d334e7fbd2e48,
    type: 2}
  m_PrefabInternal: {fileID: 498307449}
  m_GameObject: {fileID: 652884402}
--- !u!1 &697838250
GameObject:
  m_ObjectHideFlags: 0
  m_PrefabParentObject: {fileID: 158582, guid: c9de0c641e2673741a4d334e7fbd2e48, type: 2}
  m_PrefabInternal: {fileID: 498307449}
  serializedVersion: 5
  m_Component:
  - component: {fileID: 697838251}
  - component: {fileID: 697838253}
  - component: {fileID: 697838252}
  m_Layer: 5
  m_Name: Panel
  m_TagString: Untagged
  m_Icon: {fileID: 0}
  m_NavMeshLayer: 0
  m_StaticEditorFlags: 0
  m_IsActive: 1
--- !u!224 &697838251
RectTransform:
  m_ObjectHideFlags: 0
  m_PrefabParentObject: {fileID: 22458582, guid: c9de0c641e2673741a4d334e7fbd2e48,
    type: 2}
  m_PrefabInternal: {fileID: 498307449}
  m_GameObject: {fileID: 697838250}
  m_LocalRotation: {x: 0, y: 0, z: 0.38268292, w: 0.92387974}
  m_LocalPosition: {x: 0, y: 0, z: 0}
  m_LocalScale: {x: 1, y: 1, z: 1}
  m_Children: []
  m_Father: {fileID: 216789161}
  m_RootOrder: 3
  m_LocalEulerAnglesHint: {x: 0, y: 0, z: 0}
  m_AnchorMin: {x: 0.5, y: 0.5}
  m_AnchorMax: {x: 0.5, y: 0.5}
  m_AnchoredPosition: {x: 179.35, y: -74.899994}
  m_SizeDelta: {x: 474, y: 12}
  m_Pivot: {x: 0.5, y: 0.5}
--- !u!114 &697838252
MonoBehaviour:
  m_ObjectHideFlags: 0
  m_PrefabParentObject: {fileID: 11458586, guid: c9de0c641e2673741a4d334e7fbd2e48,
    type: 2}
  m_PrefabInternal: {fileID: 498307449}
  m_GameObject: {fileID: 697838250}
  m_Enabled: 1
  m_EditorHideFlags: 0
  m_Script: {fileID: -765806418, guid: f5f67c52d1564df4a8936ccd202a3bd8, type: 3}
  m_Name: 
  m_EditorClassIdentifier: 
  m_Material: {fileID: 0}
  m_Color: {r: 1, g: 0.32352942, b: 0.39350888, a: 1}
  m_RaycastTarget: 1
  m_OnCullStateChanged:
    m_PersistentCalls:
      m_Calls: []
    m_TypeName: UnityEngine.UI.MaskableGraphic+CullStateChangedEvent, UnityEngine.UI,
      Version=1.0.0.0, Culture=neutral, PublicKeyToken=null
  m_Sprite: {fileID: 21300000, guid: 7ed1238760b863f4aafde32ab3a6f28c, type: 3}
  m_Type: 1
  m_PreserveAspect: 0
  m_FillCenter: 1
  m_FillMethod: 4
  m_FillAmount: 1
  m_FillClockwise: 1
  m_FillOrigin: 0
--- !u!222 &697838253
CanvasRenderer:
  m_ObjectHideFlags: 0
  m_PrefabParentObject: {fileID: 22258580, guid: c9de0c641e2673741a4d334e7fbd2e48,
    type: 2}
  m_PrefabInternal: {fileID: 498307449}
  m_GameObject: {fileID: 697838250}
--- !u!1 &976205639
GameObject:
  m_ObjectHideFlags: 0
  m_PrefabParentObject: {fileID: 158554, guid: c9de0c641e2673741a4d334e7fbd2e48, type: 2}
  m_PrefabInternal: {fileID: 498307449}
  serializedVersion: 5
  m_Component:
  - component: {fileID: 976205640}
  - component: {fileID: 976205642}
  - component: {fileID: 976205641}
  m_Layer: 5
  m_Name: Panel_1
  m_TagString: Untagged
  m_Icon: {fileID: 0}
  m_NavMeshLayer: 0
  m_StaticEditorFlags: 0
  m_IsActive: 1
--- !u!224 &976205640
RectTransform:
  m_ObjectHideFlags: 0
  m_PrefabParentObject: {fileID: 22458554, guid: c9de0c641e2673741a4d334e7fbd2e48,
    type: 2}
  m_PrefabInternal: {fileID: 498307449}
  m_GameObject: {fileID: 976205639}
  m_LocalRotation: {x: 0, y: 0, z: 0, w: 1}
  m_LocalPosition: {x: 0, y: 0, z: 0}
  m_LocalScale: {x: 1, y: 1, z: 1}
  m_Children:
  - {fileID: 1559918325}
  m_Father: {fileID: 1950878577}
  m_RootOrder: 0
  m_LocalEulerAnglesHint: {x: 0, y: 0, z: 0}
  m_AnchorMin: {x: 0.5, y: 0.5}
  m_AnchorMax: {x: 0.5, y: 0.5}
  m_AnchoredPosition: {x: -1, y: 364.75}
  m_SizeDelta: {x: 642, y: 413.5}
  m_Pivot: {x: 0.5, y: 0.5}
--- !u!114 &976205641
MonoBehaviour:
  m_ObjectHideFlags: 0
  m_PrefabParentObject: {fileID: 11458556, guid: c9de0c641e2673741a4d334e7fbd2e48,
    type: 2}
  m_PrefabInternal: {fileID: 498307449}
  m_GameObject: {fileID: 976205639}
  m_Enabled: 1
  m_EditorHideFlags: 0
  m_Script: {fileID: -765806418, guid: f5f67c52d1564df4a8936ccd202a3bd8, type: 3}
  m_Name: 
  m_EditorClassIdentifier: 
  m_Material: {fileID: 0}
  m_Color: {r: 0.9558824, g: 0.7319383, b: 0.21788493, a: 1}
  m_RaycastTarget: 1
  m_OnCullStateChanged:
    m_PersistentCalls:
      m_Calls: []
    m_TypeName: UnityEngine.UI.MaskableGraphic+CullStateChangedEvent, UnityEngine.UI,
      Version=1.0.0.0, Culture=neutral, PublicKeyToken=null
  m_Sprite: {fileID: 21300000, guid: 7ed1238760b863f4aafde32ab3a6f28c, type: 3}
  m_Type: 1
  m_PreserveAspect: 0
  m_FillCenter: 1
  m_FillMethod: 4
  m_FillAmount: 1
  m_FillClockwise: 1
  m_FillOrigin: 0
--- !u!222 &976205642
CanvasRenderer:
  m_ObjectHideFlags: 0
  m_PrefabParentObject: {fileID: 22258552, guid: c9de0c641e2673741a4d334e7fbd2e48,
    type: 2}
  m_PrefabInternal: {fileID: 498307449}
  m_GameObject: {fileID: 976205639}
--- !u!1 &1215815894
GameObject:
  m_ObjectHideFlags: 0
  m_PrefabParentObject: {fileID: 158574, guid: c9de0c641e2673741a4d334e7fbd2e48, type: 2}
  m_PrefabInternal: {fileID: 498307449}
  serializedVersion: 5
  m_Component:
  - component: {fileID: 1215815895}
  - component: {fileID: 1215815897}
  - component: {fileID: 1215815896}
  m_Layer: 5
  m_Name: Panel
  m_TagString: Untagged
  m_Icon: {fileID: 0}
  m_NavMeshLayer: 0
  m_StaticEditorFlags: 0
  m_IsActive: 1
--- !u!224 &1215815895
RectTransform:
  m_ObjectHideFlags: 0
  m_PrefabParentObject: {fileID: 22458574, guid: c9de0c641e2673741a4d334e7fbd2e48,
    type: 2}
  m_PrefabInternal: {fileID: 498307449}
  m_GameObject: {fileID: 1215815894}
  m_LocalRotation: {x: 0, y: 0, z: -0.38268292, w: 0.92387974}
  m_LocalPosition: {x: 0, y: 0, z: 0}
  m_LocalScale: {x: 1, y: 1, z: 1}
  m_Children: []
  m_Father: {fileID: 216789161}
  m_RootOrder: 2
  m_LocalEulerAnglesHint: {x: 0, y: 0, z: 0}
  m_AnchorMin: {x: 0.5, y: 0.5}
  m_AnchorMax: {x: 0.5, y: 0.5}
  m_AnchoredPosition: {x: -179.25, y: -107.79999}
  m_SizeDelta: {x: 159, y: 16.2}
  m_Pivot: {x: 0.5, y: 0.5}
--- !u!114 &1215815896
MonoBehaviour:
  m_ObjectHideFlags: 0
  m_PrefabParentObject: {fileID: 11458576, guid: c9de0c641e2673741a4d334e7fbd2e48,
    type: 2}
  m_PrefabInternal: {fileID: 498307449}
  m_GameObject: {fileID: 1215815894}
  m_Enabled: 1
  m_EditorHideFlags: 0
  m_Script: {fileID: -765806418, guid: f5f67c52d1564df4a8936ccd202a3bd8, type: 3}
  m_Name: 
  m_EditorClassIdentifier: 
  m_Material: {fileID: 0}
  m_Color: {r: 1, g: 0.32352942, b: 0.39350888, a: 1}
  m_RaycastTarget: 1
  m_OnCullStateChanged:
    m_PersistentCalls:
      m_Calls: []
    m_TypeName: UnityEngine.UI.MaskableGraphic+CullStateChangedEvent, UnityEngine.UI,
      Version=1.0.0.0, Culture=neutral, PublicKeyToken=null
  m_Sprite: {fileID: 21300000, guid: 7ed1238760b863f4aafde32ab3a6f28c, type: 3}
  m_Type: 1
  m_PreserveAspect: 0
  m_FillCenter: 1
  m_FillMethod: 4
  m_FillAmount: 1
  m_FillClockwise: 1
  m_FillOrigin: 0
--- !u!222 &1215815897
CanvasRenderer:
  m_ObjectHideFlags: 0
  m_PrefabParentObject: {fileID: 22258572, guid: c9de0c641e2673741a4d334e7fbd2e48,
    type: 2}
  m_PrefabInternal: {fileID: 498307449}
  m_GameObject: {fileID: 1215815894}
--- !u!1 &1233608511
GameObject:
  m_ObjectHideFlags: 0
  m_PrefabParentObject: {fileID: 158572, guid: c9de0c641e2673741a4d334e7fbd2e48, type: 2}
  m_PrefabInternal: {fileID: 498307449}
  serializedVersion: 5
  m_Component:
  - component: {fileID: 1233608512}
  - component: {fileID: 1233608514}
  - component: {fileID: 1233608513}
  m_Layer: 5
  m_Name: Panel_2
  m_TagString: Untagged
  m_Icon: {fileID: 0}
  m_NavMeshLayer: 0
  m_StaticEditorFlags: 0
  m_IsActive: 1
--- !u!224 &1233608512
RectTransform:
  m_ObjectHideFlags: 0
  m_PrefabParentObject: {fileID: 22458572, guid: c9de0c641e2673741a4d334e7fbd2e48,
    type: 2}
  m_PrefabInternal: {fileID: 498307449}
  m_GameObject: {fileID: 1233608511}
  m_LocalRotation: {x: 0, y: 0, z: 0, w: 1}
  m_LocalPosition: {x: 0, y: 0, z: 0}
  m_LocalScale: {x: 1, y: 1, z: 1}
  m_Children:
  - {fileID: 448430705}
  m_Father: {fileID: 1950878577}
  m_RootOrder: 1
  m_LocalEulerAnglesHint: {x: 0, y: 0, z: 0}
  m_AnchorMin: {x: 0.5, y: 0.5}
  m_AnchorMax: {x: 0.5, y: 0.5}
  m_AnchoredPosition: {x: -1, y: 79}
  m_SizeDelta: {x: 642, y: 158}
  m_Pivot: {x: 0.5, y: 0.5}
--- !u!114 &1233608513
MonoBehaviour:
  m_ObjectHideFlags: 0
  m_PrefabParentObject: {fileID: 11458574, guid: c9de0c641e2673741a4d334e7fbd2e48,
    type: 2}
  m_PrefabInternal: {fileID: 498307449}
  m_GameObject: {fileID: 1233608511}
  m_Enabled: 1
  m_EditorHideFlags: 0
  m_Script: {fileID: -765806418, guid: f5f67c52d1564df4a8936ccd202a3bd8, type: 3}
  m_Name: 
  m_EditorClassIdentifier: 
  m_Material: {fileID: 0}
  m_Color: {r: 0.36937717, g: 0.8235294, b: 0.5722319, a: 1}
  m_RaycastTarget: 1
  m_OnCullStateChanged:
    m_PersistentCalls:
      m_Calls: []
    m_TypeName: UnityEngine.UI.MaskableGraphic+CullStateChangedEvent, UnityEngine.UI,
      Version=1.0.0.0, Culture=neutral, PublicKeyToken=null
  m_Sprite: {fileID: 21300000, guid: 7ed1238760b863f4aafde32ab3a6f28c, type: 3}
  m_Type: 1
  m_PreserveAspect: 0
  m_FillCenter: 1
  m_FillMethod: 4
  m_FillAmount: 1
  m_FillClockwise: 1
  m_FillOrigin: 0
--- !u!222 &1233608514
CanvasRenderer:
  m_ObjectHideFlags: 0
  m_PrefabParentObject: {fileID: 22258570, guid: c9de0c641e2673741a4d334e7fbd2e48,
    type: 2}
  m_PrefabInternal: {fileID: 498307449}
  m_GameObject: {fileID: 1233608511}
--- !u!1 &1343329918
GameObject:
  m_ObjectHideFlags: 0
  m_PrefabParentObject: {fileID: 158548, guid: c9de0c641e2673741a4d334e7fbd2e48, type: 2}
  m_PrefabInternal: {fileID: 498307449}
  serializedVersion: 5
  m_Component:
  - component: {fileID: 1343329922}
  - component: {fileID: 1343329921}
  - component: {fileID: 1343329920}
  - component: {fileID: 1343329919}
  m_Layer: 5
  m_Name: GameExample_11
  m_TagString: Untagged
  m_Icon: {fileID: 0}
  m_NavMeshLayer: 0
  m_StaticEditorFlags: 0
  m_IsActive: 1
--- !u!114 &1343329919
MonoBehaviour:
  m_ObjectHideFlags: 0
  m_PrefabParentObject: {fileID: 11458548, guid: c9de0c641e2673741a4d334e7fbd2e48,
    type: 2}
  m_PrefabInternal: {fileID: 498307449}
  m_GameObject: {fileID: 1343329918}
  m_Enabled: 1
  m_EditorHideFlags: 0
  m_Script: {fileID: 1301386320, guid: f5f67c52d1564df4a8936ccd202a3bd8, type: 3}
  m_Name: 
  m_EditorClassIdentifier: 
  m_IgnoreReversedGraphics: 1
  m_BlockingObjects: 0
  m_BlockingMask:
    serializedVersion: 2
    m_Bits: 4294967295
--- !u!114 &1343329920
MonoBehaviour:
  m_ObjectHideFlags: 0
  m_PrefabParentObject: {fileID: 11458550, guid: c9de0c641e2673741a4d334e7fbd2e48,
    type: 2}
  m_PrefabInternal: {fileID: 498307449}
  m_GameObject: {fileID: 1343329918}
  m_Enabled: 1
  m_EditorHideFlags: 0
  m_Script: {fileID: 1980459831, guid: f5f67c52d1564df4a8936ccd202a3bd8, type: 3}
  m_Name: 
  m_EditorClassIdentifier: 
  m_UiScaleMode: 1
  m_ReferencePixelsPerUnit: 100
  m_ScaleFactor: 1
  m_ReferenceResolution: {x: 640, y: 1136}
  m_ScreenMatchMode: 0
  m_MatchWidthOrHeight: 1
  m_PhysicalUnit: 3
  m_FallbackScreenDPI: 96
  m_DefaultSpriteDPI: 96
  m_DynamicPixelsPerUnit: 1
--- !u!223 &1343329921
Canvas:
  m_ObjectHideFlags: 0
  m_PrefabParentObject: {fileID: 22358548, guid: c9de0c641e2673741a4d334e7fbd2e48,
    type: 2}
  m_PrefabInternal: {fileID: 498307449}
  m_GameObject: {fileID: 1343329918}
  m_Enabled: 1
  serializedVersion: 3
  m_RenderMode: 0
  m_Camera: {fileID: 0}
  m_PlaneDistance: 100
  m_PixelPerfect: 1
  m_ReceivesEvents: 1
  m_OverrideSorting: 0
  m_OverridePixelPerfect: 0
  m_SortingBucketNormalizedSize: 0
  m_AdditionalShaderChannelsFlag: 25
  m_SortingLayerID: 0
  m_SortingOrder: 0
  m_TargetDisplay: 0
--- !u!224 &1343329922
RectTransform:
  m_ObjectHideFlags: 0
  m_PrefabParentObject: {fileID: 22458548, guid: c9de0c641e2673741a4d334e7fbd2e48,
    type: 2}
  m_PrefabInternal: {fileID: 498307449}
  m_GameObject: {fileID: 1343329918}
  m_LocalRotation: {x: 0, y: 0, z: 0, w: 1}
  m_LocalPosition: {x: 0, y: 0, z: 0}
  m_LocalScale: {x: 0, y: 0, z: 0}
  m_Children:
  - {fileID: 143083436}
  - {fileID: 1950878577}
  m_Father: {fileID: 0}
  m_RootOrder: 0
  m_LocalEulerAnglesHint: {x: 0, y: 0, z: 0}
  m_AnchorMin: {x: 0, y: 0}
  m_AnchorMax: {x: 0, y: 0}
  m_AnchoredPosition: {x: 0, y: 0}
  m_SizeDelta: {x: 0, y: 0}
  m_Pivot: {x: 0, y: 0}
--- !u!1 &1418109214
GameObject:
  m_ObjectHideFlags: 0
  m_PrefabParentObject: {fileID: 158552, guid: c9de0c641e2673741a4d334e7fbd2e48, type: 2}
  m_PrefabInternal: {fileID: 498307449}
  serializedVersion: 5
  m_Component:
  - component: {fileID: 1418109215}
  - component: {fileID: 1418109217}
  - component: {fileID: 1418109216}
  m_Layer: 5
  m_Name: Text
  m_TagString: Untagged
  m_Icon: {fileID: 0}
  m_NavMeshLayer: 0
  m_StaticEditorFlags: 0
  m_IsActive: 1
--- !u!224 &1418109215
RectTransform:
  m_ObjectHideFlags: 0
  m_PrefabParentObject: {fileID: 22458552, guid: c9de0c641e2673741a4d334e7fbd2e48,
    type: 2}
  m_PrefabInternal: {fileID: 498307449}
  m_GameObject: {fileID: 1418109214}
  m_LocalRotation: {x: 0, y: 0, z: 0, w: 1}
  m_LocalPosition: {x: 0, y: 0, z: 0}
  m_LocalScale: {x: 1, y: 1, z: 1}
  m_Children: []
  m_Father: {fileID: 216789161}
  m_RootOrder: 6
  m_LocalEulerAnglesHint: {x: 0, y: 0, z: 0}
  m_AnchorMin: {x: 0.5, y: 0.5}
  m_AnchorMax: {x: 0.5, y: 0.5}
  m_AnchoredPosition: {x: -0.049999952, y: 0}
  m_SizeDelta: {x: 417, y: 206.6}
  m_Pivot: {x: 0.5, y: 0.5}
--- !u!114 &1418109216
MonoBehaviour:
  m_ObjectHideFlags: 0
  m_PrefabParentObject: {fileID: 11458554, guid: c9de0c641e2673741a4d334e7fbd2e48,
    type: 2}
  m_PrefabInternal: {fileID: 498307449}
  m_GameObject: {fileID: 1418109214}
  m_Enabled: 1
  m_EditorHideFlags: 0
  m_Script: {fileID: 708705254, guid: f5f67c52d1564df4a8936ccd202a3bd8, type: 3}
  m_Name: 
  m_EditorClassIdentifier: 
  m_Material: {fileID: 0}
  m_Color: {r: 0.50380623, g: 0.5495157, b: 0.6117647, a: 1}
  m_RaycastTarget: 1
  m_OnCullStateChanged:
    m_PersistentCalls:
      m_Calls: []
    m_TypeName: UnityEngine.UI.MaskableGraphic+CullStateChangedEvent, UnityEngine.UI,
      Version=1.0.0.0, Culture=neutral, PublicKeyToken=null
  m_FontData:
    m_Font: {fileID: 12800000, guid: 7dfc2e1472ac84e1bb749a8a9f934483, type: 3}
    m_FontSize: 88
    m_FontStyle: 0
    m_BestFit: 0
    m_MinSize: 10
    m_MaxSize: 88
    m_Alignment: 4
    m_AlignByGeometry: 0
    m_RichText: 1
    m_HorizontalOverflow: 0
    m_VerticalOverflow: 0
    m_LineSpacing: 1
  m_Text: PLAY
--- !u!222 &1418109217
CanvasRenderer:
  m_ObjectHideFlags: 0
  m_PrefabParentObject: {fileID: 22258550, guid: c9de0c641e2673741a4d334e7fbd2e48,
    type: 2}
  m_PrefabInternal: {fileID: 498307449}
  m_GameObject: {fileID: 1418109214}
--- !u!1 &1500371475
GameObject:
  m_ObjectHideFlags: 0
  m_PrefabParentObject: {fileID: 0}
  m_PrefabInternal: {fileID: 0}
  serializedVersion: 5
  m_Component:
  - component: {fileID: 1500371479}
  - component: {fileID: 1500371478}
  - component: {fileID: 1500371477}
  - component: {fileID: 1500371476}
  m_Layer: 0
  m_Name: EventSystem
  m_TagString: Untagged
  m_Icon: {fileID: 0}
  m_NavMeshLayer: 0
  m_StaticEditorFlags: 0
  m_IsActive: 1
--- !u!114 &1500371476
MonoBehaviour:
  m_ObjectHideFlags: 0
  m_PrefabParentObject: {fileID: 0}
  m_PrefabInternal: {fileID: 0}
  m_GameObject: {fileID: 1500371475}
  m_Enabled: 1
  m_EditorHideFlags: 0
  m_Script: {fileID: 1997211142, guid: f5f67c52d1564df4a8936ccd202a3bd8, type: 3}
  m_Name: 
  m_EditorClassIdentifier: 
  m_ForceModuleActive: 0
--- !u!114 &1500371477
MonoBehaviour:
  m_ObjectHideFlags: 0
  m_PrefabParentObject: {fileID: 0}
  m_PrefabInternal: {fileID: 0}
  m_GameObject: {fileID: 1500371475}
  m_Enabled: 1
  m_EditorHideFlags: 0
  m_Script: {fileID: 1077351063, guid: f5f67c52d1564df4a8936ccd202a3bd8, type: 3}
  m_Name: 
  m_EditorClassIdentifier: 
  m_HorizontalAxis: Horizontal
  m_VerticalAxis: Vertical
  m_SubmitButton: Submit
  m_CancelButton: Cancel
  m_InputActionsPerSecond: 10
  m_RepeatDelay: 0.5
  m_ForceModuleActive: 0
--- !u!114 &1500371478
MonoBehaviour:
  m_ObjectHideFlags: 0
  m_PrefabParentObject: {fileID: 0}
  m_PrefabInternal: {fileID: 0}
  m_GameObject: {fileID: 1500371475}
  m_Enabled: 1
  m_EditorHideFlags: 0
  m_Script: {fileID: -619905303, guid: f5f67c52d1564df4a8936ccd202a3bd8, type: 3}
  m_Name: 
  m_EditorClassIdentifier: 
  m_FirstSelected: {fileID: 0}
  m_sendNavigationEvents: 1
  m_DragThreshold: 5
--- !u!4 &1500371479
Transform:
  m_ObjectHideFlags: 0
  m_PrefabParentObject: {fileID: 0}
  m_PrefabInternal: {fileID: 0}
  m_GameObject: {fileID: 1500371475}
  m_LocalRotation: {x: 0, y: 0, z: 0, w: 1}
  m_LocalPosition: {x: 0, y: 0, z: 0}
  m_LocalScale: {x: 1, y: 1, z: 1}
  m_Children: []
  m_Father: {fileID: 0}
  m_RootOrder: 1
  m_LocalEulerAnglesHint: {x: 0, y: 0, z: 0}
--- !u!1 &1511305452
GameObject:
  m_ObjectHideFlags: 0
  m_PrefabParentObject: {fileID: 0}
  m_PrefabInternal: {fileID: 0}
  serializedVersion: 5
  m_Component:
  - component: {fileID: 1511305453}
  m_Layer: 0
  m_Name: __SET_YOUR_GAMESCREEN_TO_640x1136
  m_TagString: Untagged
  m_Icon: {fileID: 0}
  m_NavMeshLayer: 0
  m_StaticEditorFlags: 0
  m_IsActive: 1
--- !u!4 &1511305453
Transform:
  m_ObjectHideFlags: 0
  m_PrefabParentObject: {fileID: 0}
  m_PrefabInternal: {fileID: 0}
  m_GameObject: {fileID: 1511305452}
  m_LocalRotation: {x: 0, y: 0, z: 0, w: 1}
  m_LocalPosition: {x: 494.995, y: 627.74, z: 0}
  m_LocalScale: {x: 1, y: 1, z: 1}
  m_Children: []
  m_Father: {fileID: 0}
  m_RootOrder: 2
  m_LocalEulerAnglesHint: {x: 0, y: 0, z: 0}
--- !u!1 &1559918324
GameObject:
  m_ObjectHideFlags: 0
  m_PrefabParentObject: {fileID: 158556, guid: c9de0c641e2673741a4d334e7fbd2e48, type: 2}
  m_PrefabInternal: {fileID: 498307449}
  serializedVersion: 5
  m_Component:
  - component: {fileID: 1559918325}
  - component: {fileID: 1559918327}
  - component: {fileID: 1559918326}
  m_Layer: 5
  m_Name: Text
  m_TagString: Untagged
  m_Icon: {fileID: 0}
  m_NavMeshLayer: 0
  m_StaticEditorFlags: 0
  m_IsActive: 1
--- !u!224 &1559918325
RectTransform:
  m_ObjectHideFlags: 0
  m_PrefabParentObject: {fileID: 22458556, guid: c9de0c641e2673741a4d334e7fbd2e48,
    type: 2}
  m_PrefabInternal: {fileID: 498307449}
  m_GameObject: {fileID: 1559918324}
  m_LocalRotation: {x: 0, y: 0, z: 0, w: 1}
  m_LocalPosition: {x: 0, y: 0, z: 0}
  m_LocalScale: {x: 1, y: 1, z: 1}
  m_Children: []
  m_Father: {fileID: 976205640}
  m_RootOrder: 0
  m_LocalEulerAnglesHint: {x: 0, y: 0, z: 0}
  m_AnchorMin: {x: 0.5, y: 0.5}
  m_AnchorMax: {x: 0.5, y: 0.5}
  m_AnchoredPosition: {x: 0, y: 0}
  m_SizeDelta: {x: 362, y: 158}
  m_Pivot: {x: 0.5, y: 0.5}
--- !u!114 &1559918326
MonoBehaviour:
  m_ObjectHideFlags: 0
  m_PrefabParentObject: {fileID: 11458558, guid: c9de0c641e2673741a4d334e7fbd2e48,
    type: 2}
  m_PrefabInternal: {fileID: 498307449}
  m_GameObject: {fileID: 1559918324}
  m_Enabled: 1
  m_EditorHideFlags: 0
  m_Script: {fileID: 708705254, guid: f5f67c52d1564df4a8936ccd202a3bd8, type: 3}
  m_Name: 
  m_EditorClassIdentifier: 
  m_Material: {fileID: 0}
  m_Color: {r: 1, g: 0.903572, b: 0.6764706, a: 1}
  m_RaycastTarget: 1
  m_OnCullStateChanged:
    m_PersistentCalls:
      m_Calls: []
    m_TypeName: UnityEngine.UI.MaskableGraphic+CullStateChangedEvent, UnityEngine.UI,
      Version=1.0.0.0, Culture=neutral, PublicKeyToken=null
  m_FontData:
    m_Font: {fileID: 12800000, guid: 218956a5c2a6e42d6a60afccf80b002b, type: 3}
    m_FontSize: 115
    m_FontStyle: 0
    m_BestFit: 0
    m_MinSize: 10
    m_MaxSize: 115
    m_Alignment: 4
    m_AlignByGeometry: 0
    m_RichText: 1
    m_HorizontalOverflow: 0
    m_VerticalOverflow: 0
    m_LineSpacing: 1
  m_Text: 14:36
--- !u!222 &1559918327
CanvasRenderer:
  m_ObjectHideFlags: 0
  m_PrefabParentObject: {fileID: 22258554, guid: c9de0c641e2673741a4d334e7fbd2e48,
    type: 2}
  m_PrefabInternal: {fileID: 498307449}
  m_GameObject: {fileID: 1559918324}
--- !u!1 &1682852849
GameObject:
  m_ObjectHideFlags: 0
  m_PrefabParentObject: {fileID: 158566, guid: c9de0c641e2673741a4d334e7fbd2e48, type: 2}
  m_PrefabInternal: {fileID: 498307449}
  serializedVersion: 5
  m_Component:
  - component: {fileID: 1682852850}
  - component: {fileID: 1682852852}
  - component: {fileID: 1682852851}
  m_Layer: 5
  m_Name: Panel
  m_TagString: Untagged
  m_Icon: {fileID: 0}
  m_NavMeshLayer: 0
  m_StaticEditorFlags: 0
  m_IsActive: 1
--- !u!224 &1682852850
RectTransform:
  m_ObjectHideFlags: 0
  m_PrefabParentObject: {fileID: 22458566, guid: c9de0c641e2673741a4d334e7fbd2e48,
    type: 2}
  m_PrefabInternal: {fileID: 498307449}
  m_GameObject: {fileID: 1682852849}
  m_LocalRotation: {x: 0, y: 0, z: 0.38268292, w: 0.92387974}
  m_LocalPosition: {x: 0, y: 0, z: 0}
  m_LocalScale: {x: 1, y: 1, z: 1}
  m_Children: []
  m_Father: {fileID: 216789161}
  m_RootOrder: 0
  m_LocalEulerAnglesHint: {x: 0, y: 0, z: 0}
  m_AnchorMin: {x: 0.5, y: 0.5}
  m_AnchorMax: {x: 0.5, y: 0.5}
  m_AnchoredPosition: {x: -151.25, y: 141.2}
  m_SizeDelta: {x: 254, y: 14}
  m_Pivot: {x: 0.5, y: 0.5}
--- !u!114 &1682852851
MonoBehaviour:
  m_ObjectHideFlags: 0
  m_PrefabParentObject: {fileID: 11458568, guid: c9de0c641e2673741a4d334e7fbd2e48,
    type: 2}
  m_PrefabInternal: {fileID: 498307449}
  m_GameObject: {fileID: 1682852849}
  m_Enabled: 1
  m_EditorHideFlags: 0
  m_Script: {fileID: -765806418, guid: f5f67c52d1564df4a8936ccd202a3bd8, type: 3}
  m_Name: 
  m_EditorClassIdentifier: 
  m_Material: {fileID: 0}
  m_Color: {r: 1, g: 0.32352942, b: 0.39350888, a: 1}
  m_RaycastTarget: 1
  m_OnCullStateChanged:
    m_PersistentCalls:
      m_Calls: []
    m_TypeName: UnityEngine.UI.MaskableGraphic+CullStateChangedEvent, UnityEngine.UI,
      Version=1.0.0.0, Culture=neutral, PublicKeyToken=null
  m_Sprite: {fileID: 21300000, guid: 7ed1238760b863f4aafde32ab3a6f28c, type: 3}
  m_Type: 1
  m_PreserveAspect: 0
  m_FillCenter: 1
  m_FillMethod: 4
  m_FillAmount: 1
  m_FillClockwise: 1
  m_FillOrigin: 0
--- !u!222 &1682852852
CanvasRenderer:
  m_ObjectHideFlags: 0
  m_PrefabParentObject: {fileID: 22258564, guid: c9de0c641e2673741a4d334e7fbd2e48,
    type: 2}
  m_PrefabInternal: {fileID: 498307449}
  m_GameObject: {fileID: 1682852849}
--- !u!1 &1950878576
GameObject:
  m_ObjectHideFlags: 0
  m_PrefabParentObject: {fileID: 158576, guid: c9de0c641e2673741a4d334e7fbd2e48, type: 2}
  m_PrefabInternal: {fileID: 498307449}
  serializedVersion: 5
  m_Component:
  - component: {fileID: 1950878577}
  - component: {fileID: 1950878580}
  - component: {fileID: 1950878579}
  - component: {fileID: 1950878578}
  m_Layer: 5
  m_Name: Panel
  m_TagString: Untagged
  m_Icon: {fileID: 0}
  m_NavMeshLayer: 0
  m_StaticEditorFlags: 0
  m_IsActive: 1
--- !u!224 &1950878577
RectTransform:
  m_ObjectHideFlags: 0
  m_PrefabParentObject: {fileID: 22458576, guid: c9de0c641e2673741a4d334e7fbd2e48,
    type: 2}
  m_PrefabInternal: {fileID: 498307449}
  m_GameObject: {fileID: 1950878576}
  m_LocalRotation: {x: 0, y: 0, z: 0, w: 1}
  m_LocalPosition: {x: 0, y: 0, z: 0}
  m_LocalScale: {x: 1, y: 1, z: 1}
  m_Children:
  - {fileID: 976205640}
  - {fileID: 1233608512}
  - {fileID: 213733846}
  - {fileID: 216789161}
  m_Father: {fileID: 1343329922}
  m_RootOrder: 1
  m_LocalEulerAnglesHint: {x: 0, y: 0, z: 0}
  m_AnchorMin: {x: 0.5, y: 0.5}
  m_AnchorMax: {x: 0.5, y: 0.5}
  m_AnchoredPosition: {x: 0, y: -0.020019531}
  m_SizeDelta: {x: 640, y: 1136}
  m_Pivot: {x: 0.5, y: 0.5}
--- !u!114 &1950878578
MonoBehaviour:
  m_ObjectHideFlags: 0
  m_PrefabParentObject: {fileID: 11458578, guid: c9de0c641e2673741a4d334e7fbd2e48,
    type: 2}
  m_PrefabInternal: {fileID: 498307449}
  m_GameObject: {fileID: 1950878576}
  m_Enabled: 1
  m_EditorHideFlags: 0
  m_Script: {fileID: -1200242548, guid: f5f67c52d1564df4a8936ccd202a3bd8, type: 3}
  m_Name: 
  m_EditorClassIdentifier: 
  m_ShowMaskGraphic: 1
--- !u!114 &1950878579
MonoBehaviour:
  m_ObjectHideFlags: 0
  m_PrefabParentObject: {fileID: 11458580, guid: c9de0c641e2673741a4d334e7fbd2e48,
    type: 2}
  m_PrefabInternal: {fileID: 498307449}
  m_GameObject: {fileID: 1950878576}
  m_Enabled: 1
  m_EditorHideFlags: 0
  m_Script: {fileID: -765806418, guid: f5f67c52d1564df4a8936ccd202a3bd8, type: 3}
  m_Name: 
  m_EditorClassIdentifier: 
  m_Material: {fileID: 0}
  m_Color: {r: 0.2794118, g: 0.2794118, b: 0.2794118, a: 1}
  m_RaycastTarget: 1
  m_OnCullStateChanged:
    m_PersistentCalls:
      m_Calls: []
    m_TypeName: UnityEngine.UI.MaskableGraphic+CullStateChangedEvent, UnityEngine.UI,
      Version=1.0.0.0, Culture=neutral, PublicKeyToken=null
  m_Sprite: {fileID: 21300000, guid: 7ed1238760b863f4aafde32ab3a6f28c, type: 3}
  m_Type: 1
  m_PreserveAspect: 0
  m_FillCenter: 1
  m_FillMethod: 4
  m_FillAmount: 1
  m_FillClockwise: 1
  m_FillOrigin: 0
--- !u!222 &1950878580
CanvasRenderer:
  m_ObjectHideFlags: 0
  m_PrefabParentObject: {fileID: 22258574, guid: c9de0c641e2673741a4d334e7fbd2e48,
    type: 2}
  m_PrefabInternal: {fileID: 498307449}
  m_GameObject: {fileID: 1950878576}
--- !u!1 &1978064910
GameObject:
  m_ObjectHideFlags: 0
  m_PrefabParentObject: {fileID: 158564, guid: c9de0c641e2673741a4d334e7fbd2e48, type: 2}
  m_PrefabInternal: {fileID: 498307449}
  serializedVersion: 5
  m_Component:
  - component: {fileID: 1978064911}
  - component: {fileID: 1978064913}
  - component: {fileID: 1978064912}
  m_Layer: 5
  m_Name: Panel
  m_TagString: Untagged
  m_Icon: {fileID: 0}
  m_NavMeshLayer: 0
  m_StaticEditorFlags: 0
  m_IsActive: 1
--- !u!224 &1978064911
RectTransform:
  m_ObjectHideFlags: 0
  m_PrefabParentObject: {fileID: 22458564, guid: c9de0c641e2673741a4d334e7fbd2e48,
    type: 2}
  m_PrefabInternal: {fileID: 498307449}
  m_GameObject: {fileID: 1978064910}
  m_LocalRotation: {x: 0, y: 0, z: 0.38268292, w: 0.92387974}
  m_LocalPosition: {x: 0, y: 0, z: 0}
  m_LocalScale: {x: 1, y: 1, z: 1}
  m_Children: []
  m_Father: {fileID: 216789161}
  m_RootOrder: 4
  m_LocalEulerAnglesHint: {x: 0, y: 0, z: 0}
  m_AnchorMin: {x: 0.5, y: 0.5}
  m_AnchorMax: {x: 0.5, y: 0.5}
  m_AnchoredPosition: {x: 234.65, y: 5.700012}
  m_SizeDelta: {x: 325.5, y: 12}
  m_Pivot: {x: 0.5, y: 0.5}
--- !u!114 &1978064912
MonoBehaviour:
  m_ObjectHideFlags: 0
  m_PrefabParentObject: {fileID: 11458566, guid: c9de0c641e2673741a4d334e7fbd2e48,
    type: 2}
  m_PrefabInternal: {fileID: 498307449}
  m_GameObject: {fileID: 1978064910}
  m_Enabled: 1
  m_EditorHideFlags: 0
  m_Script: {fileID: -765806418, guid: f5f67c52d1564df4a8936ccd202a3bd8, type: 3}
  m_Name: 
  m_EditorClassIdentifier: 
  m_Material: {fileID: 0}
  m_Color: {r: 1, g: 0.32352942, b: 0.39350888, a: 1}
  m_RaycastTarget: 1
  m_OnCullStateChanged:
    m_PersistentCalls:
      m_Calls: []
    m_TypeName: UnityEngine.UI.MaskableGraphic+CullStateChangedEvent, UnityEngine.UI,
      Version=1.0.0.0, Culture=neutral, PublicKeyToken=null
  m_Sprite: {fileID: 21300000, guid: 7ed1238760b863f4aafde32ab3a6f28c, type: 3}
  m_Type: 1
  m_PreserveAspect: 0
  m_FillCenter: 1
  m_FillMethod: 4
  m_FillAmount: 1
  m_FillClockwise: 1
  m_FillOrigin: 0
--- !u!222 &1978064913
CanvasRenderer:
  m_ObjectHideFlags: 0
  m_PrefabParentObject: {fileID: 22258562, guid: c9de0c641e2673741a4d334e7fbd2e48,
    type: 2}
  m_PrefabInternal: {fileID: 498307449}
  m_GameObject: {fileID: 1978064910}
--- !u!1 &2079183027
GameObject:
  m_ObjectHideFlags: 0
  m_PrefabParentObject: {fileID: 158558, guid: c9de0c641e2673741a4d334e7fbd2e48, type: 2}
  m_PrefabInternal: {fileID: 498307449}
  serializedVersion: 5
  m_Component:
  - component: {fileID: 2079183028}
  - component: {fileID: 2079183030}
  - component: {fileID: 2079183029}
  m_Layer: 5
  m_Name: Text
  m_TagString: Untagged
  m_Icon: {fileID: 0}
  m_NavMeshLayer: 0
  m_StaticEditorFlags: 0
  m_IsActive: 1
--- !u!224 &2079183028
RectTransform:
  m_ObjectHideFlags: 0
  m_PrefabParentObject: {fileID: 22458558, guid: c9de0c641e2673741a4d334e7fbd2e48,
    type: 2}
  m_PrefabInternal: {fileID: 498307449}
  m_GameObject: {fileID: 2079183027}
  m_LocalRotation: {x: 0, y: 0, z: 0, w: 1}
  m_LocalPosition: {x: 0, y: 0, z: 0}
  m_LocalScale: {x: 1, y: 1, z: 1}
  m_Children: []
  m_Father: {fileID: 213733846}
  m_RootOrder: 0
  m_LocalEulerAnglesHint: {x: 0, y: 0, z: 0}
  m_AnchorMin: {x: 0.5, y: 0.5}
  m_AnchorMax: {x: 0.5, y: 0.5}
  m_AnchoredPosition: {x: 0, y: 0}
  m_SizeDelta: {x: 362, y: 158}
  m_Pivot: {x: 0.5, y: 0.5}
--- !u!114 &2079183029
MonoBehaviour:
  m_ObjectHideFlags: 0
  m_PrefabParentObject: {fileID: 11458560, guid: c9de0c641e2673741a4d334e7fbd2e48,
    type: 2}
  m_PrefabInternal: {fileID: 498307449}
  m_GameObject: {fileID: 2079183027}
  m_Enabled: 1
  m_EditorHideFlags: 0
  m_Script: {fileID: 708705254, guid: f5f67c52d1564df4a8936ccd202a3bd8, type: 3}
  m_Name: 
  m_EditorClassIdentifier: 
  m_Material: {fileID: 0}
  m_Color: {r: 0.6784314, g: 0.21816224, b: 0.26431727, a: 1}
  m_RaycastTarget: 1
  m_OnCullStateChanged:
    m_PersistentCalls:
      m_Calls: []
    m_TypeName: UnityEngine.UI.MaskableGraphic+CullStateChangedEvent, UnityEngine.UI,
      Version=1.0.0.0, Culture=neutral, PublicKeyToken=null
  m_FontData:
    m_Font: {fileID: 12800000, guid: 218956a5c2a6e42d6a60afccf80b002b, type: 3}
    m_FontSize: 60
    m_FontStyle: 0
    m_BestFit: 0
    m_MinSize: 10
    m_MaxSize: 60
    m_Alignment: 4
    m_AlignByGeometry: 0
    m_RichText: 1
    m_HorizontalOverflow: 0
    m_VerticalOverflow: 0
    m_LineSpacing: 1
  m_Text: TAP IN 1.26s
--- !u!222 &2079183030
CanvasRenderer:
  m_ObjectHideFlags: 0
  m_PrefabParentObject: {fileID: 22258556, guid: c9de0c641e2673741a4d334e7fbd2e48,
    type: 2}
  m_PrefabInternal: {fileID: 498307449}
  m_GameObject: {fileID: 2079183027}
