%YAML 1.1
%TAG !u! tag:unity3d.com,2011:
--- !u!21 &2100000
Material:
  serializedVersion: 6
  m_ObjectHideFlags: 0
  m_PrefabParentObject: {fileID: 0}
  m_PrefabInternal: {fileID: 0}
  m_Name: Mapping Preview
  m_Shader: {fileID: 4800000, guid: 2c12e887f28b27b439213e8d4264ae49, type: 3}
  m_ShaderKeywords: _EMISSIVEMAINTEX_ON _SEGMENTED_ON
  m_LightmapFlags: 4
  m_EnableInstancingVariants: 0
  m_CustomRenderQueue: -1
  stringTagMap: {}
  disabledShaderPasses: []
  m_SavedProperties:
    serializedVersion: 3
    m_TexEnvs:
    - _DetailNormalMap:
        m_Texture: {fileID: 0}
        m_Scale: {x: 1, y: 1}
        m_Offset: {x: 0, y: 0}
    - _Heightmap:
        m_Texture: {fileID: 2800000, guid: b3d0aa081e67fa245b49112c460c8ac2, type: 3}
        m_Scale: {x: 1, y: 1}
        m_Offset: {x: 0, y: 0}
    - _MainTex:
        m_Texture: {fileID: 2800000, guid: c67456ece1a4d7a4a8284de6042389f6, type: 3}
        m_Scale: {x: 1, y: 1}
        m_Offset: {x: 0, y: 0}
    - _MainTexture:
        m_Texture: {fileID: 2800000, guid: b3d0aa081e67fa245b49112c460c8ac2, type: 3}
        m_Scale: {x: 1, y: 1}
        m_Offset: {x: 0, y: 0}
    m_Floats:
    - _Alpha: 0
    - _Bias: 0
    - _BumpStrength: 0.4419884
    - _ColorGradingIntensity: 0.60714287
    - _Cutoff: 0.5
    - _EmissiveMainTex: 1
    - _Intensity: 1
    - _Lighting: 0
    - _LineWidth: 0.002
    - _ProgressSlider: 0.6964286
    - _SegmentWidth: 0.6785714
    - _Segmented: 1
    - _SmoothMap: 2.6
    - _StepCount: 6
    - _Steps: 10
    m_Colors:
    - _BackgroundColor: {r: 0.9191176, g: 0.892178, b: 0.8042279, a: 1}
    - _Color: {r: 1, g: 1, b: 1, a: 1}
    - _Color1: {r: 0, g: 1, b: 0, a: 1}
    - _Color2: {r: 0.8014706, g: 0.8014706, b: 0, a: 1}
    - _Color3: {r: 1, g: 0, b: 0, a: 1}
