%YAML 1.1
%TAG !u! tag:unity3d.com,2011:
--- !u!29 &1
OcclusionCullingSettings:
  m_ObjectHideFlags: 0
  serializedVersion: 2
  m_OcclusionBakeSettings:
    smallestOccluder: 5
    smallestHole: 0.25
    backfaceThreshold: 100
  m_SceneGUID: 00000000000000000000000000000000
  m_OcclusionCullingData: {fileID: 0}
--- !u!104 &2
RenderSettings:
  m_ObjectHideFlags: 0
  serializedVersion: 8
  m_Fog: 0
  m_FogColor: {r: 0.5, g: 0.5, b: 0.5, a: 1}
  m_FogMode: 3
  m_FogDensity: 0.01
  m_LinearFogStart: 0
  m_LinearFogEnd: 300
  m_AmbientSkyColor: {r: 0.212, g: 0.227, b: 0.259, a: 1}
  m_AmbientEquatorColor: {r: 0.114, g: 0.125, b: 0.133, a: 1}
  m_AmbientGroundColor: {r: 0.047, g: 0.043, b: 0.035, a: 1}
  m_AmbientIntensity: 1
  m_AmbientMode: 0
  m_SubtractiveShadowColor: {r: 0.42, g: 0.478, b: 0.627, a: 1}
  m_SkyboxMaterial: {fileID: 10304, guid: 0000000000000000f000000000000000, type: 0}
  m_HaloStrength: 0.5
  m_FlareStrength: 1
  m_FlareFadeSpeed: 3
  m_HaloTexture: {fileID: 0}
  m_SpotCookie: {fileID: 10001, guid: 0000000000000000e000000000000000, type: 0}
  m_DefaultReflectionMode: 0
  m_DefaultReflectionResolution: 128
  m_ReflectionBounces: 1
  m_ReflectionIntensity: 1
  m_CustomReflection: {fileID: 0}
  m_Sun: {fileID: 0}
  m_IndirectSpecularColor: {r: 0, g: 0, b: 0, a: 1}
--- !u!157 &4
LightmapSettings:
  m_ObjectHideFlags: 0
  serializedVersion: 9
  m_GIWorkflowMode: 0
  m_GISettings:
    serializedVersion: 2
    m_BounceScale: 1
    m_IndirectOutputScale: 1
    m_AlbedoBoost: 1
    m_TemporalCoherenceThreshold: 1
    m_EnvironmentLightingMode: 0
    m_EnableBakedLightmaps: 1
    m_EnableRealtimeLightmaps: 1
  m_LightmapEditorSettings:
    serializedVersion: 8
    m_Resolution: 2
    m_BakeResolution: 40
    m_TextureWidth: 1024
    m_TextureHeight: 1024
    m_AO: 0
    m_AOMaxDistance: 1
    m_CompAOExponent: 0
    m_CompAOExponentDirect: 0
    m_Padding: 2
    m_LightmapParameters: {fileID: 0}
    m_LightmapsBakeMode: 1
    m_TextureCompression: 1
    m_FinalGather: 0
    m_FinalGatherFiltering: 1
    m_FinalGatherRayCount: 1024
    m_ReflectionCompression: 2
    m_MixedBakeMode: 1
    m_BakeBackend: 0
    m_PVRSampling: 1
    m_PVRDirectSampleCount: 32
    m_PVRSampleCount: 500
    m_PVRBounces: 2
    m_PVRFiltering: 0
    m_PVRFilteringMode: 1
    m_PVRCulling: 1
    m_PVRFilteringGaussRadiusDirect: 1
    m_PVRFilteringGaussRadiusIndirect: 5
    m_PVRFilteringGaussRadiusAO: 2
    m_PVRFilteringAtrousColorSigma: 1
    m_PVRFilteringAtrousNormalSigma: 1
    m_PVRFilteringAtrousPositionSigma: 1
  m_LightingDataAsset: {fileID: 0}
  m_ShadowMaskMode: 2
--- !u!196 &5
NavMeshSettings:
  serializedVersion: 2
  m_ObjectHideFlags: 0
  m_BuildSettings:
    serializedVersion: 2
    agentTypeID: 0
    agentRadius: 0.5
    agentHeight: 2
    agentSlope: 45
    agentClimb: 0.4
    ledgeDropHeight: 0
    maxJumpAcrossDistance: 0
    minRegionArea: 2
    manualCellSize: 0
    cellSize: 0.16666667
    manualTileSize: 0
    tileSize: 256
    accuratePlacement: 0
  m_NavMeshData: {fileID: 0}
--- !u!1 &844907
GameObject:
  m_ObjectHideFlags: 0
  m_PrefabParentObject: {fileID: 132468, guid: a023f0b31d500a3499bda65871fd2ed2, type: 2}
  m_PrefabInternal: {fileID: 1023513351}
  serializedVersion: 5
  m_Component:
  - component: {fileID: 844908}
  - component: {fileID: 844910}
  - component: {fileID: 844909}
  m_Layer: 5
  m_Name: Image
  m_TagString: Untagged
  m_Icon: {fileID: 0}
  m_NavMeshLayer: 0
  m_StaticEditorFlags: 0
  m_IsActive: 1
--- !u!224 &844908
RectTransform:
  m_ObjectHideFlags: 0
  m_PrefabParentObject: {fileID: 22432468, guid: a023f0b31d500a3499bda65871fd2ed2,
    type: 2}
  m_PrefabInternal: {fileID: 1023513351}
  m_GameObject: {fileID: 844907}
  m_LocalRotation: {x: 0, y: 0, z: 0, w: 1}
  m_LocalPosition: {x: 0, y: 0, z: 0}
  m_LocalScale: {x: 1, y: 1, z: 1}
  m_Children: []
  m_Father: {fileID: 1952165858}
  m_RootOrder: 1
  m_LocalEulerAnglesHint: {x: 0, y: 0, z: 0}
  m_AnchorMin: {x: 0.5, y: 0.5}
  m_AnchorMax: {x: 0.5, y: 0.5}
  m_AnchoredPosition: {x: -74, y: 0}
  m_SizeDelta: {x: 100, y: 100}
  m_Pivot: {x: 0.5, y: 0.5}
--- !u!114 &844909
MonoBehaviour:
  m_ObjectHideFlags: 0
  m_PrefabParentObject: {fileID: 11432488, guid: a023f0b31d500a3499bda65871fd2ed2,
    type: 2}
  m_PrefabInternal: {fileID: 1023513351}
  m_GameObject: {fileID: 844907}
  m_Enabled: 1
  m_EditorHideFlags: 0
  m_Script: {fileID: -765806418, guid: f5f67c52d1564df4a8936ccd202a3bd8, type: 3}
  m_Name: 
  m_EditorClassIdentifier: 
  m_Material: {fileID: 0}
  m_Color: {r: 1, g: 1, b: 1, a: 1}
  m_RaycastTarget: 1
  m_OnCullStateChanged:
    m_PersistentCalls:
      m_Calls: []
    m_TypeName: UnityEngine.UI.MaskableGraphic+CullStateChangedEvent, UnityEngine.UI,
      Version=1.0.0.0, Culture=neutral, PublicKeyToken=null
  m_Sprite: {fileID: 21300000, guid: 79465b05b9f8f6f4ebcf724e166deedb, type: 3}
  m_Type: 0
  m_PreserveAspect: 0
  m_FillCenter: 1
  m_FillMethod: 4
  m_FillAmount: 1
  m_FillClockwise: 1
  m_FillOrigin: 0
--- !u!222 &844910
CanvasRenderer:
  m_ObjectHideFlags: 0
  m_PrefabParentObject: {fileID: 22232468, guid: a023f0b31d500a3499bda65871fd2ed2,
    type: 2}
  m_PrefabInternal: {fileID: 1023513351}
  m_GameObject: {fileID: 844907}
--- !u!1 &380690933
GameObject:
  m_ObjectHideFlags: 0
  m_PrefabParentObject: {fileID: 132430, guid: a023f0b31d500a3499bda65871fd2ed2, type: 2}
  m_PrefabInternal: {fileID: 1023513351}
  serializedVersion: 5
  m_Component:
  - component: {fileID: 380690934}
  - component: {fileID: 380690936}
  - component: {fileID: 380690935}
  m_Layer: 5
  m_Name: AppTitle
  m_TagString: Untagged
  m_Icon: {fileID: 0}
  m_NavMeshLayer: 0
  m_StaticEditorFlags: 0
  m_IsActive: 1
--- !u!224 &380690934
RectTransform:
  m_ObjectHideFlags: 0
  m_PrefabParentObject: {fileID: 22432430, guid: a023f0b31d500a3499bda65871fd2ed2,
    type: 2}
  m_PrefabInternal: {fileID: 1023513351}
  m_GameObject: {fileID: 380690933}
  m_LocalRotation: {x: 0, y: 0, z: 0, w: 1}
  m_LocalPosition: {x: 0, y: 0, z: 0}
  m_LocalScale: {x: 1, y: 1, z: 1}
  m_Children: []
  m_Father: {fileID: 1060986982}
  m_RootOrder: 0
  m_LocalEulerAnglesHint: {x: 0, y: 0, z: 0}
  m_AnchorMin: {x: 0.5, y: 0.5}
  m_AnchorMax: {x: 0.5, y: 0.5}
  m_AnchoredPosition: {x: 0, y: -86}
  m_SizeDelta: {x: 695, y: 67}
  m_Pivot: {x: 0.5, y: 0.5}
--- !u!114 &380690935
MonoBehaviour:
  m_ObjectHideFlags: 0
  m_PrefabParentObject: {fileID: 11432442, guid: a023f0b31d500a3499bda65871fd2ed2,
    type: 2}
  m_PrefabInternal: {fileID: 1023513351}
  m_GameObject: {fileID: 380690933}
  m_Enabled: 1
  m_EditorHideFlags: 0
  m_Script: {fileID: 708705254, guid: f5f67c52d1564df4a8936ccd202a3bd8, type: 3}
  m_Name: 
  m_EditorClassIdentifier: 
  m_Material: {fileID: 0}
  m_Color: {r: 0.85490197, g: 0.85490197, b: 0.85490197, a: 1}
  m_RaycastTarget: 1
  m_OnCullStateChanged:
    m_PersistentCalls:
      m_Calls: []
    m_TypeName: UnityEngine.UI.MaskableGraphic+CullStateChangedEvent, UnityEngine.UI,
      Version=1.0.0.0, Culture=neutral, PublicKeyToken=null
  m_FontData:
    m_Font: {fileID: 12800000, guid: 218956a5c2a6e42d6a60afccf80b002b, type: 3}
    m_FontSize: 40
    m_FontStyle: 0
    m_BestFit: 0
    m_MinSize: 10
    m_MaxSize: 40
    m_Alignment: 0
    m_AlignByGeometry: 0
    m_RichText: 1
    m_HorizontalOverflow: 0
    m_VerticalOverflow: 1
    m_LineSpacing: 1
  m_Text: APP SAMPLE
--- !u!222 &380690936
CanvasRenderer:
  m_ObjectHideFlags: 0
  m_PrefabParentObject: {fileID: 22232430, guid: a023f0b31d500a3499bda65871fd2ed2,
    type: 2}
  m_PrefabInternal: {fileID: 1023513351}
  m_GameObject: {fileID: 380690933}
--- !u!1 &395390381
GameObject:
  m_ObjectHideFlags: 0
  m_PrefabParentObject: {fileID: 132456, guid: a023f0b31d500a3499bda65871fd2ed2, type: 2}
  m_PrefabInternal: {fileID: 1023513351}
  serializedVersion: 5
  m_Component:
  - component: {fileID: 395390382}
  - component: {fileID: 395390385}
  - component: {fileID: 395390384}
  - component: {fileID: 395390383}
  m_Layer: 5
  m_Name: Button
  m_TagString: Untagged
  m_Icon: {fileID: 0}
  m_NavMeshLayer: 0
  m_StaticEditorFlags: 0
  m_IsActive: 1
--- !u!224 &395390382
RectTransform:
  m_ObjectHideFlags: 0
  m_PrefabParentObject: {fileID: 22432456, guid: a023f0b31d500a3499bda65871fd2ed2,
    type: 2}
  m_PrefabInternal: {fileID: 1023513351}
  m_GameObject: {fileID: 395390381}
  m_LocalRotation: {x: 0, y: 0, z: 0, w: 1}
  m_LocalPosition: {x: 0, y: 0, z: 0}
  m_LocalScale: {x: 1, y: 1, z: 1}
  m_Children: []
  m_Father: {fileID: 1517797653}
  m_RootOrder: 0
  m_LocalEulerAnglesHint: {x: 0, y: 0, z: 0}
  m_AnchorMin: {x: 0.5, y: 0.5}
  m_AnchorMax: {x: 0.5, y: 0.5}
  m_AnchoredPosition: {x: 0.000030517578, y: 0}
  m_SizeDelta: {x: 40.8, y: 34.8}
  m_Pivot: {x: 0.5, y: 0.5}
--- !u!114 &395390383
MonoBehaviour:
  m_ObjectHideFlags: 0
  m_PrefabParentObject: {fileID: 11432474, guid: a023f0b31d500a3499bda65871fd2ed2,
    type: 2}
  m_PrefabInternal: {fileID: 1023513351}
  m_GameObject: {fileID: 395390381}
  m_Enabled: 1
  m_EditorHideFlags: 0
  m_Script: {fileID: 1392445389, guid: f5f67c52d1564df4a8936ccd202a3bd8, type: 3}
  m_Name: 
  m_EditorClassIdentifier: 
  m_Navigation:
    m_Mode: 3
    m_SelectOnUp: {fileID: 0}
    m_SelectOnDown: {fileID: 0}
    m_SelectOnLeft: {fileID: 0}
    m_SelectOnRight: {fileID: 0}
  m_Transition: 1
  m_Colors:
    m_NormalColor: {r: 1, g: 1, b: 1, a: 1}
    m_HighlightedColor: {r: 0.9607843, g: 0.9607843, b: 0.9607843, a: 1}
    m_PressedColor: {r: 0.78431374, g: 0.78431374, b: 0.78431374, a: 1}
    m_DisabledColor: {r: 0.78431374, g: 0.78431374, b: 0.78431374, a: 0.5019608}
    m_ColorMultiplier: 1
    m_FadeDuration: 0.1
  m_SpriteState:
    m_HighlightedSprite: {fileID: 0}
    m_PressedSprite: {fileID: 0}
    m_DisabledSprite: {fileID: 0}
  m_AnimationTriggers:
    m_NormalTrigger: Normal
    m_HighlightedTrigger: Highlighted
    m_PressedTrigger: Pressed
    m_DisabledTrigger: Disabled
  m_Interactable: 1
  m_TargetGraphic: {fileID: 395390384}
  m_OnClick:
    m_PersistentCalls:
      m_Calls: []
    m_TypeName: UnityEngine.UI.Button+ButtonClickedEvent, UnityEngine.UI, Version=1.0.0.0,
      Culture=neutral, PublicKeyToken=null
--- !u!114 &395390384
MonoBehaviour:
  m_ObjectHideFlags: 0
  m_PrefabParentObject: {fileID: 11432476, guid: a023f0b31d500a3499bda65871fd2ed2,
    type: 2}
  m_PrefabInternal: {fileID: 1023513351}
  m_GameObject: {fileID: 395390381}
  m_Enabled: 1
  m_EditorHideFlags: 0
  m_Script: {fileID: -765806418, guid: f5f67c52d1564df4a8936ccd202a3bd8, type: 3}
  m_Name: 
  m_EditorClassIdentifier: 
  m_Material: {fileID: 0}
  m_Color: {r: 1, g: 1, b: 1, a: 0.827451}
  m_RaycastTarget: 1
  m_OnCullStateChanged:
    m_PersistentCalls:
      m_Calls: []
    m_TypeName: UnityEngine.UI.MaskableGraphic+CullStateChangedEvent, UnityEngine.UI,
      Version=1.0.0.0, Culture=neutral, PublicKeyToken=null
  m_Sprite: {fileID: 21300000, guid: 8fa6c013eb48a4ee1a581ae0c6921a3a, type: 3}
  m_Type: 0
  m_PreserveAspect: 0
  m_FillCenter: 1
  m_FillMethod: 4
  m_FillAmount: 1
  m_FillClockwise: 1
  m_FillOrigin: 0
--- !u!222 &395390385
CanvasRenderer:
  m_ObjectHideFlags: 0
  m_PrefabParentObject: {fileID: 22232456, guid: a023f0b31d500a3499bda65871fd2ed2,
    type: 2}
  m_PrefabInternal: {fileID: 1023513351}
  m_GameObject: {fileID: 395390381}
--- !u!1 &485226792
GameObject:
  m_ObjectHideFlags: 0
  m_PrefabParentObject: {fileID: 132424, guid: a023f0b31d500a3499bda65871fd2ed2, type: 2}
  m_PrefabInternal: {fileID: 1023513351}
  serializedVersion: 5
  m_Component:
  - component: {fileID: 485226793}
  - component: {fileID: 485226795}
  - component: {fileID: 485226794}
  m_Layer: 5
  m_Name: FocusPanel
  m_TagString: Untagged
  m_Icon: {fileID: 0}
  m_NavMeshLayer: 0
  m_StaticEditorFlags: 0
  m_IsActive: 1
--- !u!224 &485226793
RectTransform:
  m_ObjectHideFlags: 0
  m_PrefabParentObject: {fileID: 22432424, guid: a023f0b31d500a3499bda65871fd2ed2,
    type: 2}
  m_PrefabInternal: {fileID: 1023513351}
  m_GameObject: {fileID: 485226792}
  m_LocalRotation: {x: 0, y: 0, z: 0, w: 1}
  m_LocalPosition: {x: 0, y: 0, z: 0}
  m_LocalScale: {x: 1, y: 1, z: 1}
  m_Children: []
  m_Father: {fileID: 1350804767}
  m_RootOrder: 0
  m_LocalEulerAnglesHint: {x: 0, y: 0, z: 0}
  m_AnchorMin: {x: 0.5, y: 0.5}
  m_AnchorMax: {x: 0.5, y: 0.5}
  m_AnchoredPosition: {x: 0, y: 0}
  m_SizeDelta: {x: 147, y: 147}
  m_Pivot: {x: 0.5, y: 0.5}
--- !u!114 &485226794
MonoBehaviour:
  m_ObjectHideFlags: 0
  m_PrefabParentObject: {fileID: 11432436, guid: a023f0b31d500a3499bda65871fd2ed2,
    type: 2}
  m_PrefabInternal: {fileID: 1023513351}
  m_GameObject: {fileID: 485226792}
  m_Enabled: 1
  m_EditorHideFlags: 0
  m_Script: {fileID: -765806418, guid: f5f67c52d1564df4a8936ccd202a3bd8, type: 3}
  m_Name: 
  m_EditorClassIdentifier: 
  m_Material: {fileID: 0}
  m_Color: {r: 1, g: 0.80689657, b: 0, a: 0.2509804}
  m_RaycastTarget: 1
  m_OnCullStateChanged:
    m_PersistentCalls:
      m_Calls: []
    m_TypeName: UnityEngine.UI.MaskableGraphic+CullStateChangedEvent, UnityEngine.UI,
      Version=1.0.0.0, Culture=neutral, PublicKeyToken=null
  m_Sprite: {fileID: 21300000, guid: 0796c5d7e7e637d40a42ad4deab007c5, type: 3}
  m_Type: 0
  m_PreserveAspect: 0
  m_FillCenter: 1
  m_FillMethod: 4
  m_FillAmount: 1
  m_FillClockwise: 1
  m_FillOrigin: 0
--- !u!222 &485226795
CanvasRenderer:
  m_ObjectHideFlags: 0
  m_PrefabParentObject: {fileID: 22232424, guid: a023f0b31d500a3499bda65871fd2ed2,
    type: 2}
  m_PrefabInternal: {fileID: 1023513351}
  m_GameObject: {fileID: 485226792}
--- !u!1 &538902156
GameObject:
  m_ObjectHideFlags: 0
  m_PrefabParentObject: {fileID: 132448, guid: a023f0b31d500a3499bda65871fd2ed2, type: 2}
  m_PrefabInternal: {fileID: 1023513351}
  serializedVersion: 5
  m_Component:
  - component: {fileID: 538902157}
  - component: {fileID: 538902159}
  - component: {fileID: 538902158}
  m_Layer: 5
  m_Name: Image
  m_TagString: Untagged
  m_Icon: {fileID: 0}
  m_NavMeshLayer: 0
  m_StaticEditorFlags: 0
  m_IsActive: 1
--- !u!224 &538902157
RectTransform:
  m_ObjectHideFlags: 0
  m_PrefabParentObject: {fileID: 22432448, guid: a023f0b31d500a3499bda65871fd2ed2,
    type: 2}
  m_PrefabInternal: {fileID: 1023513351}
  m_GameObject: {fileID: 538902156}
  m_LocalRotation: {x: 0, y: 0, z: 0, w: 1}
  m_LocalPosition: {x: 0, y: 0, z: 0}
  m_LocalScale: {x: 1, y: 1, z: 1}
  m_Children: []
  m_Father: {fileID: 1006562113}
  m_RootOrder: 0
  m_LocalEulerAnglesHint: {x: 0, y: 0, z: 0}
  m_AnchorMin: {x: 0.5, y: 0.5}
  m_AnchorMax: {x: 0.5, y: 0.5}
  m_AnchoredPosition: {x: 0, y: 0}
  m_SizeDelta: {x: 79.2, y: 60.7}
  m_Pivot: {x: 0.5, y: 0.5}
--- !u!114 &538902158
MonoBehaviour:
  m_ObjectHideFlags: 0
  m_PrefabParentObject: {fileID: 11432462, guid: a023f0b31d500a3499bda65871fd2ed2,
    type: 2}
  m_PrefabInternal: {fileID: 1023513351}
  m_GameObject: {fileID: 538902156}
  m_Enabled: 1
  m_EditorHideFlags: 0
  m_Script: {fileID: -765806418, guid: f5f67c52d1564df4a8936ccd202a3bd8, type: 3}
  m_Name: 
  m_EditorClassIdentifier: 
  m_Material: {fileID: 0}
  m_Color: {r: 0.12941177, g: 0.12941177, b: 0.12941177, a: 1}
  m_RaycastTarget: 1
  m_OnCullStateChanged:
    m_PersistentCalls:
      m_Calls: []
    m_TypeName: UnityEngine.UI.MaskableGraphic+CullStateChangedEvent, UnityEngine.UI,
      Version=1.0.0.0, Culture=neutral, PublicKeyToken=null
  m_Sprite: {fileID: 21300000, guid: fbb7c6fda7f9dc34cb37a32605b86785, type: 3}
  m_Type: 0
  m_PreserveAspect: 0
  m_FillCenter: 1
  m_FillMethod: 4
  m_FillAmount: 1
  m_FillClockwise: 1
  m_FillOrigin: 0
--- !u!222 &538902159
CanvasRenderer:
  m_ObjectHideFlags: 0
  m_PrefabParentObject: {fileID: 22232448, guid: a023f0b31d500a3499bda65871fd2ed2,
    type: 2}
  m_PrefabInternal: {fileID: 1023513351}
  m_GameObject: {fileID: 538902156}
--- !u!1 &620711748
GameObject:
  m_ObjectHideFlags: 0
  m_PrefabParentObject: {fileID: 132460, guid: a023f0b31d500a3499bda65871fd2ed2, type: 2}
  m_PrefabInternal: {fileID: 1023513351}
  serializedVersion: 5
  m_Component:
  - component: {fileID: 620711749}
  - component: {fileID: 620711751}
  - component: {fileID: 620711750}
  m_Layer: 5
  m_Name: Image
  m_TagString: Untagged
  m_Icon: {fileID: 0}
  m_NavMeshLayer: 0
  m_StaticEditorFlags: 0
  m_IsActive: 1
--- !u!224 &620711749
RectTransform:
  m_ObjectHideFlags: 0
  m_PrefabParentObject: {fileID: 22432460, guid: a023f0b31d500a3499bda65871fd2ed2,
    type: 2}
  m_PrefabInternal: {fileID: 1023513351}
  m_GameObject: {fileID: 620711748}
  m_LocalRotation: {x: 0, y: 0, z: 0, w: 1}
  m_LocalPosition: {x: 0, y: 0, z: 0}
  m_LocalScale: {x: 1, y: 1, z: 1}
  m_Children: []
  m_Father: {fileID: 1952165858}
  m_RootOrder: 0
  m_LocalEulerAnglesHint: {x: 0, y: 0, z: 0}
  m_AnchorMin: {x: 0.5, y: 0.5}
  m_AnchorMax: {x: 0.5, y: 0.5}
  m_AnchoredPosition: {x: -220, y: 0}
  m_SizeDelta: {x: 100, y: 100}
  m_Pivot: {x: 0.5, y: 0.5}
--- !u!114 &620711750
MonoBehaviour:
  m_ObjectHideFlags: 0
  m_PrefabParentObject: {fileID: 11432480, guid: a023f0b31d500a3499bda65871fd2ed2,
    type: 2}
  m_PrefabInternal: {fileID: 1023513351}
  m_GameObject: {fileID: 620711748}
  m_Enabled: 1
  m_EditorHideFlags: 0
  m_Script: {fileID: -765806418, guid: f5f67c52d1564df4a8936ccd202a3bd8, type: 3}
  m_Name: 
  m_EditorClassIdentifier: 
  m_Material: {fileID: 0}
  m_Color: {r: 1, g: 1, b: 1, a: 1}
  m_RaycastTarget: 1
  m_OnCullStateChanged:
    m_PersistentCalls:
      m_Calls: []
    m_TypeName: UnityEngine.UI.MaskableGraphic+CullStateChangedEvent, UnityEngine.UI,
      Version=1.0.0.0, Culture=neutral, PublicKeyToken=null
  m_Sprite: {fileID: 21300000, guid: e00f25f8f38b371439c4cd475c4f88f7, type: 3}
  m_Type: 0
  m_PreserveAspect: 0
  m_FillCenter: 1
  m_FillMethod: 4
  m_FillAmount: 1
  m_FillClockwise: 1
  m_FillOrigin: 0
--- !u!222 &620711751
CanvasRenderer:
  m_ObjectHideFlags: 0
  m_PrefabParentObject: {fileID: 22232460, guid: a023f0b31d500a3499bda65871fd2ed2,
    type: 2}
  m_PrefabInternal: {fileID: 1023513351}
  m_GameObject: {fileID: 620711748}
--- !u!1 &733084866
GameObject:
  m_ObjectHideFlags: 0
  m_PrefabParentObject: {fileID: 132438, guid: a023f0b31d500a3499bda65871fd2ed2, type: 2}
  m_PrefabInternal: {fileID: 1023513351}
  serializedVersion: 5
  m_Component:
  - component: {fileID: 733084867}
  - component: {fileID: 733084869}
  - component: {fileID: 733084868}
  m_Layer: 5
  m_Name: Image
  m_TagString: Untagged
  m_Icon: {fileID: 0}
  m_NavMeshLayer: 0
  m_StaticEditorFlags: 0
  m_IsActive: 1
--- !u!224 &733084867
RectTransform:
  m_ObjectHideFlags: 0
  m_PrefabParentObject: {fileID: 22432438, guid: a023f0b31d500a3499bda65871fd2ed2,
    type: 2}
  m_PrefabInternal: {fileID: 1023513351}
  m_GameObject: {fileID: 733084866}
  m_LocalRotation: {x: 0, y: 0, z: 0, w: 1}
  m_LocalPosition: {x: 0, y: 0, z: 0}
  m_LocalScale: {x: 1, y: 1, z: 1}
  m_Children: []
  m_Father: {fileID: 1952165858}
  m_RootOrder: 3
  m_LocalEulerAnglesHint: {x: 0, y: 0, z: 0}
  m_AnchorMin: {x: 0.5, y: 0.5}
  m_AnchorMax: {x: 0.5, y: 0.5}
  m_AnchoredPosition: {x: 220, y: 0}
  m_SizeDelta: {x: 100, y: 100}
  m_Pivot: {x: 0.5, y: 0.5}
--- !u!114 &733084868
MonoBehaviour:
  m_ObjectHideFlags: 0
  m_PrefabParentObject: {fileID: 11432452, guid: a023f0b31d500a3499bda65871fd2ed2,
    type: 2}
  m_PrefabInternal: {fileID: 1023513351}
  m_GameObject: {fileID: 733084866}
  m_Enabled: 1
  m_EditorHideFlags: 0
  m_Script: {fileID: -765806418, guid: f5f67c52d1564df4a8936ccd202a3bd8, type: 3}
  m_Name: 
  m_EditorClassIdentifier: 
  m_Material: {fileID: 0}
  m_Color: {r: 1, g: 1, b: 1, a: 1}
  m_RaycastTarget: 1
  m_OnCullStateChanged:
    m_PersistentCalls:
      m_Calls: []
    m_TypeName: UnityEngine.UI.MaskableGraphic+CullStateChangedEvent, UnityEngine.UI,
      Version=1.0.0.0, Culture=neutral, PublicKeyToken=null
  m_Sprite: {fileID: 21300000, guid: 47c7ee9009d9d1145af3db9b96b5109d, type: 3}
  m_Type: 0
  m_PreserveAspect: 0
  m_FillCenter: 1
  m_FillMethod: 4
  m_FillAmount: 1
  m_FillClockwise: 1
  m_FillOrigin: 0
--- !u!222 &733084869
CanvasRenderer:
  m_ObjectHideFlags: 0
  m_PrefabParentObject: {fileID: 22232438, guid: a023f0b31d500a3499bda65871fd2ed2,
    type: 2}
  m_PrefabInternal: {fileID: 1023513351}
  m_GameObject: {fileID: 733084866}
--- !u!1 &737892745
GameObject:
  m_ObjectHideFlags: 0
  m_PrefabParentObject: {fileID: 132432, guid: a023f0b31d500a3499bda65871fd2ed2, type: 2}
  m_PrefabInternal: {fileID: 1023513351}
  serializedVersion: 5
  m_Component:
  - component: {fileID: 737892746}
  - component: {fileID: 737892749}
  - component: {fileID: 737892748}
  - component: {fileID: 737892747}
  m_Layer: 5
  m_Name: Button
  m_TagString: Untagged
  m_Icon: {fileID: 0}
  m_NavMeshLayer: 0
  m_StaticEditorFlags: 0
  m_IsActive: 1
--- !u!224 &737892746
RectTransform:
  m_ObjectHideFlags: 0
  m_PrefabParentObject: {fileID: 22432432, guid: a023f0b31d500a3499bda65871fd2ed2,
    type: 2}
  m_PrefabInternal: {fileID: 1023513351}
  m_GameObject: {fileID: 737892745}
  m_LocalRotation: {x: 0, y: 0, z: 0, w: 1}
  m_LocalPosition: {x: 0, y: 0, z: 0}
  m_LocalScale: {x: 1, y: 1, z: 1}
  m_Children: []
  m_Father: {fileID: 1416674483}
  m_RootOrder: 0
  m_LocalEulerAnglesHint: {x: 0, y: 0, z: 0}
  m_AnchorMin: {x: 0.5, y: 0.5}
  m_AnchorMax: {x: 0.5, y: 0.5}
  m_AnchoredPosition: {x: 0, y: 0}
  m_SizeDelta: {x: 32, y: 57}
  m_Pivot: {x: 0.5, y: 0.5}
--- !u!114 &737892747
MonoBehaviour:
  m_ObjectHideFlags: 0
  m_PrefabParentObject: {fileID: 11432444, guid: a023f0b31d500a3499bda65871fd2ed2,
    type: 2}
  m_PrefabInternal: {fileID: 1023513351}
  m_GameObject: {fileID: 737892745}
  m_Enabled: 1
  m_EditorHideFlags: 0
  m_Script: {fileID: 1392445389, guid: f5f67c52d1564df4a8936ccd202a3bd8, type: 3}
  m_Name: 
  m_EditorClassIdentifier: 
  m_Navigation:
    m_Mode: 3
    m_SelectOnUp: {fileID: 0}
    m_SelectOnDown: {fileID: 0}
    m_SelectOnLeft: {fileID: 0}
    m_SelectOnRight: {fileID: 0}
  m_Transition: 1
  m_Colors:
    m_NormalColor: {r: 1, g: 1, b: 1, a: 1}
    m_HighlightedColor: {r: 0.9607843, g: 0.9607843, b: 0.9607843, a: 1}
    m_PressedColor: {r: 0.78431374, g: 0.78431374, b: 0.78431374, a: 1}
    m_DisabledColor: {r: 0.78431374, g: 0.78431374, b: 0.78431374, a: 0.5019608}
    m_ColorMultiplier: 1
    m_FadeDuration: 0.1
  m_SpriteState:
    m_HighlightedSprite: {fileID: 0}
    m_PressedSprite: {fileID: 0}
    m_DisabledSprite: {fileID: 0}
  m_AnimationTriggers:
    m_NormalTrigger: Normal
    m_HighlightedTrigger: Highlighted
    m_PressedTrigger: Pressed
    m_DisabledTrigger: Disabled
  m_Interactable: 1
  m_TargetGraphic: {fileID: 737892748}
  m_OnClick:
    m_PersistentCalls:
      m_Calls: []
    m_TypeName: UnityEngine.UI.Button+ButtonClickedEvent, UnityEngine.UI, Version=1.0.0.0,
      Culture=neutral, PublicKeyToken=null
--- !u!114 &737892748
MonoBehaviour:
  m_ObjectHideFlags: 0
  m_PrefabParentObject: {fileID: 11432446, guid: a023f0b31d500a3499bda65871fd2ed2,
    type: 2}
  m_PrefabInternal: {fileID: 1023513351}
  m_GameObject: {fileID: 737892745}
  m_Enabled: 1
  m_EditorHideFlags: 0
  m_Script: {fileID: -765806418, guid: f5f67c52d1564df4a8936ccd202a3bd8, type: 3}
  m_Name: 
  m_EditorClassIdentifier: 
  m_Material: {fileID: 0}
  m_Color: {r: 1, g: 1, b: 1, a: 1}
  m_RaycastTarget: 1
  m_OnCullStateChanged:
    m_PersistentCalls:
      m_Calls: []
    m_TypeName: UnityEngine.UI.MaskableGraphic+CullStateChangedEvent, UnityEngine.UI,
      Version=1.0.0.0, Culture=neutral, PublicKeyToken=null
  m_Sprite: {fileID: 21300000, guid: 808ccd6b57b92481eb8234406b711bd1, type: 3}
  m_Type: 0
  m_PreserveAspect: 0
  m_FillCenter: 1
  m_FillMethod: 4
  m_FillAmount: 1
  m_FillClockwise: 1
  m_FillOrigin: 0
--- !u!222 &737892749
CanvasRenderer:
  m_ObjectHideFlags: 0
  m_PrefabParentObject: {fileID: 22232432, guid: a023f0b31d500a3499bda65871fd2ed2,
    type: 2}
  m_PrefabInternal: {fileID: 1023513351}
  m_GameObject: {fileID: 737892745}
--- !u!1 &762696721
GameObject:
  m_ObjectHideFlags: 0
  m_PrefabParentObject: {fileID: 132464, guid: a023f0b31d500a3499bda65871fd2ed2, type: 2}
  m_PrefabInternal: {fileID: 1023513351}
  serializedVersion: 5
  m_Component:
  - component: {fileID: 762696722}
  - component: {fileID: 762696724}
  - component: {fileID: 762696723}
  m_Layer: 5
  m_Name: Image
  m_TagString: Untagged
  m_Icon: {fileID: 0}
  m_NavMeshLayer: 0
  m_StaticEditorFlags: 0
  m_IsActive: 1
--- !u!224 &762696722
RectTransform:
  m_ObjectHideFlags: 0
  m_PrefabParentObject: {fileID: 22432464, guid: a023f0b31d500a3499bda65871fd2ed2,
    type: 2}
  m_PrefabInternal: {fileID: 1023513351}
  m_GameObject: {fileID: 762696721}
  m_LocalRotation: {x: 0, y: 0, z: 0, w: 1}
  m_LocalPosition: {x: 0, y: 0, z: 0}
  m_LocalScale: {x: 1, y: 1, z: 1}
  m_Children: []
  m_Father: {fileID: 1331141469}
  m_RootOrder: 0
  m_LocalEulerAnglesHint: {x: 0, y: 0, z: 0}
  m_AnchorMin: {x: 0.5, y: 0.5}
  m_AnchorMax: {x: 0.5, y: 0.5}
  m_AnchoredPosition: {x: 0, y: 0}
  m_SizeDelta: {x: 73.8, y: 73.8}
  m_Pivot: {x: 0.5, y: 0.5}
--- !u!114 &762696723
MonoBehaviour:
  m_ObjectHideFlags: 0
  m_PrefabParentObject: {fileID: 11432484, guid: a023f0b31d500a3499bda65871fd2ed2,
    type: 2}
  m_PrefabInternal: {fileID: 1023513351}
  m_GameObject: {fileID: 762696721}
  m_Enabled: 1
  m_EditorHideFlags: 0
  m_Script: {fileID: -765806418, guid: f5f67c52d1564df4a8936ccd202a3bd8, type: 3}
  m_Name: 
  m_EditorClassIdentifier: 
  m_Material: {fileID: 0}
  m_Color: {r: 0.97794116, g: 0.25167605, b: 0.25167605, a: 1}
  m_RaycastTarget: 1
  m_OnCullStateChanged:
    m_PersistentCalls:
      m_Calls: []
    m_TypeName: UnityEngine.UI.MaskableGraphic+CullStateChangedEvent, UnityEngine.UI,
      Version=1.0.0.0, Culture=neutral, PublicKeyToken=null
  m_Sprite: {fileID: 21300000, guid: 291502478103f274da140dc9d17c64dc, type: 3}
  m_Type: 0
  m_PreserveAspect: 0
  m_FillCenter: 1
  m_FillMethod: 4
  m_FillAmount: 1
  m_FillClockwise: 1
  m_FillOrigin: 0
--- !u!222 &762696724
CanvasRenderer:
  m_ObjectHideFlags: 0
  m_PrefabParentObject: {fileID: 22232464, guid: a023f0b31d500a3499bda65871fd2ed2,
    type: 2}
  m_PrefabInternal: {fileID: 1023513351}
  m_GameObject: {fileID: 762696721}
--- !u!1 &790856944
GameObject:
  m_ObjectHideFlags: 0
  m_PrefabParentObject: {fileID: 132458, guid: a023f0b31d500a3499bda65871fd2ed2, type: 2}
  m_PrefabInternal: {fileID: 1023513351}
  serializedVersion: 5
  m_Component:
  - component: {fileID: 790856945}
  - component: {fileID: 790856947}
  - component: {fileID: 790856946}
  m_Layer: 5
  m_Name: Image
  m_TagString: Untagged
  m_Icon: {fileID: 0}
  m_NavMeshLayer: 0
  m_StaticEditorFlags: 0
  m_IsActive: 1
--- !u!224 &790856945
RectTransform:
  m_ObjectHideFlags: 0
  m_PrefabParentObject: {fileID: 22432458, guid: a023f0b31d500a3499bda65871fd2ed2,
    type: 2}
  m_PrefabInternal: {fileID: 1023513351}
  m_GameObject: {fileID: 790856944}
  m_LocalRotation: {x: 0, y: 0, z: 0, w: 1}
  m_LocalPosition: {x: 0, y: 0, z: 0}
  m_LocalScale: {x: 1, y: 1, z: 1}
  m_Children: []
  m_Father: {fileID: 1223365316}
  m_RootOrder: 0
  m_LocalEulerAnglesHint: {x: 0, y: 0, z: 0}
  m_AnchorMin: {x: 0.5, y: 0.5}
  m_AnchorMax: {x: 0.5, y: 0.5}
  m_AnchoredPosition: {x: -244, y: 45}
  m_SizeDelta: {x: 1577, y: 1258}
  m_Pivot: {x: 0.5, y: 0.5}
--- !u!114 &790856946
MonoBehaviour:
  m_ObjectHideFlags: 0
  m_PrefabParentObject: {fileID: 11432478, guid: a023f0b31d500a3499bda65871fd2ed2,
    type: 2}
  m_PrefabInternal: {fileID: 1023513351}
  m_GameObject: {fileID: 790856944}
  m_Enabled: 1
  m_EditorHideFlags: 0
  m_Script: {fileID: -765806418, guid: f5f67c52d1564df4a8936ccd202a3bd8, type: 3}
  m_Name: 
  m_EditorClassIdentifier: 
  m_Material: {fileID: 0}
  m_Color: {r: 0.99607843, g: 0.99607843, b: 0.99607843, a: 1}
  m_RaycastTarget: 1
  m_OnCullStateChanged:
    m_PersistentCalls:
      m_Calls: []
    m_TypeName: UnityEngine.UI.MaskableGraphic+CullStateChangedEvent, UnityEngine.UI,
      Version=1.0.0.0, Culture=neutral, PublicKeyToken=null
  m_Sprite: {fileID: 21300000, guid: ec204ee652024464294f15e766a1bd2c, type: 3}
  m_Type: 0
  m_PreserveAspect: 1
  m_FillCenter: 1
  m_FillMethod: 4
  m_FillAmount: 1
  m_FillClockwise: 1
  m_FillOrigin: 0
--- !u!222 &790856947
CanvasRenderer:
  m_ObjectHideFlags: 0
  m_PrefabParentObject: {fileID: 22232458, guid: a023f0b31d500a3499bda65871fd2ed2,
    type: 2}
  m_PrefabInternal: {fileID: 1023513351}
  m_GameObject: {fileID: 790856944}
--- !u!1 &942171506
GameObject:
  m_ObjectHideFlags: 0
  m_PrefabParentObject: {fileID: 132428, guid: a023f0b31d500a3499bda65871fd2ed2, type: 2}
  m_PrefabInternal: {fileID: 1023513351}
  serializedVersion: 5
  m_Component:
  - component: {fileID: 942171507}
  - component: {fileID: 942171509}
  - component: {fileID: 942171508}
  m_Layer: 5
  m_Name: CameraSection
  m_TagString: Untagged
  m_Icon: {fileID: 0}
  m_NavMeshLayer: 0
  m_StaticEditorFlags: 0
  m_IsActive: 1
--- !u!224 &942171507
RectTransform:
  m_ObjectHideFlags: 0
  m_PrefabParentObject: {fileID: 22432428, guid: a023f0b31d500a3499bda65871fd2ed2,
    type: 2}
  m_PrefabInternal: {fileID: 1023513351}
  m_GameObject: {fileID: 942171506}
  m_LocalRotation: {x: 0, y: 0, z: 0, w: 1}
  m_LocalPosition: {x: 0, y: 0, z: 0}
  m_LocalScale: {x: 1, y: 1, z: 1}
  m_Children:
  - {fileID: 1006562113}
  - {fileID: 1331141469}
  m_Father: {fileID: 1263965265}
  m_RootOrder: 0
  m_LocalEulerAnglesHint: {x: 0, y: 0, z: 0}
  m_AnchorMin: {x: 0.5, y: 0.5}
  m_AnchorMax: {x: 0.5, y: 0.5}
  m_AnchoredPosition: {x: 10, y: 0}
  m_SizeDelta: {x: 332.4, y: 100}
  m_Pivot: {x: 0.5, y: 0.5}
--- !u!114 &942171508
MonoBehaviour:
  m_ObjectHideFlags: 0
  m_PrefabParentObject: {fileID: 11432440, guid: a023f0b31d500a3499bda65871fd2ed2,
    type: 2}
  m_PrefabInternal: {fileID: 1023513351}
  m_GameObject: {fileID: 942171506}
  m_Enabled: 1
  m_EditorHideFlags: 0
  m_Script: {fileID: -765806418, guid: f5f67c52d1564df4a8936ccd202a3bd8, type: 3}
  m_Name: 
  m_EditorClassIdentifier: 
  m_Material: {fileID: 0}
  m_Color: {r: 0.13235295, g: 0.13235295, b: 0.13235295, a: 1}
  m_RaycastTarget: 1
  m_OnCullStateChanged:
    m_PersistentCalls:
      m_Calls: []
    m_TypeName: UnityEngine.UI.MaskableGraphic+CullStateChangedEvent, UnityEngine.UI,
      Version=1.0.0.0, Culture=neutral, PublicKeyToken=null
  m_Sprite: {fileID: 21300000, guid: d933e3d481575ca4b8c63bf881596b5f, type: 3}
  m_Type: 1
  m_PreserveAspect: 0
  m_FillCenter: 1
  m_FillMethod: 4
  m_FillAmount: 1
  m_FillClockwise: 1
  m_FillOrigin: 0
--- !u!222 &942171509
CanvasRenderer:
  m_ObjectHideFlags: 0
  m_PrefabParentObject: {fileID: 22232428, guid: a023f0b31d500a3499bda65871fd2ed2,
    type: 2}
  m_PrefabInternal: {fileID: 1023513351}
  m_GameObject: {fileID: 942171506}
--- !u!1 &1006562112
GameObject:
  m_ObjectHideFlags: 0
  m_PrefabParentObject: {fileID: 132440, guid: a023f0b31d500a3499bda65871fd2ed2, type: 2}
  m_PrefabInternal: {fileID: 1023513351}
  serializedVersion: 5
  m_Component:
  - component: {fileID: 1006562113}
  - component: {fileID: 1006562116}
  - component: {fileID: 1006562115}
  - component: {fileID: 1006562114}
  m_Layer: 5
  m_Name: ShootButton
  m_TagString: Untagged
  m_Icon: {fileID: 0}
  m_NavMeshLayer: 0
  m_StaticEditorFlags: 0
  m_IsActive: 1
--- !u!224 &1006562113
RectTransform:
  m_ObjectHideFlags: 0
  m_PrefabParentObject: {fileID: 22432440, guid: a023f0b31d500a3499bda65871fd2ed2,
    type: 2}
  m_PrefabInternal: {fileID: 1023513351}
  m_GameObject: {fileID: 1006562112}
  m_LocalRotation: {x: 0, y: 0, z: 0, w: 1}
  m_LocalPosition: {x: 0, y: 0, z: 0}
  m_LocalScale: {x: 0.8, y: 0.8, z: 1}
  m_Children:
  - {fileID: 538902157}
  m_Father: {fileID: 942171507}
  m_RootOrder: 0
  m_LocalEulerAnglesHint: {x: 0, y: 0, z: 0}
  m_AnchorMin: {x: 0.5, y: 0.5}
  m_AnchorMax: {x: 0.5, y: 0.5}
  m_AnchoredPosition: {x: -43.30005, y: 0}
  m_SizeDelta: {x: 273, y: 100}
  m_Pivot: {x: 0.5, y: 0.5}
--- !u!114 &1006562114
MonoBehaviour:
  m_ObjectHideFlags: 0
  m_PrefabParentObject: {fileID: 11432428, guid: a023f0b31d500a3499bda65871fd2ed2,
    type: 2}
  m_PrefabInternal: {fileID: 1023513351}
  m_GameObject: {fileID: 1006562112}
  m_Enabled: 1
  m_EditorHideFlags: 0
  m_Script: {fileID: 1392445389, guid: f5f67c52d1564df4a8936ccd202a3bd8, type: 3}
  m_Name: 
  m_EditorClassIdentifier: 
  m_Navigation:
    m_Mode: 3
    m_SelectOnUp: {fileID: 0}
    m_SelectOnDown: {fileID: 0}
    m_SelectOnLeft: {fileID: 0}
    m_SelectOnRight: {fileID: 0}
  m_Transition: 1
  m_Colors:
    m_NormalColor: {r: 1, g: 1, b: 1, a: 1}
    m_HighlightedColor: {r: 0.9607843, g: 0.9607843, b: 0.9607843, a: 1}
    m_PressedColor: {r: 0.78431374, g: 0.78431374, b: 0.78431374, a: 1}
    m_DisabledColor: {r: 0.78431374, g: 0.78431374, b: 0.78431374, a: 0.5019608}
    m_ColorMultiplier: 1
    m_FadeDuration: 0.1
  m_SpriteState:
    m_HighlightedSprite: {fileID: 0}
    m_PressedSprite: {fileID: 0}
    m_DisabledSprite: {fileID: 0}
  m_AnimationTriggers:
    m_NormalTrigger: Normal
    m_HighlightedTrigger: Highlighted
    m_PressedTrigger: Pressed
    m_DisabledTrigger: Disabled
  m_Interactable: 1
  m_TargetGraphic: {fileID: 1006562115}
  m_OnClick:
    m_PersistentCalls:
      m_Calls: []
    m_TypeName: UnityEngine.UI.Button+ButtonClickedEvent, UnityEngine.UI, Version=1.0.0.0,
      Culture=neutral, PublicKeyToken=null
--- !u!114 &1006562115
MonoBehaviour:
  m_ObjectHideFlags: 0
  m_PrefabParentObject: {fileID: 11432454, guid: a023f0b31d500a3499bda65871fd2ed2,
    type: 2}
  m_PrefabInternal: {fileID: 1023513351}
  m_GameObject: {fileID: 1006562112}
  m_Enabled: 1
  m_EditorHideFlags: 0
  m_Script: {fileID: -765806418, guid: f5f67c52d1564df4a8936ccd202a3bd8, type: 3}
  m_Name: 
  m_EditorClassIdentifier: 
  m_Material: {fileID: 0}
  m_Color: {r: 0.9705882, g: 0.9705882, b: 0.9705882, a: 1}
  m_RaycastTarget: 1
  m_OnCullStateChanged:
    m_PersistentCalls:
      m_Calls: []
    m_TypeName: UnityEngine.UI.MaskableGraphic+CullStateChangedEvent, UnityEngine.UI,
      Version=1.0.0.0, Culture=neutral, PublicKeyToken=null
  m_Sprite: {fileID: 21300000, guid: d933e3d481575ca4b8c63bf881596b5f, type: 3}
  m_Type: 1
  m_PreserveAspect: 0
  m_FillCenter: 1
  m_FillMethod: 4
  m_FillAmount: 1
  m_FillClockwise: 1
  m_FillOrigin: 0
--- !u!222 &1006562116
CanvasRenderer:
  m_ObjectHideFlags: 0
  m_PrefabParentObject: {fileID: 22232440, guid: a023f0b31d500a3499bda65871fd2ed2,
    type: 2}
  m_PrefabInternal: {fileID: 1023513351}
  m_GameObject: {fileID: 1006562112}
--- !u!1001 &1023513351
Prefab:
  m_ObjectHideFlags: 0
  serializedVersion: 2
  m_Modification:
    m_TransformParent: {fileID: 0}
    m_Modifications:
    - target: {fileID: 22432452, guid: a023f0b31d500a3499bda65871fd2ed2, type: 2}
      propertyPath: m_LocalPosition.x
      value: 0
      objectReference: {fileID: 0}
    - target: {fileID: 22432452, guid: a023f0b31d500a3499bda65871fd2ed2, type: 2}
      propertyPath: m_LocalPosition.y
      value: 0
      objectReference: {fileID: 0}
    - target: {fileID: 22432452, guid: a023f0b31d500a3499bda65871fd2ed2, type: 2}
      propertyPath: m_LocalPosition.z
      value: 0
      objectReference: {fileID: 0}
    - target: {fileID: 22432452, guid: a023f0b31d500a3499bda65871fd2ed2, type: 2}
      propertyPath: m_LocalRotation.x
      value: 0
      objectReference: {fileID: 0}
    - target: {fileID: 22432452, guid: a023f0b31d500a3499bda65871fd2ed2, type: 2}
      propertyPath: m_LocalRotation.y
      value: 0
      objectReference: {fileID: 0}
    - target: {fileID: 22432452, guid: a023f0b31d500a3499bda65871fd2ed2, type: 2}
      propertyPath: m_LocalRotation.z
      value: 0
      objectReference: {fileID: 0}
    - target: {fileID: 22432452, guid: a023f0b31d500a3499bda65871fd2ed2, type: 2}
      propertyPath: m_LocalRotation.w
      value: 1
      objectReference: {fileID: 0}
    - target: {fileID: 22432452, guid: a023f0b31d500a3499bda65871fd2ed2, type: 2}
      propertyPath: m_RootOrder
      value: 0
      objectReference: {fileID: 0}
    - target: {fileID: 22432452, guid: a023f0b31d500a3499bda65871fd2ed2, type: 2}
      propertyPath: m_AnchoredPosition.x
      value: 0
      objectReference: {fileID: 0}
    - target: {fileID: 22432452, guid: a023f0b31d500a3499bda65871fd2ed2, type: 2}
      propertyPath: m_AnchoredPosition.y
      value: 0
      objectReference: {fileID: 0}
    - target: {fileID: 22432452, guid: a023f0b31d500a3499bda65871fd2ed2, type: 2}
      propertyPath: m_SizeDelta.x
      value: 0
      objectReference: {fileID: 0}
    - target: {fileID: 22432452, guid: a023f0b31d500a3499bda65871fd2ed2, type: 2}
      propertyPath: m_SizeDelta.y
      value: 0
      objectReference: {fileID: 0}
    - target: {fileID: 22432452, guid: a023f0b31d500a3499bda65871fd2ed2, type: 2}
      propertyPath: m_AnchorMin.x
      value: 0
      objectReference: {fileID: 0}
    - target: {fileID: 22432452, guid: a023f0b31d500a3499bda65871fd2ed2, type: 2}
      propertyPath: m_AnchorMin.y
      value: 0
      objectReference: {fileID: 0}
    - target: {fileID: 22432452, guid: a023f0b31d500a3499bda65871fd2ed2, type: 2}
      propertyPath: m_AnchorMax.x
      value: 0
      objectReference: {fileID: 0}
    - target: {fileID: 22432452, guid: a023f0b31d500a3499bda65871fd2ed2, type: 2}
      propertyPath: m_AnchorMax.y
      value: 0
      objectReference: {fileID: 0}
    - target: {fileID: 22432452, guid: a023f0b31d500a3499bda65871fd2ed2, type: 2}
      propertyPath: m_Pivot.x
      value: 0
      objectReference: {fileID: 0}
    - target: {fileID: 22432452, guid: a023f0b31d500a3499bda65871fd2ed2, type: 2}
      propertyPath: m_Pivot.y
      value: 0
      objectReference: {fileID: 0}
    m_RemovedComponents: []
  m_ParentPrefab: {fileID: 100100000, guid: a023f0b31d500a3499bda65871fd2ed2, type: 2}
  m_RootGameObject: {fileID: 2018726521}
  m_IsPrefabParent: 0
--- !u!1 &1060986981
GameObject:
  m_ObjectHideFlags: 0
  m_PrefabParentObject: {fileID: 132472, guid: a023f0b31d500a3499bda65871fd2ed2, type: 2}
  m_PrefabInternal: {fileID: 1023513351}
  serializedVersion: 5
  m_Component:
  - component: {fileID: 1060986982}
  - component: {fileID: 1060986984}
  - component: {fileID: 1060986983}
  m_Layer: 5
  m_Name: AppTitle
  m_TagString: Untagged
  m_Icon: {fileID: 0}
  m_NavMeshLayer: 0
  m_StaticEditorFlags: 0
  m_IsActive: 1
--- !u!224 &1060986982
RectTransform:
  m_ObjectHideFlags: 0
  m_PrefabParentObject: {fileID: 22432472, guid: a023f0b31d500a3499bda65871fd2ed2,
    type: 2}
  m_PrefabInternal: {fileID: 1023513351}
  m_GameObject: {fileID: 1060986981}
  m_LocalRotation: {x: 0, y: 0, z: 0, w: 1}
  m_LocalPosition: {x: 0, y: 0, z: 0}
  m_LocalScale: {x: 1, y: 1, z: 1}
  m_Children:
  - {fileID: 380690934}
  m_Father: {fileID: 2018726526}
  m_RootOrder: 0
  m_LocalEulerAnglesHint: {x: 0, y: 0, z: 0}
  m_AnchorMin: {x: 0.5, y: 0.5}
  m_AnchorMax: {x: 0.5, y: 0.5}
  m_AnchoredPosition: {x: 28, y: 679}
  m_SizeDelta: {x: 695, y: 109}
  m_Pivot: {x: 0.5, y: 0.5}
--- !u!114 &1060986983
MonoBehaviour:
  m_ObjectHideFlags: 0
  m_PrefabParentObject: {fileID: 11432492, guid: a023f0b31d500a3499bda65871fd2ed2,
    type: 2}
  m_PrefabInternal: {fileID: 1023513351}
  m_GameObject: {fileID: 1060986981}
  m_Enabled: 1
  m_EditorHideFlags: 0
  m_Script: {fileID: 708705254, guid: f5f67c52d1564df4a8936ccd202a3bd8, type: 3}
  m_Name: 
  m_EditorClassIdentifier: 
  m_Material: {fileID: 0}
  m_Color: {r: 0.85490197, g: 0.85490197, b: 0.85490197, a: 1}
  m_RaycastTarget: 1
  m_OnCullStateChanged:
    m_PersistentCalls:
      m_Calls: []
    m_TypeName: UnityEngine.UI.MaskableGraphic+CullStateChangedEvent, UnityEngine.UI,
      Version=1.0.0.0, Culture=neutral, PublicKeyToken=null
  m_FontData:
    m_Font: {fileID: 12800000, guid: 218956a5c2a6e42d6a60afccf80b002b, type: 3}
    m_FontSize: 100
    m_FontStyle: 0
    m_BestFit: 0
    m_MinSize: 10
    m_MaxSize: 100
    m_Alignment: 0
    m_AlignByGeometry: 0
    m_RichText: 1
    m_HorizontalOverflow: 0
    m_VerticalOverflow: 1
    m_LineSpacing: 1
  m_Text: CAMERA
--- !u!222 &1060986984
CanvasRenderer:
  m_ObjectHideFlags: 0
  m_PrefabParentObject: {fileID: 22232472, guid: a023f0b31d500a3499bda65871fd2ed2,
    type: 2}
  m_PrefabInternal: {fileID: 1023513351}
  m_GameObject: {fileID: 1060986981}
--- !u!1 &1223365315
GameObject:
  m_ObjectHideFlags: 0
  m_PrefabParentObject: {fileID: 132450, guid: a023f0b31d500a3499bda65871fd2ed2, type: 2}
  m_PrefabInternal: {fileID: 1023513351}
  serializedVersion: 5
  m_Component:
  - component: {fileID: 1223365316}
  - component: {fileID: 1223365319}
  - component: {fileID: 1223365318}
  - component: {fileID: 1223365317}
  m_Layer: 5
  m_Name: Content
  m_TagString: Untagged
  m_Icon: {fileID: 0}
  m_NavMeshLayer: 0
  m_StaticEditorFlags: 0
  m_IsActive: 1
--- !u!224 &1223365316
RectTransform:
  m_ObjectHideFlags: 0
  m_PrefabParentObject: {fileID: 22432450, guid: a023f0b31d500a3499bda65871fd2ed2,
    type: 2}
  m_PrefabInternal: {fileID: 1023513351}
  m_GameObject: {fileID: 1223365315}
  m_LocalRotation: {x: 0, y: 0, z: 0, w: 1}
  m_LocalPosition: {x: 0, y: 0, z: 0}
  m_LocalScale: {x: 1, y: 1, z: 1}
  m_Children:
  - {fileID: 790856945}
  - {fileID: 1952165858}
  - {fileID: 1517797653}
  - {fileID: 1416674483}
  - {fileID: 1350804767}
  - {fileID: 1263965265}
  m_Father: {fileID: 2018726526}
  m_RootOrder: 1
  m_LocalEulerAnglesHint: {x: 0, y: 0, z: 0}
  m_AnchorMin: {x: 0.5, y: 0.5}
  m_AnchorMax: {x: 0.5, y: 0.5}
  m_AnchoredPosition: {x: 0, y: 0}
  m_SizeDelta: {x: 640, y: 1136}
  m_Pivot: {x: 0.5, y: 0.5}
--- !u!114 &1223365317
MonoBehaviour:
  m_ObjectHideFlags: 0
  m_PrefabParentObject: {fileID: 11432464, guid: a023f0b31d500a3499bda65871fd2ed2,
    type: 2}
  m_PrefabInternal: {fileID: 1023513351}
  m_GameObject: {fileID: 1223365315}
  m_Enabled: 1
  m_EditorHideFlags: 0
  m_Script: {fileID: -1200242548, guid: f5f67c52d1564df4a8936ccd202a3bd8, type: 3}
  m_Name: 
  m_EditorClassIdentifier: 
  m_ShowMaskGraphic: 1
--- !u!114 &1223365318
MonoBehaviour:
  m_ObjectHideFlags: 0
  m_PrefabParentObject: {fileID: 11432466, guid: a023f0b31d500a3499bda65871fd2ed2,
    type: 2}
  m_PrefabInternal: {fileID: 1023513351}
  m_GameObject: {fileID: 1223365315}
  m_Enabled: 1
  m_EditorHideFlags: 0
  m_Script: {fileID: -765806418, guid: f5f67c52d1564df4a8936ccd202a3bd8, type: 3}
  m_Name: 
  m_EditorClassIdentifier: 
  m_Material: {fileID: 0}
  m_Color: {r: 0.13333334, g: 0.13725491, b: 0.14509805, a: 1}
  m_RaycastTarget: 1
  m_OnCullStateChanged:
    m_PersistentCalls:
      m_Calls: []
    m_TypeName: UnityEngine.UI.MaskableGraphic+CullStateChangedEvent, UnityEngine.UI,
      Version=1.0.0.0, Culture=neutral, PublicKeyToken=null
  m_Sprite: {fileID: 21300000, guid: 7ed1238760b863f4aafde32ab3a6f28c, type: 3}
  m_Type: 1
  m_PreserveAspect: 0
  m_FillCenter: 1
  m_FillMethod: 4
  m_FillAmount: 1
  m_FillClockwise: 1
  m_FillOrigin: 0
--- !u!222 &1223365319
CanvasRenderer:
  m_ObjectHideFlags: 0
  m_PrefabParentObject: {fileID: 22232450, guid: a023f0b31d500a3499bda65871fd2ed2,
    type: 2}
  m_PrefabInternal: {fileID: 1023513351}
  m_GameObject: {fileID: 1223365315}
--- !u!1 &1263965264
GameObject:
  m_ObjectHideFlags: 0
  m_PrefabParentObject: {fileID: 132426, guid: a023f0b31d500a3499bda65871fd2ed2, type: 2}
  m_PrefabInternal: {fileID: 1023513351}
  serializedVersion: 5
  m_Component:
  - component: {fileID: 1263965265}
  - component: {fileID: 1263965267}
  - component: {fileID: 1263965266}
  m_Layer: 5
  m_Name: BottomPanel
  m_TagString: Untagged
  m_Icon: {fileID: 0}
  m_NavMeshLayer: 0
  m_StaticEditorFlags: 0
  m_IsActive: 1
--- !u!224 &1263965265
RectTransform:
  m_ObjectHideFlags: 0
  m_PrefabParentObject: {fileID: 22432426, guid: a023f0b31d500a3499bda65871fd2ed2,
    type: 2}
  m_PrefabInternal: {fileID: 1023513351}
  m_GameObject: {fileID: 1263965264}
  m_LocalRotation: {x: 0, y: 0, z: 0, w: 1}
  m_LocalPosition: {x: 0, y: 0, z: 0}
  m_LocalScale: {x: 1, y: 1, z: 1}
  m_Children:
  - {fileID: 942171507}
  - {fileID: 1844368054}
  - {fileID: 1710312177}
  m_Father: {fileID: 1223365316}
  m_RootOrder: 5
  m_LocalEulerAnglesHint: {x: 0, y: 0, z: 0}
  m_AnchorMin: {x: 0.5, y: 0.5}
  m_AnchorMax: {x: 0.5, y: 0.5}
  m_AnchoredPosition: {x: 0, y: -501}
  m_SizeDelta: {x: 640, y: 134}
  m_Pivot: {x: 0.5, y: 0.5}
--- !u!114 &1263965266
MonoBehaviour:
  m_ObjectHideFlags: 0
  m_PrefabParentObject: {fileID: 11432438, guid: a023f0b31d500a3499bda65871fd2ed2,
    type: 2}
  m_PrefabInternal: {fileID: 1023513351}
  m_GameObject: {fileID: 1263965264}
  m_Enabled: 1
  m_EditorHideFlags: 0
  m_Script: {fileID: -765806418, guid: f5f67c52d1564df4a8936ccd202a3bd8, type: 3}
  m_Name: 
  m_EditorClassIdentifier: 
  m_Material: {fileID: 0}
  m_Color: {r: 0.08088237, g: 0.08088237, b: 0.08088237, a: 1}
  m_RaycastTarget: 1
  m_OnCullStateChanged:
    m_PersistentCalls:
      m_Calls: []
    m_TypeName: UnityEngine.UI.MaskableGraphic+CullStateChangedEvent, UnityEngine.UI,
      Version=1.0.0.0, Culture=neutral, PublicKeyToken=null
  m_Sprite: {fileID: 21300000, guid: 7ed1238760b863f4aafde32ab3a6f28c, type: 3}
  m_Type: 1
  m_PreserveAspect: 0
  m_FillCenter: 1
  m_FillMethod: 4
  m_FillAmount: 1
  m_FillClockwise: 1
  m_FillOrigin: 0
--- !u!222 &1263965267
CanvasRenderer:
  m_ObjectHideFlags: 0
  m_PrefabParentObject: {fileID: 22232426, guid: a023f0b31d500a3499bda65871fd2ed2,
    type: 2}
  m_PrefabInternal: {fileID: 1023513351}
  m_GameObject: {fileID: 1263965264}
--- !u!1 &1331141468
GameObject:
  m_ObjectHideFlags: 0
  m_PrefabParentObject: {fileID: 132446, guid: a023f0b31d500a3499bda65871fd2ed2, type: 2}
  m_PrefabInternal: {fileID: 1023513351}
  serializedVersion: 5
  m_Component:
  - component: {fileID: 1331141469}
  - component: {fileID: 1331141472}
  - component: {fileID: 1331141471}
  - component: {fileID: 1331141470}
  m_Layer: 5
  m_Name: RecordButton
  m_TagString: Untagged
  m_Icon: {fileID: 0}
  m_NavMeshLayer: 0
  m_StaticEditorFlags: 0
  m_IsActive: 1
--- !u!224 &1331141469
RectTransform:
  m_ObjectHideFlags: 0
  m_PrefabParentObject: {fileID: 22432446, guid: a023f0b31d500a3499bda65871fd2ed2,
    type: 2}
  m_PrefabInternal: {fileID: 1023513351}
  m_GameObject: {fileID: 1331141468}
  m_LocalRotation: {x: 0, y: 0, z: 0, w: 1}
  m_LocalPosition: {x: 0, y: 0, z: 0}
  m_LocalScale: {x: 1, y: 1, z: 1}
  m_Children:
  - {fileID: 762696722}
  m_Father: {fileID: 942171507}
  m_RootOrder: 1
  m_LocalEulerAnglesHint: {x: 0, y: 0, z: 0}
  m_AnchorMin: {x: 0.5, y: 0.5}
  m_AnchorMax: {x: 0.5, y: 0.5}
  m_AnchoredPosition: {x: 113.100006, y: -0.0000015497}
  m_SizeDelta: {x: 79.8, y: 79.8}
  m_Pivot: {x: 0.5, y: 0.5}
--- !u!114 &1331141470
MonoBehaviour:
  m_ObjectHideFlags: 0
  m_PrefabParentObject: {fileID: 11432426, guid: a023f0b31d500a3499bda65871fd2ed2,
    type: 2}
  m_PrefabInternal: {fileID: 1023513351}
  m_GameObject: {fileID: 1331141468}
  m_Enabled: 1
  m_EditorHideFlags: 0
  m_Script: {fileID: 1392445389, guid: f5f67c52d1564df4a8936ccd202a3bd8, type: 3}
  m_Name: 
  m_EditorClassIdentifier: 
  m_Navigation:
    m_Mode: 3
    m_SelectOnUp: {fileID: 0}
    m_SelectOnDown: {fileID: 0}
    m_SelectOnLeft: {fileID: 0}
    m_SelectOnRight: {fileID: 0}
  m_Transition: 1
  m_Colors:
    m_NormalColor: {r: 1, g: 1, b: 1, a: 1}
    m_HighlightedColor: {r: 0.9607843, g: 0.9607843, b: 0.9607843, a: 1}
    m_PressedColor: {r: 0.78431374, g: 0.78431374, b: 0.78431374, a: 1}
    m_DisabledColor: {r: 0.78431374, g: 0.78431374, b: 0.78431374, a: 0.5019608}
    m_ColorMultiplier: 1
    m_FadeDuration: 0.1
  m_SpriteState:
    m_HighlightedSprite: {fileID: 0}
    m_PressedSprite: {fileID: 0}
    m_DisabledSprite: {fileID: 0}
  m_AnimationTriggers:
    m_NormalTrigger: Normal
    m_HighlightedTrigger: Highlighted
    m_PressedTrigger: Pressed
    m_DisabledTrigger: Disabled
  m_Interactable: 1
  m_TargetGraphic: {fileID: 1331141471}
  m_OnClick:
    m_PersistentCalls:
      m_Calls: []
    m_TypeName: UnityEngine.UI.Button+ButtonClickedEvent, UnityEngine.UI, Version=1.0.0.0,
      Culture=neutral, PublicKeyToken=null
--- !u!114 &1331141471
MonoBehaviour:
  m_ObjectHideFlags: 0
  m_PrefabParentObject: {fileID: 11432460, guid: a023f0b31d500a3499bda65871fd2ed2,
    type: 2}
  m_PrefabInternal: {fileID: 1023513351}
  m_GameObject: {fileID: 1331141468}
  m_Enabled: 1
  m_EditorHideFlags: 0
  m_Script: {fileID: -765806418, guid: f5f67c52d1564df4a8936ccd202a3bd8, type: 3}
  m_Name: 
  m_EditorClassIdentifier: 
  m_Material: {fileID: 0}
  m_Color: {r: 0.9647059, g: 0.9647059, b: 0.9647059, a: 1}
  m_RaycastTarget: 1
  m_OnCullStateChanged:
    m_PersistentCalls:
      m_Calls: []
    m_TypeName: UnityEngine.UI.MaskableGraphic+CullStateChangedEvent, UnityEngine.UI,
      Version=1.0.0.0, Culture=neutral, PublicKeyToken=null
  m_Sprite: {fileID: 21300000, guid: 291502478103f274da140dc9d17c64dc, type: 3}
  m_Type: 0
  m_PreserveAspect: 0
  m_FillCenter: 1
  m_FillMethod: 4
  m_FillAmount: 1
  m_FillClockwise: 1
  m_FillOrigin: 0
--- !u!222 &1331141472
CanvasRenderer:
  m_ObjectHideFlags: 0
  m_PrefabParentObject: {fileID: 22232446, guid: a023f0b31d500a3499bda65871fd2ed2,
    type: 2}
  m_PrefabInternal: {fileID: 1023513351}
  m_GameObject: {fileID: 1331141468}
--- !u!1 &1350804766
GameObject:
  m_ObjectHideFlags: 0
  m_PrefabParentObject: {fileID: 132436, guid: a023f0b31d500a3499bda65871fd2ed2, type: 2}
  m_PrefabInternal: {fileID: 1023513351}
  serializedVersion: 5
  m_Component:
  - component: {fileID: 1350804767}
  - component: {fileID: 1350804769}
  - component: {fileID: 1350804768}
  m_Layer: 5
  m_Name: FocusOverlay
  m_TagString: Untagged
  m_Icon: {fileID: 0}
  m_NavMeshLayer: 0
  m_StaticEditorFlags: 0
  m_IsActive: 1
--- !u!224 &1350804767
RectTransform:
  m_ObjectHideFlags: 0
  m_PrefabParentObject: {fileID: 22432436, guid: a023f0b31d500a3499bda65871fd2ed2,
    type: 2}
  m_PrefabInternal: {fileID: 1023513351}
  m_GameObject: {fileID: 1350804766}
  m_LocalRotation: {x: 0, y: 0, z: 0, w: 1}
  m_LocalPosition: {x: 0, y: 0, z: 0}
  m_LocalScale: {x: 1, y: 1, z: 1}
  m_Children:
  - {fileID: 485226793}
  m_Father: {fileID: 1223365316}
  m_RootOrder: 4
  m_LocalEulerAnglesHint: {x: 0, y: 0, z: 0}
  m_AnchorMin: {x: 0.5, y: 0.5}
  m_AnchorMax: {x: 0.5, y: 0.5}
  m_AnchoredPosition: {x: -126.6, y: 141.3}
  m_SizeDelta: {x: 173, y: 173}
  m_Pivot: {x: 0.5, y: 0.5}
--- !u!114 &1350804768
MonoBehaviour:
  m_ObjectHideFlags: 0
  m_PrefabParentObject: {fileID: 11432450, guid: a023f0b31d500a3499bda65871fd2ed2,
    type: 2}
  m_PrefabInternal: {fileID: 1023513351}
  m_GameObject: {fileID: 1350804766}
  m_Enabled: 1
  m_EditorHideFlags: 0
  m_Script: {fileID: -765806418, guid: f5f67c52d1564df4a8936ccd202a3bd8, type: 3}
  m_Name: 
  m_EditorClassIdentifier: 
  m_Material: {fileID: 0}
  m_Color: {r: 1, g: 0.80689657, b: 0, a: 0.627451}
  m_RaycastTarget: 1
  m_OnCullStateChanged:
    m_PersistentCalls:
      m_Calls: []
    m_TypeName: UnityEngine.UI.MaskableGraphic+CullStateChangedEvent, UnityEngine.UI,
      Version=1.0.0.0, Culture=neutral, PublicKeyToken=null
  m_Sprite: {fileID: 21300000, guid: 670e88da7636bb74c9486ebfd1b9b50a, type: 3}
  m_Type: 0
  m_PreserveAspect: 0
  m_FillCenter: 1
  m_FillMethod: 4
  m_FillAmount: 1
  m_FillClockwise: 1
  m_FillOrigin: 0
--- !u!222 &1350804769
CanvasRenderer:
  m_ObjectHideFlags: 0
  m_PrefabParentObject: {fileID: 22232436, guid: a023f0b31d500a3499bda65871fd2ed2,
    type: 2}
  m_PrefabInternal: {fileID: 1023513351}
  m_GameObject: {fileID: 1350804766}
--- !u!1 &1416674482
GameObject:
  m_ObjectHideFlags: 0
  m_PrefabParentObject: {fileID: 132466, guid: a023f0b31d500a3499bda65871fd2ed2, type: 2}
  m_PrefabInternal: {fileID: 1023513351}
  serializedVersion: 5
  m_Component:
  - component: {fileID: 1416674483}
  - component: {fileID: 1416674486}
  - component: {fileID: 1416674485}
  - component: {fileID: 1416674484}
  m_Layer: 5
  m_Name: ButtonLeft
  m_TagString: Untagged
  m_Icon: {fileID: 0}
  m_NavMeshLayer: 0
  m_StaticEditorFlags: 0
  m_IsActive: 1
--- !u!224 &1416674483
RectTransform:
  m_ObjectHideFlags: 0
  m_PrefabParentObject: {fileID: 22432466, guid: a023f0b31d500a3499bda65871fd2ed2,
    type: 2}
  m_PrefabInternal: {fileID: 1023513351}
  m_GameObject: {fileID: 1416674482}
  m_LocalRotation: {x: 0, y: 0, z: 0, w: 1}
  m_LocalPosition: {x: 0, y: 0, z: 0}
  m_LocalScale: {x: 1, y: 1, z: 1}
  m_Children:
  - {fileID: 737892746}
  m_Father: {fileID: 1223365316}
  m_RootOrder: 3
  m_LocalEulerAnglesHint: {x: 0, y: 0, z: 0}
  m_AnchorMin: {x: 0.5, y: 0.5}
  m_AnchorMax: {x: 0.5, y: 0.5}
  m_AnchoredPosition: {x: -255.5, y: 507.5}
  m_SizeDelta: {x: 70, y: 70}
  m_Pivot: {x: 0.5, y: 0.5}
--- !u!114 &1416674484
MonoBehaviour:
  m_ObjectHideFlags: 0
  m_PrefabParentObject: {fileID: 11432432, guid: a023f0b31d500a3499bda65871fd2ed2,
    type: 2}
  m_PrefabInternal: {fileID: 1023513351}
  m_GameObject: {fileID: 1416674482}
  m_Enabled: 1
  m_EditorHideFlags: 0
  m_Script: {fileID: 1392445389, guid: f5f67c52d1564df4a8936ccd202a3bd8, type: 3}
  m_Name: 
  m_EditorClassIdentifier: 
  m_Navigation:
    m_Mode: 3
    m_SelectOnUp: {fileID: 0}
    m_SelectOnDown: {fileID: 0}
    m_SelectOnLeft: {fileID: 0}
    m_SelectOnRight: {fileID: 0}
  m_Transition: 1
  m_Colors:
    m_NormalColor: {r: 1, g: 1, b: 1, a: 1}
    m_HighlightedColor: {r: 0.9607843, g: 0.9607843, b: 0.9607843, a: 1}
    m_PressedColor: {r: 0.78431374, g: 0.78431374, b: 0.78431374, a: 1}
    m_DisabledColor: {r: 0.78431374, g: 0.78431374, b: 0.78431374, a: 0.5019608}
    m_ColorMultiplier: 1
    m_FadeDuration: 0.1
  m_SpriteState:
    m_HighlightedSprite: {fileID: 0}
    m_PressedSprite: {fileID: 0}
    m_DisabledSprite: {fileID: 0}
  m_AnimationTriggers:
    m_NormalTrigger: Normal
    m_HighlightedTrigger: Highlighted
    m_PressedTrigger: Pressed
    m_DisabledTrigger: Disabled
  m_Interactable: 1
  m_TargetGraphic: {fileID: 1416674485}
  m_OnClick:
    m_PersistentCalls:
      m_Calls: []
    m_TypeName: UnityEngine.UI.Button+ButtonClickedEvent, UnityEngine.UI, Version=1.0.0.0,
      Culture=neutral, PublicKeyToken=null
--- !u!114 &1416674485
MonoBehaviour:
  m_ObjectHideFlags: 0
  m_PrefabParentObject: {fileID: 11432486, guid: a023f0b31d500a3499bda65871fd2ed2,
    type: 2}
  m_PrefabInternal: {fileID: 1023513351}
  m_GameObject: {fileID: 1416674482}
  m_Enabled: 1
  m_EditorHideFlags: 0
  m_Script: {fileID: -765806418, guid: f5f67c52d1564df4a8936ccd202a3bd8, type: 3}
  m_Name: 
  m_EditorClassIdentifier: 
  m_Material: {fileID: 0}
  m_Color: {r: 0, g: 0, b: 0, a: 0.20784314}
  m_RaycastTarget: 1
  m_OnCullStateChanged:
    m_PersistentCalls:
      m_Calls: []
    m_TypeName: UnityEngine.UI.MaskableGraphic+CullStateChangedEvent, UnityEngine.UI,
      Version=1.0.0.0, Culture=neutral, PublicKeyToken=null
  m_Sprite: {fileID: 21300000, guid: 00292e5d44a244c4180bdaecec8dc7e8, type: 3}
  m_Type: 1
  m_PreserveAspect: 0
  m_FillCenter: 1
  m_FillMethod: 4
  m_FillAmount: 1
  m_FillClockwise: 1
  m_FillOrigin: 0
--- !u!222 &1416674486
CanvasRenderer:
  m_ObjectHideFlags: 0
  m_PrefabParentObject: {fileID: 22232466, guid: a023f0b31d500a3499bda65871fd2ed2,
    type: 2}
  m_PrefabInternal: {fileID: 1023513351}
  m_GameObject: {fileID: 1416674482}
--- !u!1 &1500371475
GameObject:
  m_ObjectHideFlags: 0
  m_PrefabParentObject: {fileID: 0}
  m_PrefabInternal: {fileID: 0}
  serializedVersion: 5
  m_Component:
  - component: {fileID: 1500371479}
  - component: {fileID: 1500371478}
  - component: {fileID: 1500371477}
  - component: {fileID: 1500371476}
  m_Layer: 0
  m_Name: EventSystem
  m_TagString: Untagged
  m_Icon: {fileID: 0}
  m_NavMeshLayer: 0
  m_StaticEditorFlags: 0
  m_IsActive: 1
--- !u!114 &1500371476
MonoBehaviour:
  m_ObjectHideFlags: 0
  m_PrefabParentObject: {fileID: 0}
  m_PrefabInternal: {fileID: 0}
  m_GameObject: {fileID: 1500371475}
  m_Enabled: 1
  m_EditorHideFlags: 0
  m_Script: {fileID: 1997211142, guid: f5f67c52d1564df4a8936ccd202a3bd8, type: 3}
  m_Name: 
  m_EditorClassIdentifier: 
  m_ForceModuleActive: 0
--- !u!114 &1500371477
MonoBehaviour:
  m_ObjectHideFlags: 0
  m_PrefabParentObject: {fileID: 0}
  m_PrefabInternal: {fileID: 0}
  m_GameObject: {fileID: 1500371475}
  m_Enabled: 1
  m_EditorHideFlags: 0
  m_Script: {fileID: 1077351063, guid: f5f67c52d1564df4a8936ccd202a3bd8, type: 3}
  m_Name: 
  m_EditorClassIdentifier: 
  m_HorizontalAxis: Horizontal
  m_VerticalAxis: Vertical
  m_SubmitButton: Submit
  m_CancelButton: Cancel
  m_InputActionsPerSecond: 10
  m_RepeatDelay: 0.5
  m_ForceModuleActive: 0
--- !u!114 &1500371478
MonoBehaviour:
  m_ObjectHideFlags: 0
  m_PrefabParentObject: {fileID: 0}
  m_PrefabInternal: {fileID: 0}
  m_GameObject: {fileID: 1500371475}
  m_Enabled: 1
  m_EditorHideFlags: 0
  m_Script: {fileID: -619905303, guid: f5f67c52d1564df4a8936ccd202a3bd8, type: 3}
  m_Name: 
  m_EditorClassIdentifier: 
  m_FirstSelected: {fileID: 0}
  m_sendNavigationEvents: 1
  m_DragThreshold: 5
--- !u!4 &1500371479
Transform:
  m_ObjectHideFlags: 0
  m_PrefabParentObject: {fileID: 0}
  m_PrefabInternal: {fileID: 0}
  m_GameObject: {fileID: 1500371475}
  m_LocalRotation: {x: 0, y: 0, z: 0, w: 1}
  m_LocalPosition: {x: 0, y: 0, z: 0}
  m_LocalScale: {x: 1, y: 1, z: 1}
  m_Children: []
  m_Father: {fileID: 0}
  m_RootOrder: 1
  m_LocalEulerAnglesHint: {x: 0, y: 0, z: 0}
--- !u!1 &1511305452
GameObject:
  m_ObjectHideFlags: 0
  m_PrefabParentObject: {fileID: 0}
  m_PrefabInternal: {fileID: 0}
  serializedVersion: 5
  m_Component:
  - component: {fileID: 1511305453}
  m_Layer: 0
  m_Name: __SET_YOUR_GAMESCREEN_TO_640x1136
  m_TagString: Untagged
  m_Icon: {fileID: 0}
  m_NavMeshLayer: 0
  m_StaticEditorFlags: 0
  m_IsActive: 1
--- !u!4 &1511305453
Transform:
  m_ObjectHideFlags: 0
  m_PrefabParentObject: {fileID: 0}
  m_PrefabInternal: {fileID: 0}
  m_GameObject: {fileID: 1511305452}
  m_LocalRotation: {x: 0, y: 0, z: 0, w: 1}
  m_LocalPosition: {x: 494.995, y: 627.74, z: 0}
  m_LocalScale: {x: 1, y: 1, z: 1}
  m_Children: []
  m_Father: {fileID: 0}
  m_RootOrder: 2
  m_LocalEulerAnglesHint: {x: 0, y: 0, z: 0}
--- !u!1 &1517797652
GameObject:
  m_ObjectHideFlags: 0
  m_PrefabParentObject: {fileID: 132444, guid: a023f0b31d500a3499bda65871fd2ed2, type: 2}
  m_PrefabInternal: {fileID: 1023513351}
  serializedVersion: 5
  m_Component:
  - component: {fileID: 1517797653}
  - component: {fileID: 1517797656}
  - component: {fileID: 1517797655}
  - component: {fileID: 1517797654}
  m_Layer: 5
  m_Name: ButtonRight
  m_TagString: Untagged
  m_Icon: {fileID: 0}
  m_NavMeshLayer: 0
  m_StaticEditorFlags: 0
  m_IsActive: 1
--- !u!224 &1517797653
RectTransform:
  m_ObjectHideFlags: 0
  m_PrefabParentObject: {fileID: 22432444, guid: a023f0b31d500a3499bda65871fd2ed2,
    type: 2}
  m_PrefabInternal: {fileID: 1023513351}
  m_GameObject: {fileID: 1517797652}
  m_LocalRotation: {x: 0, y: 0, z: 0, w: 1}
  m_LocalPosition: {x: 0, y: 0, z: 0}
  m_LocalScale: {x: 1, y: 1, z: 1}
  m_Children:
  - {fileID: 395390382}
  m_Father: {fileID: 1223365316}
  m_RootOrder: 2
  m_LocalEulerAnglesHint: {x: 0, y: 0, z: 0}
  m_AnchorMin: {x: 0.5, y: 0.5}
  m_AnchorMax: {x: 0.5, y: 0.5}
  m_AnchoredPosition: {x: 255, y: 507.5}
  m_SizeDelta: {x: 70, y: 70}
  m_Pivot: {x: 0.5, y: 0.5}
--- !u!114 &1517797654
MonoBehaviour:
  m_ObjectHideFlags: 0
  m_PrefabParentObject: {fileID: 11432434, guid: a023f0b31d500a3499bda65871fd2ed2,
    type: 2}
  m_PrefabInternal: {fileID: 1023513351}
  m_GameObject: {fileID: 1517797652}
  m_Enabled: 1
  m_EditorHideFlags: 0
  m_Script: {fileID: 1392445389, guid: f5f67c52d1564df4a8936ccd202a3bd8, type: 3}
  m_Name: 
  m_EditorClassIdentifier: 
  m_Navigation:
    m_Mode: 3
    m_SelectOnUp: {fileID: 0}
    m_SelectOnDown: {fileID: 0}
    m_SelectOnLeft: {fileID: 0}
    m_SelectOnRight: {fileID: 0}
  m_Transition: 1
  m_Colors:
    m_NormalColor: {r: 1, g: 1, b: 1, a: 1}
    m_HighlightedColor: {r: 0.9607843, g: 0.9607843, b: 0.9607843, a: 1}
    m_PressedColor: {r: 0.78431374, g: 0.78431374, b: 0.78431374, a: 1}
    m_DisabledColor: {r: 0.78431374, g: 0.78431374, b: 0.78431374, a: 0.5019608}
    m_ColorMultiplier: 1
    m_FadeDuration: 0.1
  m_SpriteState:
    m_HighlightedSprite: {fileID: 0}
    m_PressedSprite: {fileID: 0}
    m_DisabledSprite: {fileID: 0}
  m_AnimationTriggers:
    m_NormalTrigger: Normal
    m_HighlightedTrigger: Highlighted
    m_PressedTrigger: Pressed
    m_DisabledTrigger: Disabled
  m_Interactable: 1
  m_TargetGraphic: {fileID: 1517797655}
  m_OnClick:
    m_PersistentCalls:
      m_Calls: []
    m_TypeName: UnityEngine.UI.Button+ButtonClickedEvent, UnityEngine.UI, Version=1.0.0.0,
      Culture=neutral, PublicKeyToken=null
--- !u!114 &1517797655
MonoBehaviour:
  m_ObjectHideFlags: 0
  m_PrefabParentObject: {fileID: 11432458, guid: a023f0b31d500a3499bda65871fd2ed2,
    type: 2}
  m_PrefabInternal: {fileID: 1023513351}
  m_GameObject: {fileID: 1517797652}
  m_Enabled: 1
  m_EditorHideFlags: 0
  m_Script: {fileID: -765806418, guid: f5f67c52d1564df4a8936ccd202a3bd8, type: 3}
  m_Name: 
  m_EditorClassIdentifier: 
  m_Material: {fileID: 0}
  m_Color: {r: 0, g: 0, b: 0, a: 0.20784314}
  m_RaycastTarget: 1
  m_OnCullStateChanged:
    m_PersistentCalls:
      m_Calls: []
    m_TypeName: UnityEngine.UI.MaskableGraphic+CullStateChangedEvent, UnityEngine.UI,
      Version=1.0.0.0, Culture=neutral, PublicKeyToken=null
  m_Sprite: {fileID: 21300000, guid: 00292e5d44a244c4180bdaecec8dc7e8, type: 3}
  m_Type: 1
  m_PreserveAspect: 0
  m_FillCenter: 1
  m_FillMethod: 4
  m_FillAmount: 1
  m_FillClockwise: 1
  m_FillOrigin: 0
--- !u!222 &1517797656
CanvasRenderer:
  m_ObjectHideFlags: 0
  m_PrefabParentObject: {fileID: 22232444, guid: a023f0b31d500a3499bda65871fd2ed2,
    type: 2}
  m_PrefabInternal: {fileID: 1023513351}
  m_GameObject: {fileID: 1517797652}
--- !u!1 &1679287964
GameObject:
  m_ObjectHideFlags: 0
  m_PrefabParentObject: {fileID: 132470, guid: a023f0b31d500a3499bda65871fd2ed2, type: 2}
  m_PrefabInternal: {fileID: 1023513351}
  serializedVersion: 5
  m_Component:
  - component: {fileID: 1679287965}
  - component: {fileID: 1679287967}
  - component: {fileID: 1679287966}
  m_Layer: 5
  m_Name: Image
  m_TagString: Untagged
  m_Icon: {fileID: 0}
  m_NavMeshLayer: 0
  m_StaticEditorFlags: 0
  m_IsActive: 1
--- !u!224 &1679287965
RectTransform:
  m_ObjectHideFlags: 0
  m_PrefabParentObject: {fileID: 22432470, guid: a023f0b31d500a3499bda65871fd2ed2,
    type: 2}
  m_PrefabInternal: {fileID: 1023513351}
  m_GameObject: {fileID: 1679287964}
  m_LocalRotation: {x: 0, y: 0, z: 0, w: 1}
  m_LocalPosition: {x: 0, y: 0, z: 0}
  m_LocalScale: {x: 1, y: 1, z: 1}
  m_Children:
  - {fileID: 2062893099}
  m_Father: {fileID: 1952165858}
  m_RootOrder: 2
  m_LocalEulerAnglesHint: {x: 0, y: 0, z: 0}
  m_AnchorMin: {x: 0.5, y: 0.5}
  m_AnchorMax: {x: 0.5, y: 0.5}
  m_AnchoredPosition: {x: 74, y: 0}
  m_SizeDelta: {x: 100, y: 100}
  m_Pivot: {x: 0.5, y: 0.5}
--- !u!114 &1679287966
MonoBehaviour:
  m_ObjectHideFlags: 0
  m_PrefabParentObject: {fileID: 11432490, guid: a023f0b31d500a3499bda65871fd2ed2,
    type: 2}
  m_PrefabInternal: {fileID: 1023513351}
  m_GameObject: {fileID: 1679287964}
  m_Enabled: 1
  m_EditorHideFlags: 0
  m_Script: {fileID: -765806418, guid: f5f67c52d1564df4a8936ccd202a3bd8, type: 3}
  m_Name: 
  m_EditorClassIdentifier: 
  m_Material: {fileID: 0}
  m_Color: {r: 1, g: 1, b: 1, a: 1}
  m_RaycastTarget: 1
  m_OnCullStateChanged:
    m_PersistentCalls:
      m_Calls: []
    m_TypeName: UnityEngine.UI.MaskableGraphic+CullStateChangedEvent, UnityEngine.UI,
      Version=1.0.0.0, Culture=neutral, PublicKeyToken=null
  m_Sprite: {fileID: 21300000, guid: ba74363eb6d9bcf4382abd0b51fc7cb3, type: 3}
  m_Type: 0
  m_PreserveAspect: 0
  m_FillCenter: 1
  m_FillMethod: 4
  m_FillAmount: 1
  m_FillClockwise: 1
  m_FillOrigin: 0
--- !u!222 &1679287967
CanvasRenderer:
  m_ObjectHideFlags: 0
  m_PrefabParentObject: {fileID: 22232470, guid: a023f0b31d500a3499bda65871fd2ed2,
    type: 2}
  m_PrefabInternal: {fileID: 1023513351}
  m_GameObject: {fileID: 1679287964}
--- !u!1 &1710312176
GameObject:
  m_ObjectHideFlags: 0
  m_PrefabParentObject: {fileID: 132434, guid: a023f0b31d500a3499bda65871fd2ed2, type: 2}
  m_PrefabInternal: {fileID: 1023513351}
  serializedVersion: 5
  m_Component:
  - component: {fileID: 1710312177}
  - component: {fileID: 1710312180}
  - component: {fileID: 1710312179}
  - component: {fileID: 1710312178}
  m_Layer: 5
  m_Name: CloseButton
  m_TagString: Untagged
  m_Icon: {fileID: 0}
  m_NavMeshLayer: 0
  m_StaticEditorFlags: 0
  m_IsActive: 1
--- !u!224 &1710312177
RectTransform:
  m_ObjectHideFlags: 0
  m_PrefabParentObject: {fileID: 22432434, guid: a023f0b31d500a3499bda65871fd2ed2,
    type: 2}
  m_PrefabInternal: {fileID: 1023513351}
  m_GameObject: {fileID: 1710312176}
  m_LocalRotation: {x: 0, y: 0, z: 0, w: 1}
  m_LocalPosition: {x: 0, y: 0, z: 0}
  m_LocalScale: {x: 1, y: 1, z: 1}
  m_Children: []
  m_Father: {fileID: 1263965265}
  m_RootOrder: 2
  m_LocalEulerAnglesHint: {x: 0, y: 0, z: 0}
  m_AnchorMin: {x: 0.5, y: 0.5}
  m_AnchorMax: {x: 0.5, y: 0.5}
  m_AnchoredPosition: {x: 266.8, y: 0}
  m_SizeDelta: {x: 34, y: 34}
  m_Pivot: {x: 0.5, y: 0.5}
--- !u!114 &1710312178
MonoBehaviour:
  m_ObjectHideFlags: 0
  m_PrefabParentObject: {fileID: 11432424, guid: a023f0b31d500a3499bda65871fd2ed2,
    type: 2}
  m_PrefabInternal: {fileID: 1023513351}
  m_GameObject: {fileID: 1710312176}
  m_Enabled: 1
  m_EditorHideFlags: 0
  m_Script: {fileID: 1392445389, guid: f5f67c52d1564df4a8936ccd202a3bd8, type: 3}
  m_Name: 
  m_EditorClassIdentifier: 
  m_Navigation:
    m_Mode: 3
    m_SelectOnUp: {fileID: 0}
    m_SelectOnDown: {fileID: 0}
    m_SelectOnLeft: {fileID: 0}
    m_SelectOnRight: {fileID: 0}
  m_Transition: 1
  m_Colors:
    m_NormalColor: {r: 1, g: 1, b: 1, a: 1}
    m_HighlightedColor: {r: 0.9607843, g: 0.9607843, b: 0.9607843, a: 1}
    m_PressedColor: {r: 0.78431374, g: 0.78431374, b: 0.78431374, a: 1}
    m_DisabledColor: {r: 0.78431374, g: 0.78431374, b: 0.78431374, a: 0.5019608}
    m_ColorMultiplier: 1
    m_FadeDuration: 0.1
  m_SpriteState:
    m_HighlightedSprite: {fileID: 0}
    m_PressedSprite: {fileID: 0}
    m_DisabledSprite: {fileID: 0}
  m_AnimationTriggers:
    m_NormalTrigger: Normal
    m_HighlightedTrigger: Highlighted
    m_PressedTrigger: Pressed
    m_DisabledTrigger: Disabled
  m_Interactable: 1
  m_TargetGraphic: {fileID: 1710312179}
  m_OnClick:
    m_PersistentCalls:
      m_Calls: []
    m_TypeName: UnityEngine.UI.Button+ButtonClickedEvent, UnityEngine.UI, Version=1.0.0.0,
      Culture=neutral, PublicKeyToken=null
--- !u!114 &1710312179
MonoBehaviour:
  m_ObjectHideFlags: 0
  m_PrefabParentObject: {fileID: 11432448, guid: a023f0b31d500a3499bda65871fd2ed2,
    type: 2}
  m_PrefabInternal: {fileID: 1023513351}
  m_GameObject: {fileID: 1710312176}
  m_Enabled: 1
  m_EditorHideFlags: 0
  m_Script: {fileID: -765806418, guid: f5f67c52d1564df4a8936ccd202a3bd8, type: 3}
  m_Name: 
  m_EditorClassIdentifier: 
  m_Material: {fileID: 0}
  m_Color: {r: 0.9647059, g: 0.9647059, b: 0.9647059, a: 1}
  m_RaycastTarget: 1
  m_OnCullStateChanged:
    m_PersistentCalls:
      m_Calls: []
    m_TypeName: UnityEngine.UI.MaskableGraphic+CullStateChangedEvent, UnityEngine.UI,
      Version=1.0.0.0, Culture=neutral, PublicKeyToken=null
  m_Sprite: {fileID: 21300000, guid: 61e52879746544436b5141a2ab8b064a, type: 3}
  m_Type: 0
  m_PreserveAspect: 0
  m_FillCenter: 1
  m_FillMethod: 4
  m_FillAmount: 1
  m_FillClockwise: 1
  m_FillOrigin: 0
--- !u!222 &1710312180
CanvasRenderer:
  m_ObjectHideFlags: 0
  m_PrefabParentObject: {fileID: 22232434, guid: a023f0b31d500a3499bda65871fd2ed2,
    type: 2}
  m_PrefabInternal: {fileID: 1023513351}
  m_GameObject: {fileID: 1710312176}
--- !u!1 &1844368053
GameObject:
  m_ObjectHideFlags: 0
  m_PrefabParentObject: {fileID: 132442, guid: a023f0b31d500a3499bda65871fd2ed2, type: 2}
  m_PrefabInternal: {fileID: 1023513351}
  serializedVersion: 5
  m_Component:
  - component: {fileID: 1844368054}
  - component: {fileID: 1844368057}
  - component: {fileID: 1844368056}
  - component: {fileID: 1844368055}
  m_Layer: 5
  m_Name: ImagesButton
  m_TagString: Untagged
  m_Icon: {fileID: 0}
  m_NavMeshLayer: 0
  m_StaticEditorFlags: 0
  m_IsActive: 1
--- !u!224 &1844368054
RectTransform:
  m_ObjectHideFlags: 0
  m_PrefabParentObject: {fileID: 22432442, guid: a023f0b31d500a3499bda65871fd2ed2,
    type: 2}
  m_PrefabInternal: {fileID: 1023513351}
  m_GameObject: {fileID: 1844368053}
  m_LocalRotation: {x: 0, y: 0, z: 0, w: 1}
  m_LocalPosition: {x: 0, y: 0, z: 0}
  m_LocalScale: {x: 1, y: 1, z: 1}
  m_Children: []
  m_Father: {fileID: 1263965265}
  m_RootOrder: 1
  m_LocalEulerAnglesHint: {x: 0, y: 0, z: 0}
  m_AnchorMin: {x: 0.5, y: 0.5}
  m_AnchorMax: {x: 0.5, y: 0.5}
  m_AnchoredPosition: {x: -259.6, y: -0.00000035763}
  m_SizeDelta: {x: 47, y: 37}
  m_Pivot: {x: 0.5, y: 0.5}
--- !u!114 &1844368055
MonoBehaviour:
  m_ObjectHideFlags: 0
  m_PrefabParentObject: {fileID: 11432430, guid: a023f0b31d500a3499bda65871fd2ed2,
    type: 2}
  m_PrefabInternal: {fileID: 1023513351}
  m_GameObject: {fileID: 1844368053}
  m_Enabled: 1
  m_EditorHideFlags: 0
  m_Script: {fileID: 1392445389, guid: f5f67c52d1564df4a8936ccd202a3bd8, type: 3}
  m_Name: 
  m_EditorClassIdentifier: 
  m_Navigation:
    m_Mode: 3
    m_SelectOnUp: {fileID: 0}
    m_SelectOnDown: {fileID: 0}
    m_SelectOnLeft: {fileID: 0}
    m_SelectOnRight: {fileID: 0}
  m_Transition: 1
  m_Colors:
    m_NormalColor: {r: 1, g: 1, b: 1, a: 1}
    m_HighlightedColor: {r: 0.9607843, g: 0.9607843, b: 0.9607843, a: 1}
    m_PressedColor: {r: 0.78431374, g: 0.78431374, b: 0.78431374, a: 1}
    m_DisabledColor: {r: 0.78431374, g: 0.78431374, b: 0.78431374, a: 0.5019608}
    m_ColorMultiplier: 1
    m_FadeDuration: 0.1
  m_SpriteState:
    m_HighlightedSprite: {fileID: 0}
    m_PressedSprite: {fileID: 0}
    m_DisabledSprite: {fileID: 0}
  m_AnimationTriggers:
    m_NormalTrigger: Normal
    m_HighlightedTrigger: Highlighted
    m_PressedTrigger: Pressed
    m_DisabledTrigger: Disabled
  m_Interactable: 1
  m_TargetGraphic: {fileID: 1844368056}
  m_OnClick:
    m_PersistentCalls:
      m_Calls: []
    m_TypeName: UnityEngine.UI.Button+ButtonClickedEvent, UnityEngine.UI, Version=1.0.0.0,
      Culture=neutral, PublicKeyToken=null
--- !u!114 &1844368056
MonoBehaviour:
  m_ObjectHideFlags: 0
  m_PrefabParentObject: {fileID: 11432456, guid: a023f0b31d500a3499bda65871fd2ed2,
    type: 2}
  m_PrefabInternal: {fileID: 1023513351}
  m_GameObject: {fileID: 1844368053}
  m_Enabled: 1
  m_EditorHideFlags: 0
  m_Script: {fileID: -765806418, guid: f5f67c52d1564df4a8936ccd202a3bd8, type: 3}
  m_Name: 
  m_EditorClassIdentifier: 
  m_Material: {fileID: 0}
  m_Color: {r: 0.9647059, g: 0.9647059, b: 0.9647059, a: 1}
  m_RaycastTarget: 1
  m_OnCullStateChanged:
    m_PersistentCalls:
      m_Calls: []
    m_TypeName: UnityEngine.UI.MaskableGraphic+CullStateChangedEvent, UnityEngine.UI,
      Version=1.0.0.0, Culture=neutral, PublicKeyToken=null
  m_Sprite: {fileID: 21300000, guid: 0f41e1b09cbd84f3da1b51c88ec120ee, type: 3}
  m_Type: 0
  m_PreserveAspect: 0
  m_FillCenter: 1
  m_FillMethod: 4
  m_FillAmount: 1
  m_FillClockwise: 1
  m_FillOrigin: 0
--- !u!222 &1844368057
CanvasRenderer:
  m_ObjectHideFlags: 0
  m_PrefabParentObject: {fileID: 22232442, guid: a023f0b31d500a3499bda65871fd2ed2,
    type: 2}
  m_PrefabInternal: {fileID: 1023513351}
  m_GameObject: {fileID: 1844368053}
--- !u!1 &1952165857
GameObject:
  m_ObjectHideFlags: 0
  m_PrefabParentObject: {fileID: 132454, guid: a023f0b31d500a3499bda65871fd2ed2, type: 2}
  m_PrefabInternal: {fileID: 1023513351}
  serializedVersion: 5
  m_Component:
  - component: {fileID: 1952165858}
  - component: {fileID: 1952165860}
  - component: {fileID: 1952165859}
  m_Layer: 5
  m_Name: PhotoThumbs
  m_TagString: Untagged
  m_Icon: {fileID: 0}
  m_NavMeshLayer: 0
  m_StaticEditorFlags: 0
  m_IsActive: 1
--- !u!224 &1952165858
RectTransform:
  m_ObjectHideFlags: 0
  m_PrefabParentObject: {fileID: 22432454, guid: a023f0b31d500a3499bda65871fd2ed2,
    type: 2}
  m_PrefabInternal: {fileID: 1023513351}
  m_GameObject: {fileID: 1952165857}
  m_LocalRotation: {x: 0, y: 0, z: 0, w: 1}
  m_LocalPosition: {x: 0, y: 0, z: 0}
  m_LocalScale: {x: 1, y: 1, z: 1}
  m_Children:
  - {fileID: 620711749}
  - {fileID: 844908}
  - {fileID: 1679287965}
  - {fileID: 733084867}
  m_Father: {fileID: 1223365316}
  m_RootOrder: 1
  m_LocalEulerAnglesHint: {x: 0, y: 0, z: 0}
  m_AnchorMin: {x: 0.5, y: 0.5}
  m_AnchorMax: {x: 0.5, y: 0.5}
  m_AnchoredPosition: {x: 0, y: -363}
  m_SizeDelta: {x: 640, y: 142}
  m_Pivot: {x: 0.5, y: 0.5}
--- !u!114 &1952165859
MonoBehaviour:
  m_ObjectHideFlags: 0
  m_PrefabParentObject: {fileID: 11432472, guid: a023f0b31d500a3499bda65871fd2ed2,
    type: 2}
  m_PrefabInternal: {fileID: 1023513351}
  m_GameObject: {fileID: 1952165857}
  m_Enabled: 1
  m_EditorHideFlags: 0
  m_Script: {fileID: -765806418, guid: f5f67c52d1564df4a8936ccd202a3bd8, type: 3}
  m_Name: 
  m_EditorClassIdentifier: 
  m_Material: {fileID: 0}
  m_Color: {r: 0.09558821, g: 0.09558821, b: 0.09558821, a: 1}
  m_RaycastTarget: 1
  m_OnCullStateChanged:
    m_PersistentCalls:
      m_Calls: []
    m_TypeName: UnityEngine.UI.MaskableGraphic+CullStateChangedEvent, UnityEngine.UI,
      Version=1.0.0.0, Culture=neutral, PublicKeyToken=null
  m_Sprite: {fileID: 21300000, guid: 7ed1238760b863f4aafde32ab3a6f28c, type: 3}
  m_Type: 1
  m_PreserveAspect: 0
  m_FillCenter: 1
  m_FillMethod: 4
  m_FillAmount: 1
  m_FillClockwise: 1
  m_FillOrigin: 0
--- !u!222 &1952165860
CanvasRenderer:
  m_ObjectHideFlags: 0
  m_PrefabParentObject: {fileID: 22232454, guid: a023f0b31d500a3499bda65871fd2ed2,
    type: 2}
  m_PrefabInternal: {fileID: 1023513351}
  m_GameObject: {fileID: 1952165857}
--- !u!1 &2018726521
GameObject:
  m_ObjectHideFlags: 0
  m_PrefabParentObject: {fileID: 132452, guid: a023f0b31d500a3499bda65871fd2ed2, type: 2}
  m_PrefabInternal: {fileID: 1023513351}
  serializedVersion: 5
  m_Component:
  - component: {fileID: 2018726526}
  - component: {fileID: 2018726525}
  - component: {fileID: 2018726524}
  - component: {fileID: 2018726523}
  - component: {fileID: 2018726522}
  m_Layer: 5
  m_Name: CameraApp_2
  m_TagString: Untagged
  m_Icon: {fileID: 0}
  m_NavMeshLayer: 0
  m_StaticEditorFlags: 0
  m_IsActive: 1
--- !u!222 &2018726522
CanvasRenderer:
  m_ObjectHideFlags: 0
  m_PrefabParentObject: {fileID: 22232452, guid: a023f0b31d500a3499bda65871fd2ed2,
    type: 2}
  m_PrefabInternal: {fileID: 1023513351}
  m_GameObject: {fileID: 2018726521}
--- !u!114 &2018726523
MonoBehaviour:
  m_ObjectHideFlags: 0
  m_PrefabParentObject: {fileID: 11432468, guid: a023f0b31d500a3499bda65871fd2ed2,
    type: 2}
  m_PrefabInternal: {fileID: 1023513351}
  m_GameObject: {fileID: 2018726521}
  m_Enabled: 1
  m_EditorHideFlags: 0
  m_Script: {fileID: 1301386320, guid: f5f67c52d1564df4a8936ccd202a3bd8, type: 3}
  m_Name: 
  m_EditorClassIdentifier: 
  m_IgnoreReversedGraphics: 1
  m_BlockingObjects: 0
  m_BlockingMask:
    serializedVersion: 2
    m_Bits: 4294967295
--- !u!114 &2018726524
MonoBehaviour:
  m_ObjectHideFlags: 0
  m_PrefabParentObject: {fileID: 11432470, guid: a023f0b31d500a3499bda65871fd2ed2,
    type: 2}
  m_PrefabInternal: {fileID: 1023513351}
  m_GameObject: {fileID: 2018726521}
  m_Enabled: 1
  m_EditorHideFlags: 0
  m_Script: {fileID: 1980459831, guid: f5f67c52d1564df4a8936ccd202a3bd8, type: 3}
  m_Name: 
  m_EditorClassIdentifier: 
  m_UiScaleMode: 1
  m_ReferencePixelsPerUnit: 100
  m_ScaleFactor: 1
  m_ReferenceResolution: {x: 640, y: 1136}
  m_ScreenMatchMode: 0
  m_MatchWidthOrHeight: 1
  m_PhysicalUnit: 3
  m_FallbackScreenDPI: 96
  m_DefaultSpriteDPI: 96
  m_DynamicPixelsPerUnit: 1
--- !u!223 &2018726525
Canvas:
  m_ObjectHideFlags: 0
  m_PrefabParentObject: {fileID: 22332424, guid: a023f0b31d500a3499bda65871fd2ed2,
    type: 2}
  m_PrefabInternal: {fileID: 1023513351}
  m_GameObject: {fileID: 2018726521}
  m_Enabled: 1
  serializedVersion: 3
  m_RenderMode: 0
  m_Camera: {fileID: 0}
  m_PlaneDistance: 100
  m_PixelPerfect: 1
  m_ReceivesEvents: 1
  m_OverrideSorting: 0
  m_OverridePixelPerfect: 0
  m_SortingBucketNormalizedSize: 0
  m_AdditionalShaderChannelsFlag: 25
  m_SortingLayerID: 0
  m_SortingOrder: 0
  m_TargetDisplay: 0
--- !u!224 &2018726526
RectTransform:
  m_ObjectHideFlags: 0
  m_PrefabParentObject: {fileID: 22432452, guid: a023f0b31d500a3499bda65871fd2ed2,
    type: 2}
  m_PrefabInternal: {fileID: 1023513351}
  m_GameObject: {fileID: 2018726521}
  m_LocalRotation: {x: 0, y: 0, z: 0, w: 1}
  m_LocalPosition: {x: 0, y: 0, z: 0}
  m_LocalScale: {x: 0, y: 0, z: 0}
  m_Children:
  - {fileID: 1060986982}
  - {fileID: 1223365316}
  m_Father: {fileID: 0}
  m_RootOrder: 0
  m_LocalEulerAnglesHint: {x: 0, y: 0, z: 0}
  m_AnchorMin: {x: 0, y: 0}
  m_AnchorMax: {x: 0, y: 0}
  m_AnchoredPosition: {x: 0, y: 0}
  m_SizeDelta: {x: 0, y: 0}
  m_Pivot: {x: 0, y: 0}
--- !u!1 &2062893098
GameObject:
  m_ObjectHideFlags: 0
  m_PrefabParentObject: {fileID: 132462, guid: a023f0b31d500a3499bda65871fd2ed2, type: 2}
  m_PrefabInternal: {fileID: 1023513351}
  serializedVersion: 5
  m_Component:
  - component: {fileID: 2062893099}
  - component: {fileID: 2062893101}
  - component: {fileID: 2062893100}
  m_Layer: 5
  m_Name: Image
  m_TagString: Untagged
  m_Icon: {fileID: 0}
  m_NavMeshLayer: 0
  m_StaticEditorFlags: 0
  m_IsActive: 1
--- !u!224 &2062893099
RectTransform:
  m_ObjectHideFlags: 0
  m_PrefabParentObject: {fileID: 22432462, guid: a023f0b31d500a3499bda65871fd2ed2,
    type: 2}
  m_PrefabInternal: {fileID: 1023513351}
  m_GameObject: {fileID: 2062893098}
  m_LocalRotation: {x: 0, y: 0, z: 0, w: 1}
  m_LocalPosition: {x: 0, y: 0, z: 0}
  m_LocalScale: {x: 1, y: 1, z: 1}
  m_Children: []
  m_Father: {fileID: 1679287965}
  m_RootOrder: 0
  m_LocalEulerAnglesHint: {x: 0, y: 0, z: 0}
  m_AnchorMin: {x: 0.5, y: 0.5}
  m_AnchorMax: {x: 0.5, y: 0.5}
  m_AnchoredPosition: {x: 0, y: 0}
  m_SizeDelta: {x: 100, y: 100}
  m_Pivot: {x: 0.5, y: 0.5}
--- !u!114 &2062893100
MonoBehaviour:
  m_ObjectHideFlags: 0
  m_PrefabParentObject: {fileID: 11432482, guid: a023f0b31d500a3499bda65871fd2ed2,
    type: 2}
  m_PrefabInternal: {fileID: 1023513351}
  m_GameObject: {fileID: 2062893098}
  m_Enabled: 1
  m_EditorHideFlags: 0
  m_Script: {fileID: -765806418, guid: f5f67c52d1564df4a8936ccd202a3bd8, type: 3}
  m_Name: 
  m_EditorClassIdentifier: 
  m_Material: {fileID: 0}
  m_Color: {r: 1, g: 1, b: 1, a: 0.41960785}
  m_RaycastTarget: 1
  m_OnCullStateChanged:
    m_PersistentCalls:
      m_Calls: []
    m_TypeName: UnityEngine.UI.MaskableGraphic+CullStateChangedEvent, UnityEngine.UI,
      Version=1.0.0.0, Culture=neutral, PublicKeyToken=null
  m_Sprite: {fileID: 21300000, guid: 95440f7ecc37385488657c52ca07fcfc, type: 3}
  m_Type: 1
  m_PreserveAspect: 0
  m_FillCenter: 1
  m_FillMethod: 4
  m_FillAmount: 1
  m_FillClockwise: 1
  m_FillOrigin: 0
--- !u!222 &2062893101
CanvasRenderer:
  m_ObjectHideFlags: 0
  m_PrefabParentObject: {fileID: 22232462, guid: a023f0b31d500a3499bda65871fd2ed2,
    type: 2}
  m_PrefabInternal: {fileID: 1023513351}
  m_GameObject: {fileID: 2062893098}
