%YAML 1.1
%TAG !u! tag:unity3d.com,2011:
--- !u!29 &1
OcclusionCullingSettings:
  m_ObjectHideFlags: 0
  serializedVersion: 2
  m_OcclusionBakeSettings:
    smallestOccluder: 5
    smallestHole: 0.25
    backfaceThreshold: 100
  m_SceneGUID: 00000000000000000000000000000000
  m_OcclusionCullingData: {fileID: 0}
--- !u!104 &2
RenderSettings:
  m_ObjectHideFlags: 0
  serializedVersion: 8
  m_Fog: 0
  m_FogColor: {r: 0.5, g: 0.5, b: 0.5, a: 1}
  m_FogMode: 3
  m_FogDensity: 0.01
  m_LinearFogStart: 0
  m_LinearFogEnd: 300
  m_AmbientSkyColor: {r: 0.212, g: 0.227, b: 0.259, a: 1}
  m_AmbientEquatorColor: {r: 0.114, g: 0.125, b: 0.133, a: 1}
  m_AmbientGroundColor: {r: 0.047, g: 0.043, b: 0.035, a: 1}
  m_AmbientIntensity: 1
  m_AmbientMode: 0
  m_SubtractiveShadowColor: {r: 0.42, g: 0.478, b: 0.627, a: 1}
  m_SkyboxMaterial: {fileID: 10304, guid: 0000000000000000f000000000000000, type: 0}
  m_HaloStrength: 0.5
  m_FlareStrength: 1
  m_FlareFadeSpeed: 3
  m_HaloTexture: {fileID: 0}
  m_SpotCookie: {fileID: 10001, guid: 0000000000000000e000000000000000, type: 0}
  m_DefaultReflectionMode: 0
  m_DefaultReflectionResolution: 128
  m_ReflectionBounces: 1
  m_ReflectionIntensity: 1
  m_CustomReflection: {fileID: 0}
  m_Sun: {fileID: 0}
  m_IndirectSpecularColor: {r: 0, g: 0, b: 0, a: 1}
--- !u!157 &4
LightmapSettings:
  m_ObjectHideFlags: 0
  serializedVersion: 9
  m_GIWorkflowMode: 0
  m_GISettings:
    serializedVersion: 2
    m_BounceScale: 1
    m_IndirectOutputScale: 1
    m_AlbedoBoost: 1
    m_TemporalCoherenceThreshold: 1
    m_EnvironmentLightingMode: 0
    m_EnableBakedLightmaps: 1
    m_EnableRealtimeLightmaps: 1
  m_LightmapEditorSettings:
    serializedVersion: 8
    m_Resolution: 2
    m_BakeResolution: 40
    m_TextureWidth: 1024
    m_TextureHeight: 1024
    m_AO: 0
    m_AOMaxDistance: 1
    m_CompAOExponent: 0
    m_CompAOExponentDirect: 0
    m_Padding: 2
    m_LightmapParameters: {fileID: 0}
    m_LightmapsBakeMode: 1
    m_TextureCompression: 1
    m_FinalGather: 0
    m_FinalGatherFiltering: 1
    m_FinalGatherRayCount: 1024
    m_ReflectionCompression: 2
    m_MixedBakeMode: 1
    m_BakeBackend: 0
    m_PVRSampling: 1
    m_PVRDirectSampleCount: 32
    m_PVRSampleCount: 500
    m_PVRBounces: 2
    m_PVRFiltering: 0
    m_PVRFilteringMode: 1
    m_PVRCulling: 1
    m_PVRFilteringGaussRadiusDirect: 1
    m_PVRFilteringGaussRadiusIndirect: 5
    m_PVRFilteringGaussRadiusAO: 2
    m_PVRFilteringAtrousColorSigma: 1
    m_PVRFilteringAtrousNormalSigma: 1
    m_PVRFilteringAtrousPositionSigma: 1
  m_LightingDataAsset: {fileID: 0}
  m_ShadowMaskMode: 2
--- !u!196 &5
NavMeshSettings:
  serializedVersion: 2
  m_ObjectHideFlags: 0
  m_BuildSettings:
    serializedVersion: 2
    agentTypeID: 0
    agentRadius: 0.5
    agentHeight: 2
    agentSlope: 45
    agentClimb: 0.4
    ledgeDropHeight: 0
    maxJumpAcrossDistance: 0
    minRegionArea: 2
    manualCellSize: 0
    cellSize: 0.16666667
    manualTileSize: 0
    tileSize: 256
    accuratePlacement: 0
  m_NavMeshData: {fileID: 0}
--- !u!1 &30508338
GameObject:
  m_ObjectHideFlags: 0
  m_PrefabParentObject: {fileID: 186250, guid: 9fbc11c80d160ec44896f2b835275276, type: 2}
  m_PrefabInternal: {fileID: 1145497095}
  serializedVersion: 5
  m_Component:
  - component: {fileID: 30508339}
  - component: {fileID: 30508341}
  - component: {fileID: 30508340}
  m_Layer: 5
  m_Name: MapElemenets
  m_TagString: Untagged
  m_Icon: {fileID: 0}
  m_NavMeshLayer: 0
  m_StaticEditorFlags: 0
  m_IsActive: 1
--- !u!224 &30508339
RectTransform:
  m_ObjectHideFlags: 0
  m_PrefabParentObject: {fileID: 22486250, guid: 9fbc11c80d160ec44896f2b835275276,
    type: 2}
  m_PrefabInternal: {fileID: 1145497095}
  m_GameObject: {fileID: 30508338}
  m_LocalRotation: {x: 0, y: 0, z: 0.38268292, w: 0.92387974}
  m_LocalPosition: {x: 0, y: 0, z: 0}
  m_LocalScale: {x: 0.49999997, y: 0.49999997, z: 1}
  m_Children: []
  m_Father: {fileID: 653376405}
  m_RootOrder: 5
  m_LocalEulerAnglesHint: {x: 0, y: 0, z: 0}
  m_AnchorMin: {x: 0.5, y: 0.5}
  m_AnchorMax: {x: 0.5, y: 0.5}
  m_AnchoredPosition: {x: -134, y: 194}
  m_SizeDelta: {x: 150, y: 150}
  m_Pivot: {x: 0.5, y: 0.5}
--- !u!114 &30508340
MonoBehaviour:
  m_ObjectHideFlags: 0
  m_PrefabParentObject: {fileID: 11486250, guid: 9fbc11c80d160ec44896f2b835275276,
    type: 2}
  m_PrefabInternal: {fileID: 1145497095}
  m_GameObject: {fileID: 30508338}
  m_Enabled: 1
  m_EditorHideFlags: 0
  m_Script: {fileID: -765806418, guid: f5f67c52d1564df4a8936ccd202a3bd8, type: 3}
  m_Name: 
  m_EditorClassIdentifier: 
  m_Material: {fileID: 0}
  m_Color: {r: 0.9529412, g: 0.9019608, b: 0.76862746, a: 1}
  m_RaycastTarget: 1
  m_OnCullStateChanged:
    m_PersistentCalls:
      m_Calls: []
    m_TypeName: UnityEngine.UI.MaskableGraphic+CullStateChangedEvent, UnityEngine.UI,
      Version=1.0.0.0, Culture=neutral, PublicKeyToken=null
  m_Sprite: {fileID: 21300000, guid: 149ad5777c7580a4b8a6b1810a830f7a, type: 3}
  m_Type: 1
  m_PreserveAspect: 0
  m_FillCenter: 1
  m_FillMethod: 4
  m_FillAmount: 1
  m_FillClockwise: 1
  m_FillOrigin: 0
--- !u!222 &30508341
CanvasRenderer:
  m_ObjectHideFlags: 0
  m_PrefabParentObject: {fileID: 22286250, guid: 9fbc11c80d160ec44896f2b835275276,
    type: 2}
  m_PrefabInternal: {fileID: 1145497095}
  m_GameObject: {fileID: 30508338}
--- !u!1 &47812406
GameObject:
  m_ObjectHideFlags: 0
  m_PrefabParentObject: {fileID: 186230, guid: 9fbc11c80d160ec44896f2b835275276, type: 2}
  m_PrefabInternal: {fileID: 1145497095}
  serializedVersion: 5
  m_Component:
  - component: {fileID: 47812407}
  - component: {fileID: 47812409}
  - component: {fileID: 47812408}
  m_Layer: 5
  m_Name: Panel
  m_TagString: Untagged
  m_Icon: {fileID: 0}
  m_NavMeshLayer: 0
  m_StaticEditorFlags: 0
  m_IsActive: 1
--- !u!224 &47812407
RectTransform:
  m_ObjectHideFlags: 0
  m_PrefabParentObject: {fileID: 22486230, guid: 9fbc11c80d160ec44896f2b835275276,
    type: 2}
  m_PrefabInternal: {fileID: 1145497095}
  m_GameObject: {fileID: 47812406}
  m_LocalRotation: {x: 0, y: 0, z: 0, w: 1}
  m_LocalPosition: {x: 0, y: 0, z: 0}
  m_LocalScale: {x: 1, y: 1, z: 1}
  m_Children: []
  m_Father: {fileID: 1938611963}
  m_RootOrder: 0
  m_LocalEulerAnglesHint: {x: 0, y: 0, z: 0}
  m_AnchorMin: {x: 0.5, y: 0.5}
  m_AnchorMax: {x: 0.5, y: 0.5}
  m_AnchoredPosition: {x: 125, y: -125}
  m_SizeDelta: {x: 80, y: 80}
  m_Pivot: {x: 0.5, y: 0.5}
--- !u!114 &47812408
MonoBehaviour:
  m_ObjectHideFlags: 0
  m_PrefabParentObject: {fileID: 11486226, guid: 9fbc11c80d160ec44896f2b835275276,
    type: 2}
  m_PrefabInternal: {fileID: 1145497095}
  m_GameObject: {fileID: 47812406}
  m_Enabled: 1
  m_EditorHideFlags: 0
  m_Script: {fileID: -765806418, guid: f5f67c52d1564df4a8936ccd202a3bd8, type: 3}
  m_Name: 
  m_EditorClassIdentifier: 
  m_Material: {fileID: 0}
  m_Color: {r: 0.15686275, g: 0.65882355, b: 0.8784314, a: 1}
  m_RaycastTarget: 1
  m_OnCullStateChanged:
    m_PersistentCalls:
      m_Calls: []
    m_TypeName: UnityEngine.UI.MaskableGraphic+CullStateChangedEvent, UnityEngine.UI,
      Version=1.0.0.0, Culture=neutral, PublicKeyToken=null
  m_Sprite: {fileID: 21300000, guid: 8da86438290b7d64eb1d62723389c0d3, type: 3}
  m_Type: 1
  m_PreserveAspect: 0
  m_FillCenter: 1
  m_FillMethod: 4
  m_FillAmount: 1
  m_FillClockwise: 1
  m_FillOrigin: 0
--- !u!222 &47812409
CanvasRenderer:
  m_ObjectHideFlags: 0
  m_PrefabParentObject: {fileID: 22286232, guid: 9fbc11c80d160ec44896f2b835275276,
    type: 2}
  m_PrefabInternal: {fileID: 1145497095}
  m_GameObject: {fileID: 47812406}
--- !u!1 &67950744
GameObject:
  m_ObjectHideFlags: 0
  m_PrefabParentObject: {fileID: 186228, guid: 9fbc11c80d160ec44896f2b835275276, type: 2}
  m_PrefabInternal: {fileID: 1145497095}
  serializedVersion: 5
  m_Component:
  - component: {fileID: 67950745}
  - component: {fileID: 67950747}
  - component: {fileID: 67950746}
  m_Layer: 5
  m_Name: MapElemenets
  m_TagString: Untagged
  m_Icon: {fileID: 0}
  m_NavMeshLayer: 0
  m_StaticEditorFlags: 0
  m_IsActive: 1
--- !u!224 &67950745
RectTransform:
  m_ObjectHideFlags: 0
  m_PrefabParentObject: {fileID: 22486228, guid: 9fbc11c80d160ec44896f2b835275276,
    type: 2}
  m_PrefabInternal: {fileID: 1145497095}
  m_GameObject: {fileID: 67950744}
  m_LocalRotation: {x: 0, y: 0, z: 0.1543176, w: -0.9880214}
  m_LocalPosition: {x: 0, y: 0, z: 0}
  m_LocalScale: {x: 1, y: 1, z: 1}
  m_Children: []
  m_Father: {fileID: 653376405}
  m_RootOrder: 3
  m_LocalEulerAnglesHint: {x: 0, y: 0, z: 0}
  m_AnchorMin: {x: 0.5, y: 0.5}
  m_AnchorMax: {x: 0.5, y: 0.5}
  m_AnchoredPosition: {x: -15, y: 535}
  m_SizeDelta: {x: 308, y: 100}
  m_Pivot: {x: 0.5, y: 0.5}
--- !u!114 &67950746
MonoBehaviour:
  m_ObjectHideFlags: 0
  m_PrefabParentObject: {fileID: 11486224, guid: 9fbc11c80d160ec44896f2b835275276,
    type: 2}
  m_PrefabInternal: {fileID: 1145497095}
  m_GameObject: {fileID: 67950744}
  m_Enabled: 1
  m_EditorHideFlags: 0
  m_Script: {fileID: -765806418, guid: f5f67c52d1564df4a8936ccd202a3bd8, type: 3}
  m_Name: 
  m_EditorClassIdentifier: 
  m_Material: {fileID: 0}
  m_Color: {r: 0.12156863, g: 0.8392157, b: 0.5882353, a: 1}
  m_RaycastTarget: 1
  m_OnCullStateChanged:
    m_PersistentCalls:
      m_Calls: []
    m_TypeName: UnityEngine.UI.MaskableGraphic+CullStateChangedEvent, UnityEngine.UI,
      Version=1.0.0.0, Culture=neutral, PublicKeyToken=null
  m_Sprite: {fileID: 21300000, guid: 8da86438290b7d64eb1d62723389c0d3, type: 3}
  m_Type: 1
  m_PreserveAspect: 0
  m_FillCenter: 1
  m_FillMethod: 4
  m_FillAmount: 1
  m_FillClockwise: 1
  m_FillOrigin: 0
--- !u!222 &67950747
CanvasRenderer:
  m_ObjectHideFlags: 0
  m_PrefabParentObject: {fileID: 22286230, guid: 9fbc11c80d160ec44896f2b835275276,
    type: 2}
  m_PrefabInternal: {fileID: 1145497095}
  m_GameObject: {fileID: 67950744}
--- !u!1 &81658169
GameObject:
  m_ObjectHideFlags: 0
  m_PrefabParentObject: {fileID: 186244, guid: 9fbc11c80d160ec44896f2b835275276, type: 2}
  m_PrefabInternal: {fileID: 1145497095}
  serializedVersion: 5
  m_Component:
  - component: {fileID: 81658170}
  - component: {fileID: 81658172}
  - component: {fileID: 81658171}
  m_Layer: 5
  m_Name: AppTitle
  m_TagString: Untagged
  m_Icon: {fileID: 0}
  m_NavMeshLayer: 0
  m_StaticEditorFlags: 0
  m_IsActive: 1
--- !u!224 &81658170
RectTransform:
  m_ObjectHideFlags: 0
  m_PrefabParentObject: {fileID: 22486244, guid: 9fbc11c80d160ec44896f2b835275276,
    type: 2}
  m_PrefabInternal: {fileID: 1145497095}
  m_GameObject: {fileID: 81658169}
  m_LocalRotation: {x: 0, y: 0, z: 0, w: 1}
  m_LocalPosition: {x: 0, y: 0, z: 0}
  m_LocalScale: {x: 1, y: 1, z: 1}
  m_Children:
  - {fileID: 586704755}
  m_Father: {fileID: 780924406}
  m_RootOrder: 0
  m_LocalEulerAnglesHint: {x: 0, y: 0, z: 0}
  m_AnchorMin: {x: 0.5, y: 0.5}
  m_AnchorMax: {x: 0.5, y: 0.5}
  m_AnchoredPosition: {x: 27.495, y: 633}
  m_SizeDelta: {x: 695, y: 109}
  m_Pivot: {x: 0.5, y: 0.5}
--- !u!114 &81658171
MonoBehaviour:
  m_ObjectHideFlags: 0
  m_PrefabParentObject: {fileID: 11486242, guid: 9fbc11c80d160ec44896f2b835275276,
    type: 2}
  m_PrefabInternal: {fileID: 1145497095}
  m_GameObject: {fileID: 81658169}
  m_Enabled: 1
  m_EditorHideFlags: 0
  m_Script: {fileID: 708705254, guid: f5f67c52d1564df4a8936ccd202a3bd8, type: 3}
  m_Name: 
  m_EditorClassIdentifier: 
  m_Material: {fileID: 0}
  m_Color: {r: 0.85490197, g: 0.85490197, b: 0.85490197, a: 1}
  m_RaycastTarget: 1
  m_OnCullStateChanged:
    m_PersistentCalls:
      m_Calls: []
    m_TypeName: UnityEngine.UI.MaskableGraphic+CullStateChangedEvent, UnityEngine.UI,
      Version=1.0.0.0, Culture=neutral, PublicKeyToken=null
  m_FontData:
    m_Font: {fileID: 12800000, guid: 218956a5c2a6e42d6a60afccf80b002b, type: 3}
    m_FontSize: 102
    m_FontStyle: 0
    m_BestFit: 0
    m_MinSize: 10
    m_MaxSize: 102
    m_Alignment: 0
    m_AlignByGeometry: 0
    m_RichText: 1
    m_HorizontalOverflow: 0
    m_VerticalOverflow: 1
    m_LineSpacing: 1
  m_Text: GAME
--- !u!222 &81658172
CanvasRenderer:
  m_ObjectHideFlags: 0
  m_PrefabParentObject: {fileID: 22286246, guid: 9fbc11c80d160ec44896f2b835275276,
    type: 2}
  m_PrefabInternal: {fileID: 1145497095}
  m_GameObject: {fileID: 81658169}
--- !u!1 &300072429
GameObject:
  m_ObjectHideFlags: 0
  m_PrefabParentObject: {fileID: 186248, guid: 9fbc11c80d160ec44896f2b835275276, type: 2}
  m_PrefabInternal: {fileID: 1145497095}
  serializedVersion: 5
  m_Component:
  - component: {fileID: 300072430}
  - component: {fileID: 300072432}
  - component: {fileID: 300072431}
  m_Layer: 5
  m_Name: MapElemenets
  m_TagString: Untagged
  m_Icon: {fileID: 0}
  m_NavMeshLayer: 0
  m_StaticEditorFlags: 0
  m_IsActive: 1
--- !u!224 &300072430
RectTransform:
  m_ObjectHideFlags: 0
  m_PrefabParentObject: {fileID: 22486248, guid: 9fbc11c80d160ec44896f2b835275276,
    type: 2}
  m_PrefabInternal: {fileID: 1145497095}
  m_GameObject: {fileID: 300072429}
  m_LocalRotation: {x: 0, y: 0, z: 0, w: 1}
  m_LocalPosition: {x: 0, y: 0, z: 0}
  m_LocalScale: {x: 1, y: 1, z: 1}
  m_Children: []
  m_Father: {fileID: 653376405}
  m_RootOrder: 2
  m_LocalEulerAnglesHint: {x: 0, y: 0, z: 0}
  m_AnchorMin: {x: 0.5, y: 0.5}
  m_AnchorMax: {x: 0.5, y: 0.5}
  m_AnchoredPosition: {x: -183, y: 365}
  m_SizeDelta: {x: 163, y: 81}
  m_Pivot: {x: 0.5, y: 0.5}
--- !u!114 &300072431
MonoBehaviour:
  m_ObjectHideFlags: 0
  m_PrefabParentObject: {fileID: 11486248, guid: 9fbc11c80d160ec44896f2b835275276,
    type: 2}
  m_PrefabInternal: {fileID: 1145497095}
  m_GameObject: {fileID: 300072429}
  m_Enabled: 1
  m_EditorHideFlags: 0
  m_Script: {fileID: -765806418, guid: f5f67c52d1564df4a8936ccd202a3bd8, type: 3}
  m_Name: 
  m_EditorClassIdentifier: 
  m_Material: {fileID: 0}
  m_Color: {r: 0.9490196, g: 0.8980392, b: 0.7647059, a: 1}
  m_RaycastTarget: 1
  m_OnCullStateChanged:
    m_PersistentCalls:
      m_Calls: []
    m_TypeName: UnityEngine.UI.MaskableGraphic+CullStateChangedEvent, UnityEngine.UI,
      Version=1.0.0.0, Culture=neutral, PublicKeyToken=null
  m_Sprite: {fileID: 21300000, guid: 8da86438290b7d64eb1d62723389c0d3, type: 3}
  m_Type: 1
  m_PreserveAspect: 0
  m_FillCenter: 1
  m_FillMethod: 4
  m_FillAmount: 1
  m_FillClockwise: 1
  m_FillOrigin: 0
--- !u!222 &300072432
CanvasRenderer:
  m_ObjectHideFlags: 0
  m_PrefabParentObject: {fileID: 22286248, guid: 9fbc11c80d160ec44896f2b835275276,
    type: 2}
  m_PrefabInternal: {fileID: 1145497095}
  m_GameObject: {fileID: 300072429}
--- !u!1 &471290614
GameObject:
  m_ObjectHideFlags: 0
  m_PrefabParentObject: {fileID: 186234, guid: 9fbc11c80d160ec44896f2b835275276, type: 2}
  m_PrefabInternal: {fileID: 1145497095}
  serializedVersion: 5
  m_Component:
  - component: {fileID: 471290615}
  - component: {fileID: 471290617}
  - component: {fileID: 471290616}
  m_Layer: 5
  m_Name: MapElemenets
  m_TagString: Untagged
  m_Icon: {fileID: 0}
  m_NavMeshLayer: 0
  m_StaticEditorFlags: 0
  m_IsActive: 1
--- !u!224 &471290615
RectTransform:
  m_ObjectHideFlags: 0
  m_PrefabParentObject: {fileID: 22486234, guid: 9fbc11c80d160ec44896f2b835275276,
    type: 2}
  m_PrefabInternal: {fileID: 1145497095}
  m_GameObject: {fileID: 471290614}
  m_LocalRotation: {x: 0, y: 0, z: 0, w: 1}
  m_LocalPosition: {x: 0, y: 0, z: 0}
  m_LocalScale: {x: 1, y: 1, z: 1}
  m_Children: []
  m_Father: {fileID: 653376405}
  m_RootOrder: 1
  m_LocalEulerAnglesHint: {x: 0, y: 0, z: 0}
  m_AnchorMin: {x: 0.5, y: 0.5}
  m_AnchorMax: {x: 0.5, y: 0.5}
  m_AnchoredPosition: {x: 193.09998, y: 194}
  m_SizeDelta: {x: 205, y: 125}
  m_Pivot: {x: 0.5, y: 0.5}
--- !u!114 &471290616
MonoBehaviour:
  m_ObjectHideFlags: 0
  m_PrefabParentObject: {fileID: 11486230, guid: 9fbc11c80d160ec44896f2b835275276,
    type: 2}
  m_PrefabInternal: {fileID: 1145497095}
  m_GameObject: {fileID: 471290614}
  m_Enabled: 1
  m_EditorHideFlags: 0
  m_Script: {fileID: -765806418, guid: f5f67c52d1564df4a8936ccd202a3bd8, type: 3}
  m_Name: 
  m_EditorClassIdentifier: 
  m_Material: {fileID: 0}
  m_Color: {r: 0.9529412, g: 0.9019608, b: 0.76862746, a: 1}
  m_RaycastTarget: 1
  m_OnCullStateChanged:
    m_PersistentCalls:
      m_Calls: []
    m_TypeName: UnityEngine.UI.MaskableGraphic+CullStateChangedEvent, UnityEngine.UI,
      Version=1.0.0.0, Culture=neutral, PublicKeyToken=null
  m_Sprite: {fileID: 21300000, guid: 8da86438290b7d64eb1d62723389c0d3, type: 3}
  m_Type: 1
  m_PreserveAspect: 0
  m_FillCenter: 1
  m_FillMethod: 4
  m_FillAmount: 1
  m_FillClockwise: 1
  m_FillOrigin: 0
--- !u!222 &471290617
CanvasRenderer:
  m_ObjectHideFlags: 0
  m_PrefabParentObject: {fileID: 22286236, guid: 9fbc11c80d160ec44896f2b835275276,
    type: 2}
  m_PrefabInternal: {fileID: 1145497095}
  m_GameObject: {fileID: 471290614}
--- !u!1 &586704754
GameObject:
  m_ObjectHideFlags: 0
  m_PrefabParentObject: {fileID: 186242, guid: 9fbc11c80d160ec44896f2b835275276, type: 2}
  m_PrefabInternal: {fileID: 1145497095}
  serializedVersion: 5
  m_Component:
  - component: {fileID: 586704755}
  - component: {fileID: 586704757}
  - component: {fileID: 586704756}
  m_Layer: 5
  m_Name: AppTitle
  m_TagString: Untagged
  m_Icon: {fileID: 0}
  m_NavMeshLayer: 0
  m_StaticEditorFlags: 0
  m_IsActive: 1
--- !u!224 &586704755
RectTransform:
  m_ObjectHideFlags: 0
  m_PrefabParentObject: {fileID: 22486242, guid: 9fbc11c80d160ec44896f2b835275276,
    type: 2}
  m_PrefabInternal: {fileID: 1145497095}
  m_GameObject: {fileID: 586704754}
  m_LocalRotation: {x: 0, y: 0, z: 0, w: 1}
  m_LocalPosition: {x: 0, y: 0, z: 0}
  m_LocalScale: {x: 1, y: 1, z: 1}
  m_Children: []
  m_Father: {fileID: 81658170}
  m_RootOrder: 0
  m_LocalEulerAnglesHint: {x: 0, y: 0, z: 0}
  m_AnchorMin: {x: 0.5, y: 0.5}
  m_AnchorMax: {x: 0.5, y: 0.5}
  m_AnchoredPosition: {x: 295, y: -68}
  m_SizeDelta: {x: 695, y: 109}
  m_Pivot: {x: 0.5, y: 0.5}
--- !u!114 &586704756
MonoBehaviour:
  m_ObjectHideFlags: 0
  m_PrefabParentObject: {fileID: 11486240, guid: 9fbc11c80d160ec44896f2b835275276,
    type: 2}
  m_PrefabInternal: {fileID: 1145497095}
  m_GameObject: {fileID: 586704754}
  m_Enabled: 1
  m_EditorHideFlags: 0
  m_Script: {fileID: 708705254, guid: f5f67c52d1564df4a8936ccd202a3bd8, type: 3}
  m_Name: 
  m_EditorClassIdentifier: 
  m_Material: {fileID: 0}
  m_Color: {r: 0.85490197, g: 0.85490197, b: 0.85490197, a: 1}
  m_RaycastTarget: 1
  m_OnCullStateChanged:
    m_PersistentCalls:
      m_Calls: []
    m_TypeName: UnityEngine.UI.MaskableGraphic+CullStateChangedEvent, UnityEngine.UI,
      Version=1.0.0.0, Culture=neutral, PublicKeyToken=null
  m_FontData:
    m_Font: {fileID: 12800000, guid: 218956a5c2a6e42d6a60afccf80b002b, type: 3}
    m_FontSize: 40
    m_FontStyle: 0
    m_BestFit: 0
    m_MinSize: 10
    m_MaxSize: 40
    m_Alignment: 0
    m_AlignByGeometry: 0
    m_RichText: 1
    m_HorizontalOverflow: 0
    m_VerticalOverflow: 1
    m_LineSpacing: 1
  m_Text: EXAMPLE
--- !u!222 &586704757
CanvasRenderer:
  m_ObjectHideFlags: 0
  m_PrefabParentObject: {fileID: 22286244, guid: 9fbc11c80d160ec44896f2b835275276,
    type: 2}
  m_PrefabInternal: {fileID: 1145497095}
  m_GameObject: {fileID: 586704754}
--- !u!1 &653376404
GameObject:
  m_ObjectHideFlags: 0
  m_PrefabParentObject: {fileID: 186238, guid: 9fbc11c80d160ec44896f2b835275276, type: 2}
  m_PrefabInternal: {fileID: 1145497095}
  serializedVersion: 5
  m_Component:
  - component: {fileID: 653376405}
  - component: {fileID: 653376408}
  - component: {fileID: 653376407}
  - component: {fileID: 653376406}
  m_Layer: 5
  m_Name: Panel
  m_TagString: Untagged
  m_Icon: {fileID: 0}
  m_NavMeshLayer: 0
  m_StaticEditorFlags: 0
  m_IsActive: 1
--- !u!224 &653376405
RectTransform:
  m_ObjectHideFlags: 0
  m_PrefabParentObject: {fileID: 22486238, guid: 9fbc11c80d160ec44896f2b835275276,
    type: 2}
  m_PrefabInternal: {fileID: 1145497095}
  m_GameObject: {fileID: 653376404}
  m_LocalRotation: {x: 0, y: 0, z: 0, w: 1}
  m_LocalPosition: {x: 0, y: 0, z: 0}
  m_LocalScale: {x: 1, y: 1, z: 1}
  m_Children:
  - {fileID: 1155232656}
  - {fileID: 471290615}
  - {fileID: 300072430}
  - {fileID: 67950745}
  - {fileID: 1256349390}
  - {fileID: 30508339}
  - {fileID: 1938611963}
  - {fileID: 1035596500}
  m_Father: {fileID: 780924406}
  m_RootOrder: 1
  m_LocalEulerAnglesHint: {x: 0, y: 0, z: 0}
  m_AnchorMin: {x: 0.5, y: 0.5}
  m_AnchorMax: {x: 0.5, y: 0.5}
  m_AnchoredPosition: {x: 0, y: -0.020019531}
  m_SizeDelta: {x: 640, y: 1136}
  m_Pivot: {x: 0.5, y: 0.5}
--- !u!114 &653376406
MonoBehaviour:
  m_ObjectHideFlags: 0
  m_PrefabParentObject: {fileID: 11486236, guid: 9fbc11c80d160ec44896f2b835275276,
    type: 2}
  m_PrefabInternal: {fileID: 1145497095}
  m_GameObject: {fileID: 653376404}
  m_Enabled: 1
  m_EditorHideFlags: 0
  m_Script: {fileID: -1200242548, guid: f5f67c52d1564df4a8936ccd202a3bd8, type: 3}
  m_Name: 
  m_EditorClassIdentifier: 
  m_ShowMaskGraphic: 1
--- !u!114 &653376407
MonoBehaviour:
  m_ObjectHideFlags: 0
  m_PrefabParentObject: {fileID: 11486234, guid: 9fbc11c80d160ec44896f2b835275276,
    type: 2}
  m_PrefabInternal: {fileID: 1145497095}
  m_GameObject: {fileID: 653376404}
  m_Enabled: 1
  m_EditorHideFlags: 0
  m_Script: {fileID: -765806418, guid: f5f67c52d1564df4a8936ccd202a3bd8, type: 3}
  m_Name: 
  m_EditorClassIdentifier: 
  m_Material: {fileID: 0}
  m_Color: {r: 0.19215687, g: 0.2, b: 0.21176471, a: 1}
  m_RaycastTarget: 1
  m_OnCullStateChanged:
    m_PersistentCalls:
      m_Calls: []
    m_TypeName: UnityEngine.UI.MaskableGraphic+CullStateChangedEvent, UnityEngine.UI,
      Version=1.0.0.0, Culture=neutral, PublicKeyToken=null
  m_Sprite: {fileID: 21300000, guid: 7ed1238760b863f4aafde32ab3a6f28c, type: 3}
  m_Type: 1
  m_PreserveAspect: 0
  m_FillCenter: 1
  m_FillMethod: 4
  m_FillAmount: 1
  m_FillClockwise: 1
  m_FillOrigin: 0
--- !u!222 &653376408
CanvasRenderer:
  m_ObjectHideFlags: 0
  m_PrefabParentObject: {fileID: 22286240, guid: 9fbc11c80d160ec44896f2b835275276,
    type: 2}
  m_PrefabInternal: {fileID: 1145497095}
  m_GameObject: {fileID: 653376404}
--- !u!1 &780924402
GameObject:
  m_ObjectHideFlags: 0
  m_PrefabParentObject: {fileID: 186246, guid: 9fbc11c80d160ec44896f2b835275276, type: 2}
  m_PrefabInternal: {fileID: 1145497095}
  serializedVersion: 5
  m_Component:
  - component: {fileID: 780924406}
  - component: {fileID: 780924405}
  - component: {fileID: 780924404}
  - component: {fileID: 780924403}
  m_Layer: 5
  m_Name: GameExample_9
  m_TagString: Untagged
  m_Icon: {fileID: 0}
  m_NavMeshLayer: 0
  m_StaticEditorFlags: 0
  m_IsActive: 1
--- !u!114 &780924403
MonoBehaviour:
  m_ObjectHideFlags: 0
  m_PrefabParentObject: {fileID: 11486246, guid: 9fbc11c80d160ec44896f2b835275276,
    type: 2}
  m_PrefabInternal: {fileID: 1145497095}
  m_GameObject: {fileID: 780924402}
  m_Enabled: 1
  m_EditorHideFlags: 0
  m_Script: {fileID: 1301386320, guid: f5f67c52d1564df4a8936ccd202a3bd8, type: 3}
  m_Name: 
  m_EditorClassIdentifier: 
  m_IgnoreReversedGraphics: 1
  m_BlockingObjects: 0
  m_BlockingMask:
    serializedVersion: 2
    m_Bits: 4294967295
--- !u!114 &780924404
MonoBehaviour:
  m_ObjectHideFlags: 0
  m_PrefabParentObject: {fileID: 11486244, guid: 9fbc11c80d160ec44896f2b835275276,
    type: 2}
  m_PrefabInternal: {fileID: 1145497095}
  m_GameObject: {fileID: 780924402}
  m_Enabled: 1
  m_EditorHideFlags: 0
  m_Script: {fileID: 1980459831, guid: f5f67c52d1564df4a8936ccd202a3bd8, type: 3}
  m_Name: 
  m_EditorClassIdentifier: 
  m_UiScaleMode: 1
  m_ReferencePixelsPerUnit: 100
  m_ScaleFactor: 1
  m_ReferenceResolution: {x: 640, y: 1136}
  m_ScreenMatchMode: 0
  m_MatchWidthOrHeight: 1
  m_PhysicalUnit: 3
  m_FallbackScreenDPI: 96
  m_DefaultSpriteDPI: 96
  m_DynamicPixelsPerUnit: 1
--- !u!223 &780924405
Canvas:
  m_ObjectHideFlags: 0
  m_PrefabParentObject: {fileID: 22386250, guid: 9fbc11c80d160ec44896f2b835275276,
    type: 2}
  m_PrefabInternal: {fileID: 1145497095}
  m_GameObject: {fileID: 780924402}
  m_Enabled: 1
  serializedVersion: 3
  m_RenderMode: 0
  m_Camera: {fileID: 0}
  m_PlaneDistance: 100
  m_PixelPerfect: 1
  m_ReceivesEvents: 1
  m_OverrideSorting: 0
  m_OverridePixelPerfect: 0
  m_SortingBucketNormalizedSize: 0
  m_AdditionalShaderChannelsFlag: 25
  m_SortingLayerID: 0
  m_SortingOrder: 0
  m_TargetDisplay: 0
--- !u!224 &780924406
RectTransform:
  m_ObjectHideFlags: 0
  m_PrefabParentObject: {fileID: 22486246, guid: 9fbc11c80d160ec44896f2b835275276,
    type: 2}
  m_PrefabInternal: {fileID: 1145497095}
  m_GameObject: {fileID: 780924402}
  m_LocalRotation: {x: 0, y: 0, z: 0, w: 1}
  m_LocalPosition: {x: 0, y: 0, z: 0}
  m_LocalScale: {x: 0, y: 0, z: 0}
  m_Children:
  - {fileID: 81658170}
  - {fileID: 653376405}
  m_Father: {fileID: 0}
  m_RootOrder: 0
  m_LocalEulerAnglesHint: {x: 0, y: 0, z: 0}
  m_AnchorMin: {x: 0, y: 0}
  m_AnchorMax: {x: 0, y: 0}
  m_AnchoredPosition: {x: 0, y: 0}
  m_SizeDelta: {x: 0, y: 0}
  m_Pivot: {x: 0, y: 0}
--- !u!1 &1035596499
GameObject:
  m_ObjectHideFlags: 0
  m_PrefabParentObject: {fileID: 186240, guid: 9fbc11c80d160ec44896f2b835275276, type: 2}
  m_PrefabInternal: {fileID: 1145497095}
  serializedVersion: 5
  m_Component:
  - component: {fileID: 1035596500}
  - component: {fileID: 1035596502}
  - component: {fileID: 1035596501}
  m_Layer: 5
  m_Name: Text
  m_TagString: Untagged
  m_Icon: {fileID: 0}
  m_NavMeshLayer: 0
  m_StaticEditorFlags: 0
  m_IsActive: 1
--- !u!224 &1035596500
RectTransform:
  m_ObjectHideFlags: 0
  m_PrefabParentObject: {fileID: 22486240, guid: 9fbc11c80d160ec44896f2b835275276,
    type: 2}
  m_PrefabInternal: {fileID: 1145497095}
  m_GameObject: {fileID: 1035596499}
  m_LocalRotation: {x: 0, y: 0, z: 0, w: 1}
  m_LocalPosition: {x: 0, y: 0, z: 0}
  m_LocalScale: {x: 1, y: 1, z: 1}
  m_Children: []
  m_Father: {fileID: 653376405}
  m_RootOrder: 7
  m_LocalEulerAnglesHint: {x: 0, y: 0, z: 0}
  m_AnchorMin: {x: 0.5, y: 0.5}
  m_AnchorMax: {x: 0.5, y: 0.5}
  m_AnchoredPosition: {x: 232.1, y: -529.4}
  m_SizeDelta: {x: 127, y: 69}
  m_Pivot: {x: 0.5, y: 0.5}
--- !u!114 &1035596501
MonoBehaviour:
  m_ObjectHideFlags: 0
  m_PrefabParentObject: {fileID: 11486238, guid: 9fbc11c80d160ec44896f2b835275276,
    type: 2}
  m_PrefabInternal: {fileID: 1145497095}
  m_GameObject: {fileID: 1035596499}
  m_Enabled: 1
  m_EditorHideFlags: 0
  m_Script: {fileID: 708705254, guid: f5f67c52d1564df4a8936ccd202a3bd8, type: 3}
  m_Name: 
  m_EditorClassIdentifier: 
  m_Material: {fileID: 0}
  m_Color: {r: 0.9490196, g: 0.8980392, b: 0.7647059, a: 1}
  m_RaycastTarget: 1
  m_OnCullStateChanged:
    m_PersistentCalls:
      m_Calls: []
    m_TypeName: UnityEngine.UI.MaskableGraphic+CullStateChangedEvent, UnityEngine.UI,
      Version=1.0.0.0, Culture=neutral, PublicKeyToken=null
  m_FontData:
    m_Font: {fileID: 12800000, guid: 218956a5c2a6e42d6a60afccf80b002b, type: 3}
    m_FontSize: 30
    m_FontStyle: 0
    m_BestFit: 0
    m_MinSize: 10
    m_MaxSize: 40
    m_Alignment: 5
    m_AlignByGeometry: 0
    m_RichText: 1
    m_HorizontalOverflow: 0
    m_VerticalOverflow: 0
    m_LineSpacing: 1
  m_Text: level 5
--- !u!222 &1035596502
CanvasRenderer:
  m_ObjectHideFlags: 0
  m_PrefabParentObject: {fileID: 22286242, guid: 9fbc11c80d160ec44896f2b835275276,
    type: 2}
  m_PrefabInternal: {fileID: 1145497095}
  m_GameObject: {fileID: 1035596499}
--- !u!1001 &1145497095
Prefab:
  m_ObjectHideFlags: 0
  serializedVersion: 2
  m_Modification:
    m_TransformParent: {fileID: 0}
    m_Modifications:
    - target: {fileID: 22486246, guid: 9fbc11c80d160ec44896f2b835275276, type: 2}
      propertyPath: m_LocalPosition.x
      value: 0
      objectReference: {fileID: 0}
    - target: {fileID: 22486246, guid: 9fbc11c80d160ec44896f2b835275276, type: 2}
      propertyPath: m_LocalPosition.y
      value: 0
      objectReference: {fileID: 0}
    - target: {fileID: 22486246, guid: 9fbc11c80d160ec44896f2b835275276, type: 2}
      propertyPath: m_LocalPosition.z
      value: 0
      objectReference: {fileID: 0}
    - target: {fileID: 22486246, guid: 9fbc11c80d160ec44896f2b835275276, type: 2}
      propertyPath: m_LocalRotation.x
      value: 0
      objectReference: {fileID: 0}
    - target: {fileID: 22486246, guid: 9fbc11c80d160ec44896f2b835275276, type: 2}
      propertyPath: m_LocalRotation.y
      value: 0
      objectReference: {fileID: 0}
    - target: {fileID: 22486246, guid: 9fbc11c80d160ec44896f2b835275276, type: 2}
      propertyPath: m_LocalRotation.z
      value: 0
      objectReference: {fileID: 0}
    - target: {fileID: 22486246, guid: 9fbc11c80d160ec44896f2b835275276, type: 2}
      propertyPath: m_LocalRotation.w
      value: 1
      objectReference: {fileID: 0}
    - target: {fileID: 22486246, guid: 9fbc11c80d160ec44896f2b835275276, type: 2}
      propertyPath: m_RootOrder
      value: 0
      objectReference: {fileID: 0}
    - target: {fileID: 22486246, guid: 9fbc11c80d160ec44896f2b835275276, type: 2}
      propertyPath: m_AnchoredPosition.x
      value: 0
      objectReference: {fileID: 0}
    - target: {fileID: 22486246, guid: 9fbc11c80d160ec44896f2b835275276, type: 2}
      propertyPath: m_AnchoredPosition.y
      value: 0
      objectReference: {fileID: 0}
    - target: {fileID: 22486246, guid: 9fbc11c80d160ec44896f2b835275276, type: 2}
      propertyPath: m_SizeDelta.x
      value: 0
      objectReference: {fileID: 0}
    - target: {fileID: 22486246, guid: 9fbc11c80d160ec44896f2b835275276, type: 2}
      propertyPath: m_SizeDelta.y
      value: 0
      objectReference: {fileID: 0}
    - target: {fileID: 22486246, guid: 9fbc11c80d160ec44896f2b835275276, type: 2}
      propertyPath: m_AnchorMin.x
      value: 0
      objectReference: {fileID: 0}
    - target: {fileID: 22486246, guid: 9fbc11c80d160ec44896f2b835275276, type: 2}
      propertyPath: m_AnchorMin.y
      value: 0
      objectReference: {fileID: 0}
    - target: {fileID: 22486246, guid: 9fbc11c80d160ec44896f2b835275276, type: 2}
      propertyPath: m_AnchorMax.x
      value: 0
      objectReference: {fileID: 0}
    - target: {fileID: 22486246, guid: 9fbc11c80d160ec44896f2b835275276, type: 2}
      propertyPath: m_AnchorMax.y
      value: 0
      objectReference: {fileID: 0}
    - target: {fileID: 22486246, guid: 9fbc11c80d160ec44896f2b835275276, type: 2}
      propertyPath: m_Pivot.x
      value: 0
      objectReference: {fileID: 0}
    - target: {fileID: 22486246, guid: 9fbc11c80d160ec44896f2b835275276, type: 2}
      propertyPath: m_Pivot.y
      value: 0
      objectReference: {fileID: 0}
    m_RemovedComponents: []
  m_ParentPrefab: {fileID: 100100000, guid: 9fbc11c80d160ec44896f2b835275276, type: 2}
  m_RootGameObject: {fileID: 780924402}
  m_IsPrefabParent: 0
--- !u!1 &1155232655
GameObject:
  m_ObjectHideFlags: 0
  m_PrefabParentObject: {fileID: 186232, guid: 9fbc11c80d160ec44896f2b835275276, type: 2}
  m_PrefabInternal: {fileID: 1145497095}
  serializedVersion: 5
  m_Component:
  - component: {fileID: 1155232656}
  - component: {fileID: 1155232658}
  - component: {fileID: 1155232657}
  m_Layer: 5
  m_Name: MapElemenets
  m_TagString: Untagged
  m_Icon: {fileID: 0}
  m_NavMeshLayer: 0
  m_StaticEditorFlags: 0
  m_IsActive: 1
--- !u!224 &1155232656
RectTransform:
  m_ObjectHideFlags: 0
  m_PrefabParentObject: {fileID: 22486232, guid: 9fbc11c80d160ec44896f2b835275276,
    type: 2}
  m_PrefabInternal: {fileID: 1145497095}
  m_GameObject: {fileID: 1155232655}
  m_LocalRotation: {x: 0, y: 0, z: 0, w: 1}
  m_LocalPosition: {x: 0, y: 0, z: 0}
  m_LocalScale: {x: 1, y: 1, z: 1}
  m_Children: []
  m_Father: {fileID: 653376405}
  m_RootOrder: 0
  m_LocalEulerAnglesHint: {x: 0, y: 0, z: 0}
  m_AnchorMin: {x: 0.5, y: 0.5}
  m_AnchorMax: {x: 0.5, y: 0.5}
  m_AnchoredPosition: {x: -166, y: -41.5}
  m_SizeDelta: {x: 308, y: 83}
  m_Pivot: {x: 0.5, y: 0.5}
--- !u!114 &1155232657
MonoBehaviour:
  m_ObjectHideFlags: 0
  m_PrefabParentObject: {fileID: 11486228, guid: 9fbc11c80d160ec44896f2b835275276,
    type: 2}
  m_PrefabInternal: {fileID: 1145497095}
  m_GameObject: {fileID: 1155232655}
  m_Enabled: 1
  m_EditorHideFlags: 0
  m_Script: {fileID: -765806418, guid: f5f67c52d1564df4a8936ccd202a3bd8, type: 3}
  m_Name: 
  m_EditorClassIdentifier: 
  m_Material: {fileID: 0}
  m_Color: {r: 0.12156863, g: 0.84313726, b: 0.5921569, a: 1}
  m_RaycastTarget: 1
  m_OnCullStateChanged:
    m_PersistentCalls:
      m_Calls: []
    m_TypeName: UnityEngine.UI.MaskableGraphic+CullStateChangedEvent, UnityEngine.UI,
      Version=1.0.0.0, Culture=neutral, PublicKeyToken=null
  m_Sprite: {fileID: 21300000, guid: ea42899e05daf6d4896d82cf572ce92c, type: 3}
  m_Type: 1
  m_PreserveAspect: 0
  m_FillCenter: 1
  m_FillMethod: 4
  m_FillAmount: 1
  m_FillClockwise: 1
  m_FillOrigin: 0
--- !u!222 &1155232658
CanvasRenderer:
  m_ObjectHideFlags: 0
  m_PrefabParentObject: {fileID: 22286234, guid: 9fbc11c80d160ec44896f2b835275276,
    type: 2}
  m_PrefabInternal: {fileID: 1145497095}
  m_GameObject: {fileID: 1155232655}
--- !u!1 &1256349389
GameObject:
  m_ObjectHideFlags: 0
  m_PrefabParentObject: {fileID: 186226, guid: 9fbc11c80d160ec44896f2b835275276, type: 2}
  m_PrefabInternal: {fileID: 1145497095}
  serializedVersion: 5
  m_Component:
  - component: {fileID: 1256349390}
  - component: {fileID: 1256349392}
  - component: {fileID: 1256349391}
  m_Layer: 5
  m_Name: MapElemenets
  m_TagString: Untagged
  m_Icon: {fileID: 0}
  m_NavMeshLayer: 0
  m_StaticEditorFlags: 0
  m_IsActive: 1
--- !u!224 &1256349390
RectTransform:
  m_ObjectHideFlags: 0
  m_PrefabParentObject: {fileID: 22486226, guid: 9fbc11c80d160ec44896f2b835275276,
    type: 2}
  m_PrefabInternal: {fileID: 1145497095}
  m_GameObject: {fileID: 1256349389}
  m_LocalRotation: {x: 0, y: 0, z: 0.3826835, w: 0.92387956}
  m_LocalPosition: {x: 0, y: 0, z: 0}
  m_LocalScale: {x: 0.5, y: 0.5, z: 1}
  m_Children: []
  m_Father: {fileID: 653376405}
  m_RootOrder: 4
  m_LocalEulerAnglesHint: {x: 0, y: 0, z: 0}
  m_AnchorMin: {x: 0.5, y: 0.5}
  m_AnchorMax: {x: 0.5, y: 0.5}
  m_AnchoredPosition: {x: 181, y: 365}
  m_SizeDelta: {x: 150, y: 150}
  m_Pivot: {x: 0.5, y: 0.5}
--- !u!114 &1256349391
MonoBehaviour:
  m_ObjectHideFlags: 0
  m_PrefabParentObject: {fileID: 11486222, guid: 9fbc11c80d160ec44896f2b835275276,
    type: 2}
  m_PrefabInternal: {fileID: 1145497095}
  m_GameObject: {fileID: 1256349389}
  m_Enabled: 1
  m_EditorHideFlags: 0
  m_Script: {fileID: -765806418, guid: f5f67c52d1564df4a8936ccd202a3bd8, type: 3}
  m_Name: 
  m_EditorClassIdentifier: 
  m_Material: {fileID: 0}
  m_Color: {r: 0.9529412, g: 0.9019608, b: 0.76862746, a: 1}
  m_RaycastTarget: 1
  m_OnCullStateChanged:
    m_PersistentCalls:
      m_Calls: []
    m_TypeName: UnityEngine.UI.MaskableGraphic+CullStateChangedEvent, UnityEngine.UI,
      Version=1.0.0.0, Culture=neutral, PublicKeyToken=null
  m_Sprite: {fileID: 21300000, guid: 149ad5777c7580a4b8a6b1810a830f7a, type: 3}
  m_Type: 1
  m_PreserveAspect: 0
  m_FillCenter: 1
  m_FillMethod: 4
  m_FillAmount: 1
  m_FillClockwise: 1
  m_FillOrigin: 0
--- !u!222 &1256349392
CanvasRenderer:
  m_ObjectHideFlags: 0
  m_PrefabParentObject: {fileID: 22286228, guid: 9fbc11c80d160ec44896f2b835275276,
    type: 2}
  m_PrefabInternal: {fileID: 1145497095}
  m_GameObject: {fileID: 1256349389}
--- !u!1 &1398997878
GameObject:
  m_ObjectHideFlags: 0
  m_PrefabParentObject: {fileID: 186236, guid: 9fbc11c80d160ec44896f2b835275276, type: 2}
  m_PrefabInternal: {fileID: 1145497095}
  serializedVersion: 5
  m_Component:
  - component: {fileID: 1398997879}
  - component: {fileID: 1398997881}
  - component: {fileID: 1398997880}
  m_Layer: 5
  m_Name: Panel
  m_TagString: Untagged
  m_Icon: {fileID: 0}
  m_NavMeshLayer: 0
  m_StaticEditorFlags: 0
  m_IsActive: 1
--- !u!224 &1398997879
RectTransform:
  m_ObjectHideFlags: 0
  m_PrefabParentObject: {fileID: 22486236, guid: 9fbc11c80d160ec44896f2b835275276,
    type: 2}
  m_PrefabInternal: {fileID: 1145497095}
  m_GameObject: {fileID: 1398997878}
  m_LocalRotation: {x: 0, y: 0, z: 0, w: 1}
  m_LocalPosition: {x: 0, y: 0, z: 0}
  m_LocalScale: {x: 1, y: 1, z: 1}
  m_Children: []
  m_Father: {fileID: 1938611963}
  m_RootOrder: 1
  m_LocalEulerAnglesHint: {x: 0, y: 0, z: 0}
  m_AnchorMin: {x: 0.5, y: 0.5}
  m_AnchorMax: {x: 0.5, y: 0.5}
  m_AnchoredPosition: {x: -125, y: 125}
  m_SizeDelta: {x: 80, y: 80}
  m_Pivot: {x: 0.5, y: 0.5}
--- !u!114 &1398997880
MonoBehaviour:
  m_ObjectHideFlags: 0
  m_PrefabParentObject: {fileID: 11486232, guid: 9fbc11c80d160ec44896f2b835275276,
    type: 2}
  m_PrefabInternal: {fileID: 1145497095}
  m_GameObject: {fileID: 1398997878}
  m_Enabled: 1
  m_EditorHideFlags: 0
  m_Script: {fileID: -765806418, guid: f5f67c52d1564df4a8936ccd202a3bd8, type: 3}
  m_Name: 
  m_EditorClassIdentifier: 
  m_Material: {fileID: 0}
  m_Color: {r: 0.9647059, g: 0.2901961, b: 0.32941177, a: 1}
  m_RaycastTarget: 1
  m_OnCullStateChanged:
    m_PersistentCalls:
      m_Calls: []
    m_TypeName: UnityEngine.UI.MaskableGraphic+CullStateChangedEvent, UnityEngine.UI,
      Version=1.0.0.0, Culture=neutral, PublicKeyToken=null
  m_Sprite: {fileID: 21300000, guid: 8da86438290b7d64eb1d62723389c0d3, type: 3}
  m_Type: 1
  m_PreserveAspect: 0
  m_FillCenter: 1
  m_FillMethod: 4
  m_FillAmount: 1
  m_FillClockwise: 1
  m_FillOrigin: 0
--- !u!222 &1398997881
CanvasRenderer:
  m_ObjectHideFlags: 0
  m_PrefabParentObject: {fileID: 22286238, guid: 9fbc11c80d160ec44896f2b835275276,
    type: 2}
  m_PrefabInternal: {fileID: 1145497095}
  m_GameObject: {fileID: 1398997878}
--- !u!1 &1500371475
GameObject:
  m_ObjectHideFlags: 0
  m_PrefabParentObject: {fileID: 0}
  m_PrefabInternal: {fileID: 0}
  serializedVersion: 5
  m_Component:
  - component: {fileID: 1500371479}
  - component: {fileID: 1500371478}
  - component: {fileID: 1500371477}
  - component: {fileID: 1500371476}
  m_Layer: 0
  m_Name: EventSystem
  m_TagString: Untagged
  m_Icon: {fileID: 0}
  m_NavMeshLayer: 0
  m_StaticEditorFlags: 0
  m_IsActive: 1
--- !u!114 &1500371476
MonoBehaviour:
  m_ObjectHideFlags: 0
  m_PrefabParentObject: {fileID: 0}
  m_PrefabInternal: {fileID: 0}
  m_GameObject: {fileID: 1500371475}
  m_Enabled: 1
  m_EditorHideFlags: 0
  m_Script: {fileID: 1997211142, guid: f5f67c52d1564df4a8936ccd202a3bd8, type: 3}
  m_Name: 
  m_EditorClassIdentifier: 
  m_ForceModuleActive: 0
--- !u!114 &1500371477
MonoBehaviour:
  m_ObjectHideFlags: 0
  m_PrefabParentObject: {fileID: 0}
  m_PrefabInternal: {fileID: 0}
  m_GameObject: {fileID: 1500371475}
  m_Enabled: 1
  m_EditorHideFlags: 0
  m_Script: {fileID: 1077351063, guid: f5f67c52d1564df4a8936ccd202a3bd8, type: 3}
  m_Name: 
  m_EditorClassIdentifier: 
  m_HorizontalAxis: Horizontal
  m_VerticalAxis: Vertical
  m_SubmitButton: Submit
  m_CancelButton: Cancel
  m_InputActionsPerSecond: 10
  m_RepeatDelay: 0.5
  m_ForceModuleActive: 0
--- !u!114 &1500371478
MonoBehaviour:
  m_ObjectHideFlags: 0
  m_PrefabParentObject: {fileID: 0}
  m_PrefabInternal: {fileID: 0}
  m_GameObject: {fileID: 1500371475}
  m_Enabled: 1
  m_EditorHideFlags: 0
  m_Script: {fileID: -619905303, guid: f5f67c52d1564df4a8936ccd202a3bd8, type: 3}
  m_Name: 
  m_EditorClassIdentifier: 
  m_FirstSelected: {fileID: 0}
  m_sendNavigationEvents: 1
  m_DragThreshold: 5
--- !u!4 &1500371479
Transform:
  m_ObjectHideFlags: 0
  m_PrefabParentObject: {fileID: 0}
  m_PrefabInternal: {fileID: 0}
  m_GameObject: {fileID: 1500371475}
  m_LocalRotation: {x: 0, y: 0, z: 0, w: 1}
  m_LocalPosition: {x: 0, y: 0, z: 0}
  m_LocalScale: {x: 1, y: 1, z: 1}
  m_Children: []
  m_Father: {fileID: 0}
  m_RootOrder: 1
  m_LocalEulerAnglesHint: {x: 0, y: 0, z: 0}
--- !u!1 &1511305452
GameObject:
  m_ObjectHideFlags: 0
  m_PrefabParentObject: {fileID: 0}
  m_PrefabInternal: {fileID: 0}
  serializedVersion: 5
  m_Component:
  - component: {fileID: 1511305453}
  m_Layer: 0
  m_Name: __SET_YOUR_GAMESCREEN_TO_640x1136
  m_TagString: Untagged
  m_Icon: {fileID: 0}
  m_NavMeshLayer: 0
  m_StaticEditorFlags: 0
  m_IsActive: 1
--- !u!4 &1511305453
Transform:
  m_ObjectHideFlags: 0
  m_PrefabParentObject: {fileID: 0}
  m_PrefabInternal: {fileID: 0}
  m_GameObject: {fileID: 1511305452}
  m_LocalRotation: {x: 0, y: 0, z: 0, w: 1}
  m_LocalPosition: {x: 494.995, y: 627.74, z: 0}
  m_LocalScale: {x: 1, y: 1, z: 1}
  m_Children: []
  m_Father: {fileID: 0}
  m_RootOrder: 2
  m_LocalEulerAnglesHint: {x: 0, y: 0, z: 0}
--- !u!1 &1938611962
GameObject:
  m_ObjectHideFlags: 0
  m_PrefabParentObject: {fileID: 186224, guid: 9fbc11c80d160ec44896f2b835275276, type: 2}
  m_PrefabInternal: {fileID: 1145497095}
  serializedVersion: 5
  m_Component:
  - component: {fileID: 1938611963}
  - component: {fileID: 1938611965}
  - component: {fileID: 1938611964}
  m_Layer: 5
  m_Name: Panel
  m_TagString: Untagged
  m_Icon: {fileID: 0}
  m_NavMeshLayer: 0
  m_StaticEditorFlags: 0
  m_IsActive: 1
--- !u!224 &1938611963
RectTransform:
  m_ObjectHideFlags: 0
  m_PrefabParentObject: {fileID: 22486224, guid: 9fbc11c80d160ec44896f2b835275276,
    type: 2}
  m_PrefabInternal: {fileID: 1145497095}
  m_GameObject: {fileID: 1938611962}
  m_LocalRotation: {x: 0, y: 0, z: 0.3826835, w: 0.92387956}
  m_LocalPosition: {x: 0, y: 0, z: 0}
  m_LocalScale: {x: 0.99999994, y: 0.99999994, z: 1}
  m_Children:
  - {fileID: 47812407}
  - {fileID: 1398997879}
  m_Father: {fileID: 653376405}
  m_RootOrder: 6
  m_LocalEulerAnglesHint: {x: 0, y: 0, z: 0}
  m_AnchorMin: {x: 0.5, y: 0.5}
  m_AnchorMax: {x: 0.5, y: 0.5}
  m_AnchoredPosition: {x: 0, y: -333}
  m_SizeDelta: {x: 251, y: 251}
  m_Pivot: {x: 0.5, y: 0.5}
--- !u!114 &1938611964
MonoBehaviour:
  m_ObjectHideFlags: 0
  m_PrefabParentObject: {fileID: 11486220, guid: 9fbc11c80d160ec44896f2b835275276,
    type: 2}
  m_PrefabInternal: {fileID: 1145497095}
  m_GameObject: {fileID: 1938611962}
  m_Enabled: 1
  m_EditorHideFlags: 0
  m_Script: {fileID: -765806418, guid: f5f67c52d1564df4a8936ccd202a3bd8, type: 3}
  m_Name: 
  m_EditorClassIdentifier: 
  m_Material: {fileID: 0}
  m_Color: {r: 0.88235295, g: 0.88235295, b: 0.88235295, a: 1}
  m_RaycastTarget: 1
  m_OnCullStateChanged:
    m_PersistentCalls:
      m_Calls: []
    m_TypeName: UnityEngine.UI.MaskableGraphic+CullStateChangedEvent, UnityEngine.UI,
      Version=1.0.0.0, Culture=neutral, PublicKeyToken=null
  m_Sprite: {fileID: 21300000, guid: abef4d6af716c1a45a156a06b45fe60e, type: 3}
  m_Type: 1
  m_PreserveAspect: 0
  m_FillCenter: 1
  m_FillMethod: 4
  m_FillAmount: 1
  m_FillClockwise: 1
  m_FillOrigin: 0
--- !u!222 &1938611965
CanvasRenderer:
  m_ObjectHideFlags: 0
  m_PrefabParentObject: {fileID: 22286226, guid: 9fbc11c80d160ec44896f2b835275276,
    type: 2}
  m_PrefabInternal: {fileID: 1145497095}
  m_GameObject: {fileID: 1938611962}
