%YAML 1.1
%TAG !u! tag:unity3d.com,2011:
--- !u!29 &1
OcclusionCullingSettings:
  m_ObjectHideFlags: 0
  serializedVersion: 2
  m_OcclusionBakeSettings:
    smallestOccluder: 5
    smallestHole: 0.25
    backfaceThreshold: 100
  m_SceneGUID: 00000000000000000000000000000000
  m_OcclusionCullingData: {fileID: 0}
--- !u!104 &2
RenderSettings:
  m_ObjectHideFlags: 0
  serializedVersion: 8
  m_Fog: 0
  m_FogColor: {r: 0.5, g: 0.5, b: 0.5, a: 1}
  m_FogMode: 3
  m_FogDensity: 0.01
  m_LinearFogStart: 0
  m_LinearFogEnd: 300
  m_AmbientSkyColor: {r: 0.212, g: 0.227, b: 0.259, a: 1}
  m_AmbientEquatorColor: {r: 0.114, g: 0.125, b: 0.133, a: 1}
  m_AmbientGroundColor: {r: 0.047, g: 0.043, b: 0.035, a: 1}
  m_AmbientIntensity: 1
  m_AmbientMode: 0
  m_SubtractiveShadowColor: {r: 0.42, g: 0.478, b: 0.627, a: 1}
  m_SkyboxMaterial: {fileID: 10304, guid: 0000000000000000f000000000000000, type: 0}
  m_HaloStrength: 0.5
  m_FlareStrength: 1
  m_FlareFadeSpeed: 3
  m_HaloTexture: {fileID: 0}
  m_SpotCookie: {fileID: 10001, guid: 0000000000000000e000000000000000, type: 0}
  m_DefaultReflectionMode: 0
  m_DefaultReflectionResolution: 128
  m_ReflectionBounces: 1
  m_ReflectionIntensity: 1
  m_CustomReflection: {fileID: 0}
  m_Sun: {fileID: 0}
  m_IndirectSpecularColor: {r: 0, g: 0, b: 0, a: 1}
--- !u!157 &4
LightmapSettings:
  m_ObjectHideFlags: 0
  serializedVersion: 9
  m_GIWorkflowMode: 0
  m_GISettings:
    serializedVersion: 2
    m_BounceScale: 1
    m_IndirectOutputScale: 1
    m_AlbedoBoost: 1
    m_TemporalCoherenceThreshold: 1
    m_EnvironmentLightingMode: 0
    m_EnableBakedLightmaps: 1
    m_EnableRealtimeLightmaps: 1
  m_LightmapEditorSettings:
    serializedVersion: 8
    m_Resolution: 2
    m_BakeResolution: 40
    m_TextureWidth: 1024
    m_TextureHeight: 1024
    m_AO: 0
    m_AOMaxDistance: 1
    m_CompAOExponent: 0
    m_CompAOExponentDirect: 0
    m_Padding: 2
    m_LightmapParameters: {fileID: 0}
    m_LightmapsBakeMode: 1
    m_TextureCompression: 1
    m_FinalGather: 0
    m_FinalGatherFiltering: 1
    m_FinalGatherRayCount: 1024
    m_ReflectionCompression: 2
    m_MixedBakeMode: 1
    m_BakeBackend: 0
    m_PVRSampling: 1
    m_PVRDirectSampleCount: 32
    m_PVRSampleCount: 500
    m_PVRBounces: 2
    m_PVRFiltering: 0
    m_PVRFilteringMode: 1
    m_PVRCulling: 1
    m_PVRFilteringGaussRadiusDirect: 1
    m_PVRFilteringGaussRadiusIndirect: 5
    m_PVRFilteringGaussRadiusAO: 2
    m_PVRFilteringAtrousColorSigma: 1
    m_PVRFilteringAtrousNormalSigma: 1
    m_PVRFilteringAtrousPositionSigma: 1
  m_LightingDataAsset: {fileID: 0}
  m_ShadowMaskMode: 2
--- !u!196 &5
NavMeshSettings:
  serializedVersion: 2
  m_ObjectHideFlags: 0
  m_BuildSettings:
    serializedVersion: 2
    agentTypeID: 0
    agentRadius: 0.5
    agentHeight: 2
    agentSlope: 45
    agentClimb: 0.4
    ledgeDropHeight: 0
    maxJumpAcrossDistance: 0
    minRegionArea: 2
    manualCellSize: 0
    cellSize: 0.16666667
    manualTileSize: 0
    tileSize: 256
    accuratePlacement: 0
  m_NavMeshData: {fileID: 0}
--- !u!1 &66884696
GameObject:
  m_ObjectHideFlags: 0
  m_PrefabParentObject: {fileID: 167676, guid: b58c19bae463ca24d82249908693d5c8, type: 2}
  m_PrefabInternal: {fileID: 289978213}
  serializedVersion: 5
  m_Component:
  - component: {fileID: 66884700}
  - component: {fileID: 66884699}
  - component: {fileID: 66884698}
  - component: {fileID: 66884697}
  m_Layer: 5
  m_Name: WatchTimerApp_1
  m_TagString: Untagged
  m_Icon: {fileID: 0}
  m_NavMeshLayer: 0
  m_StaticEditorFlags: 0
  m_IsActive: 1
--- !u!114 &66884697
MonoBehaviour:
  m_ObjectHideFlags: 0
  m_PrefabParentObject: {fileID: 11467678, guid: b58c19bae463ca24d82249908693d5c8,
    type: 2}
  m_PrefabInternal: {fileID: 289978213}
  m_GameObject: {fileID: 66884696}
  m_Enabled: 1
  m_EditorHideFlags: 0
  m_Script: {fileID: 1301386320, guid: f5f67c52d1564df4a8936ccd202a3bd8, type: 3}
  m_Name: 
  m_EditorClassIdentifier: 
  m_IgnoreReversedGraphics: 1
  m_BlockingObjects: 0
  m_BlockingMask:
    serializedVersion: 2
    m_Bits: 4294967295
--- !u!114 &66884698
MonoBehaviour:
  m_ObjectHideFlags: 0
  m_PrefabParentObject: {fileID: 11467680, guid: b58c19bae463ca24d82249908693d5c8,
    type: 2}
  m_PrefabInternal: {fileID: 289978213}
  m_GameObject: {fileID: 66884696}
  m_Enabled: 1
  m_EditorHideFlags: 0
  m_Script: {fileID: 1980459831, guid: f5f67c52d1564df4a8936ccd202a3bd8, type: 3}
  m_Name: 
  m_EditorClassIdentifier: 
  m_UiScaleMode: 1
  m_ReferencePixelsPerUnit: 100
  m_ScaleFactor: 1
  m_ReferenceResolution: {x: 636, y: 636}
  m_ScreenMatchMode: 0
  m_MatchWidthOrHeight: 1
  m_PhysicalUnit: 3
  m_FallbackScreenDPI: 96
  m_DefaultSpriteDPI: 96
  m_DynamicPixelsPerUnit: 1
--- !u!223 &66884699
Canvas:
  m_ObjectHideFlags: 0
  m_PrefabParentObject: {fileID: 22367646, guid: b58c19bae463ca24d82249908693d5c8,
    type: 2}
  m_PrefabInternal: {fileID: 289978213}
  m_GameObject: {fileID: 66884696}
  m_Enabled: 1
  serializedVersion: 3
  m_RenderMode: 0
  m_Camera: {fileID: 0}
  m_PlaneDistance: 100
  m_PixelPerfect: 1
  m_ReceivesEvents: 1
  m_OverrideSorting: 0
  m_OverridePixelPerfect: 0
  m_SortingBucketNormalizedSize: 0
  m_AdditionalShaderChannelsFlag: 25
  m_SortingLayerID: 0
  m_SortingOrder: 0
  m_TargetDisplay: 0
--- !u!224 &66884700
RectTransform:
  m_ObjectHideFlags: 0
  m_PrefabParentObject: {fileID: 22467676, guid: b58c19bae463ca24d82249908693d5c8,
    type: 2}
  m_PrefabInternal: {fileID: 289978213}
  m_GameObject: {fileID: 66884696}
  m_LocalRotation: {x: 0, y: 0, z: 0, w: 1}
  m_LocalPosition: {x: 0, y: 0, z: 0}
  m_LocalScale: {x: 0, y: 0, z: 0}
  m_Children:
  - {fileID: 337120667}
  - {fileID: 341347530}
  m_Father: {fileID: 0}
  m_RootOrder: 0
  m_LocalEulerAnglesHint: {x: 0, y: 0, z: 0}
  m_AnchorMin: {x: 0, y: 0}
  m_AnchorMax: {x: 0, y: 0}
  m_AnchoredPosition: {x: 0, y: 0}
  m_SizeDelta: {x: 0, y: 0}
  m_Pivot: {x: 0, y: 0}
--- !u!1 &93013521
GameObject:
  m_ObjectHideFlags: 0
  m_PrefabParentObject: {fileID: 167658, guid: b58c19bae463ca24d82249908693d5c8, type: 2}
  m_PrefabInternal: {fileID: 289978213}
  serializedVersion: 5
  m_Component:
  - component: {fileID: 93013522}
  - component: {fileID: 93013524}
  - component: {fileID: 93013523}
  m_Layer: 5
  m_Name: Image
  m_TagString: Untagged
  m_Icon: {fileID: 0}
  m_NavMeshLayer: 0
  m_StaticEditorFlags: 0
  m_IsActive: 1
--- !u!224 &93013522
RectTransform:
  m_ObjectHideFlags: 0
  m_PrefabParentObject: {fileID: 22467658, guid: b58c19bae463ca24d82249908693d5c8,
    type: 2}
  m_PrefabInternal: {fileID: 289978213}
  m_GameObject: {fileID: 93013521}
  m_LocalRotation: {x: 0, y: 0, z: 0, w: 1}
  m_LocalPosition: {x: 0, y: 0, z: 0}
  m_LocalScale: {x: 1, y: 1, z: 1}
  m_Children: []
  m_Father: {fileID: 341347530}
  m_RootOrder: 0
  m_LocalEulerAnglesHint: {x: 0, y: 0, z: 0}
  m_AnchorMin: {x: 0.5, y: 0.5}
  m_AnchorMax: {x: 0.5, y: 0.5}
  m_AnchoredPosition: {x: 26, y: 0}
  m_SizeDelta: {x: 1123, y: 749}
  m_Pivot: {x: 0.5, y: 0.5}
--- !u!114 &93013523
MonoBehaviour:
  m_ObjectHideFlags: 0
  m_PrefabParentObject: {fileID: 11467660, guid: b58c19bae463ca24d82249908693d5c8,
    type: 2}
  m_PrefabInternal: {fileID: 289978213}
  m_GameObject: {fileID: 93013521}
  m_Enabled: 1
  m_EditorHideFlags: 0
  m_Script: {fileID: -765806418, guid: f5f67c52d1564df4a8936ccd202a3bd8, type: 3}
  m_Name: 
  m_EditorClassIdentifier: 
  m_Material: {fileID: 0}
  m_Color: {r: 1, g: 1, b: 1, a: 1}
  m_RaycastTarget: 1
  m_OnCullStateChanged:
    m_PersistentCalls:
      m_Calls: []
    m_TypeName: UnityEngine.UI.MaskableGraphic+CullStateChangedEvent, UnityEngine.UI,
      Version=1.0.0.0, Culture=neutral, PublicKeyToken=null
  m_Sprite: {fileID: 21300000, guid: ec204ee652024464294f15e766a1bd2c, type: 3}
  m_Type: 0
  m_PreserveAspect: 0
  m_FillCenter: 1
  m_FillMethod: 4
  m_FillAmount: 1
  m_FillClockwise: 1
  m_FillOrigin: 0
--- !u!222 &93013524
CanvasRenderer:
  m_ObjectHideFlags: 0
  m_PrefabParentObject: {fileID: 22267658, guid: b58c19bae463ca24d82249908693d5c8,
    type: 2}
  m_PrefabInternal: {fileID: 289978213}
  m_GameObject: {fileID: 93013521}
--- !u!1 &155659293
GameObject:
  m_ObjectHideFlags: 0
  m_PrefabParentObject: {fileID: 167674, guid: b58c19bae463ca24d82249908693d5c8, type: 2}
  m_PrefabInternal: {fileID: 289978213}
  serializedVersion: 5
  m_Component:
  - component: {fileID: 155659294}
  - component: {fileID: 155659296}
  - component: {fileID: 155659295}
  m_Layer: 5
  m_Name: Text
  m_TagString: Untagged
  m_Icon: {fileID: 0}
  m_NavMeshLayer: 0
  m_StaticEditorFlags: 0
  m_IsActive: 1
--- !u!224 &155659294
RectTransform:
  m_ObjectHideFlags: 0
  m_PrefabParentObject: {fileID: 22467674, guid: b58c19bae463ca24d82249908693d5c8,
    type: 2}
  m_PrefabInternal: {fileID: 289978213}
  m_GameObject: {fileID: 155659293}
  m_LocalRotation: {x: 0, y: 0, z: 0, w: 1}
  m_LocalPosition: {x: 0, y: 0, z: 0}
  m_LocalScale: {x: 1, y: 1, z: 1}
  m_Children: []
  m_Father: {fileID: 341347530}
  m_RootOrder: 2
  m_LocalEulerAnglesHint: {x: 0, y: 0, z: 0}
  m_AnchorMin: {x: 0.5, y: 0.5}
  m_AnchorMax: {x: 0.5, y: 0.5}
  m_AnchoredPosition: {x: 0, y: -37}
  m_SizeDelta: {x: 636, y: 139}
  m_Pivot: {x: 0.5, y: 0.5}
--- !u!114 &155659295
MonoBehaviour:
  m_ObjectHideFlags: 0
  m_PrefabParentObject: {fileID: 11467676, guid: b58c19bae463ca24d82249908693d5c8,
    type: 2}
  m_PrefabInternal: {fileID: 289978213}
  m_GameObject: {fileID: 155659293}
  m_Enabled: 1
  m_EditorHideFlags: 0
  m_Script: {fileID: 708705254, guid: f5f67c52d1564df4a8936ccd202a3bd8, type: 3}
  m_Name: 
  m_EditorClassIdentifier: 
  m_Material: {fileID: 0}
  m_Color: {r: 0.96862745, g: 0.94509804, b: 0.9372549, a: 0.8352941}
  m_RaycastTarget: 1
  m_OnCullStateChanged:
    m_PersistentCalls:
      m_Calls: []
    m_TypeName: UnityEngine.UI.MaskableGraphic+CullStateChangedEvent, UnityEngine.UI,
      Version=1.0.0.0, Culture=neutral, PublicKeyToken=null
  m_FontData:
    m_Font: {fileID: 12800000, guid: 5c425d43bb0df45ca8eb162d5154251e, type: 3}
    m_FontSize: 40
    m_FontStyle: 0
    m_BestFit: 0
    m_MinSize: 10
    m_MaxSize: 40
    m_Alignment: 4
    m_AlignByGeometry: 0
    m_RichText: 1
    m_HorizontalOverflow: 0
    m_VerticalOverflow: 0
    m_LineSpacing: 1
  m_Text: Vancouver
--- !u!222 &155659296
CanvasRenderer:
  m_ObjectHideFlags: 0
  m_PrefabParentObject: {fileID: 22267674, guid: b58c19bae463ca24d82249908693d5c8,
    type: 2}
  m_PrefabInternal: {fileID: 289978213}
  m_GameObject: {fileID: 155659293}
--- !u!1001 &289978213
Prefab:
  m_ObjectHideFlags: 0
  serializedVersion: 2
  m_Modification:
    m_TransformParent: {fileID: 0}
    m_Modifications:
    - target: {fileID: 22467676, guid: b58c19bae463ca24d82249908693d5c8, type: 2}
      propertyPath: m_LocalPosition.x
      value: 0
      objectReference: {fileID: 0}
    - target: {fileID: 22467676, guid: b58c19bae463ca24d82249908693d5c8, type: 2}
      propertyPath: m_LocalPosition.y
      value: 0
      objectReference: {fileID: 0}
    - target: {fileID: 22467676, guid: b58c19bae463ca24d82249908693d5c8, type: 2}
      propertyPath: m_LocalPosition.z
      value: 0
      objectReference: {fileID: 0}
    - target: {fileID: 22467676, guid: b58c19bae463ca24d82249908693d5c8, type: 2}
      propertyPath: m_LocalRotation.x
      value: 0
      objectReference: {fileID: 0}
    - target: {fileID: 22467676, guid: b58c19bae463ca24d82249908693d5c8, type: 2}
      propertyPath: m_LocalRotation.y
      value: 0
      objectReference: {fileID: 0}
    - target: {fileID: 22467676, guid: b58c19bae463ca24d82249908693d5c8, type: 2}
      propertyPath: m_LocalRotation.z
      value: 0
      objectReference: {fileID: 0}
    - target: {fileID: 22467676, guid: b58c19bae463ca24d82249908693d5c8, type: 2}
      propertyPath: m_LocalRotation.w
      value: 1
      objectReference: {fileID: 0}
    - target: {fileID: 22467676, guid: b58c19bae463ca24d82249908693d5c8, type: 2}
      propertyPath: m_RootOrder
      value: 0
      objectReference: {fileID: 0}
    - target: {fileID: 22467676, guid: b58c19bae463ca24d82249908693d5c8, type: 2}
      propertyPath: m_AnchoredPosition.x
      value: 0
      objectReference: {fileID: 0}
    - target: {fileID: 22467676, guid: b58c19bae463ca24d82249908693d5c8, type: 2}
      propertyPath: m_AnchoredPosition.y
      value: 0
      objectReference: {fileID: 0}
    - target: {fileID: 22467676, guid: b58c19bae463ca24d82249908693d5c8, type: 2}
      propertyPath: m_SizeDelta.x
      value: 0
      objectReference: {fileID: 0}
    - target: {fileID: 22467676, guid: b58c19bae463ca24d82249908693d5c8, type: 2}
      propertyPath: m_SizeDelta.y
      value: 0
      objectReference: {fileID: 0}
    - target: {fileID: 22467676, guid: b58c19bae463ca24d82249908693d5c8, type: 2}
      propertyPath: m_AnchorMin.x
      value: 0
      objectReference: {fileID: 0}
    - target: {fileID: 22467676, guid: b58c19bae463ca24d82249908693d5c8, type: 2}
      propertyPath: m_AnchorMin.y
      value: 0
      objectReference: {fileID: 0}
    - target: {fileID: 22467676, guid: b58c19bae463ca24d82249908693d5c8, type: 2}
      propertyPath: m_AnchorMax.x
      value: 0
      objectReference: {fileID: 0}
    - target: {fileID: 22467676, guid: b58c19bae463ca24d82249908693d5c8, type: 2}
      propertyPath: m_AnchorMax.y
      value: 0
      objectReference: {fileID: 0}
    - target: {fileID: 22467676, guid: b58c19bae463ca24d82249908693d5c8, type: 2}
      propertyPath: m_Pivot.x
      value: 0
      objectReference: {fileID: 0}
    - target: {fileID: 22467676, guid: b58c19bae463ca24d82249908693d5c8, type: 2}
      propertyPath: m_Pivot.y
      value: 0
      objectReference: {fileID: 0}
    m_RemovedComponents: []
  m_ParentPrefab: {fileID: 100100000, guid: b58c19bae463ca24d82249908693d5c8, type: 2}
  m_RootGameObject: {fileID: 66884696}
  m_IsPrefabParent: 0
--- !u!1 &337120666
GameObject:
  m_ObjectHideFlags: 0
  m_PrefabParentObject: {fileID: 167660, guid: b58c19bae463ca24d82249908693d5c8, type: 2}
  m_PrefabInternal: {fileID: 289978213}
  serializedVersion: 5
  m_Component:
  - component: {fileID: 337120667}
  - component: {fileID: 337120669}
  - component: {fileID: 337120668}
  m_Layer: 5
  m_Name: AppTitle
  m_TagString: Untagged
  m_Icon: {fileID: 0}
  m_NavMeshLayer: 0
  m_StaticEditorFlags: 0
  m_IsActive: 1
--- !u!224 &337120667
RectTransform:
  m_ObjectHideFlags: 0
  m_PrefabParentObject: {fileID: 22467660, guid: b58c19bae463ca24d82249908693d5c8,
    type: 2}
  m_PrefabInternal: {fileID: 289978213}
  m_GameObject: {fileID: 337120666}
  m_LocalRotation: {x: 0, y: 0, z: 0, w: 1}
  m_LocalPosition: {x: 0, y: 0, z: 0}
  m_LocalScale: {x: 1, y: 1, z: 1}
  m_Children:
  - {fileID: 617573788}
  m_Father: {fileID: 66884700}
  m_RootOrder: 0
  m_LocalEulerAnglesHint: {x: 0, y: 0, z: 0}
  m_AnchorMin: {x: 0.5, y: 0.5}
  m_AnchorMax: {x: 0.5, y: 0.5}
  m_AnchoredPosition: {x: 28, y: 410}
  m_SizeDelta: {x: 695, y: 109}
  m_Pivot: {x: 0.5, y: 0.5}
--- !u!114 &337120668
MonoBehaviour:
  m_ObjectHideFlags: 0
  m_PrefabParentObject: {fileID: 11467662, guid: b58c19bae463ca24d82249908693d5c8,
    type: 2}
  m_PrefabInternal: {fileID: 289978213}
  m_GameObject: {fileID: 337120666}
  m_Enabled: 1
  m_EditorHideFlags: 0
  m_Script: {fileID: 708705254, guid: f5f67c52d1564df4a8936ccd202a3bd8, type: 3}
  m_Name: 
  m_EditorClassIdentifier: 
  m_Material: {fileID: 0}
  m_Color: {r: 0.85490197, g: 0.85490197, b: 0.85490197, a: 1}
  m_RaycastTarget: 1
  m_OnCullStateChanged:
    m_PersistentCalls:
      m_Calls: []
    m_TypeName: UnityEngine.UI.MaskableGraphic+CullStateChangedEvent, UnityEngine.UI,
      Version=1.0.0.0, Culture=neutral, PublicKeyToken=null
  m_FontData:
    m_Font: {fileID: 12800000, guid: 218956a5c2a6e42d6a60afccf80b002b, type: 3}
    m_FontSize: 75
    m_FontStyle: 0
    m_BestFit: 0
    m_MinSize: 10
    m_MaxSize: 75
    m_Alignment: 0
    m_AlignByGeometry: 0
    m_RichText: 1
    m_HorizontalOverflow: 0
    m_VerticalOverflow: 1
    m_LineSpacing: 1
  m_Text: CLOCK WATCH
--- !u!222 &337120669
CanvasRenderer:
  m_ObjectHideFlags: 0
  m_PrefabParentObject: {fileID: 22267660, guid: b58c19bae463ca24d82249908693d5c8,
    type: 2}
  m_PrefabInternal: {fileID: 289978213}
  m_GameObject: {fileID: 337120666}
--- !u!1 &341347529
GameObject:
  m_ObjectHideFlags: 0
  m_PrefabParentObject: {fileID: 167650, guid: b58c19bae463ca24d82249908693d5c8, type: 2}
  m_PrefabInternal: {fileID: 289978213}
  serializedVersion: 5
  m_Component:
  - component: {fileID: 341347530}
  - component: {fileID: 341347533}
  - component: {fileID: 341347532}
  - component: {fileID: 341347531}
  m_Layer: 5
  m_Name: Panel
  m_TagString: Untagged
  m_Icon: {fileID: 0}
  m_NavMeshLayer: 0
  m_StaticEditorFlags: 0
  m_IsActive: 1
--- !u!224 &341347530
RectTransform:
  m_ObjectHideFlags: 0
  m_PrefabParentObject: {fileID: 22467650, guid: b58c19bae463ca24d82249908693d5c8,
    type: 2}
  m_PrefabInternal: {fileID: 289978213}
  m_GameObject: {fileID: 341347529}
  m_LocalRotation: {x: 0, y: 0, z: 0, w: 1}
  m_LocalPosition: {x: 0, y: 0, z: 0}
  m_LocalScale: {x: 1, y: 1, z: 1}
  m_Children:
  - {fileID: 93013522}
  - {fileID: 1782270860}
  - {fileID: 155659294}
  - {fileID: 432078946}
  - {fileID: 1369952003}
  - {fileID: 1226133848}
  - {fileID: 2124271998}
  - {fileID: 1349716925}
  - {fileID: 465595723}
  - {fileID: 2088335562}
  - {fileID: 964884560}
  - {fileID: 1867810196}
  m_Father: {fileID: 66884700}
  m_RootOrder: 1
  m_LocalEulerAnglesHint: {x: 0, y: 0, z: 0}
  m_AnchorMin: {x: 0, y: 0}
  m_AnchorMax: {x: 0, y: 0}
  m_AnchoredPosition: {x: 318, y: 318}
  m_SizeDelta: {x: 636, y: 636}
  m_Pivot: {x: 0.5, y: 0.5}
--- !u!114 &341347531
MonoBehaviour:
  m_ObjectHideFlags: 0
  m_PrefabParentObject: {fileID: 11467650, guid: b58c19bae463ca24d82249908693d5c8,
    type: 2}
  m_PrefabInternal: {fileID: 289978213}
  m_GameObject: {fileID: 341347529}
  m_Enabled: 1
  m_EditorHideFlags: 0
  m_Script: {fileID: -1200242548, guid: f5f67c52d1564df4a8936ccd202a3bd8, type: 3}
  m_Name: 
  m_EditorClassIdentifier: 
  m_ShowMaskGraphic: 1
--- !u!114 &341347532
MonoBehaviour:
  m_ObjectHideFlags: 0
  m_PrefabParentObject: {fileID: 11467652, guid: b58c19bae463ca24d82249908693d5c8,
    type: 2}
  m_PrefabInternal: {fileID: 289978213}
  m_GameObject: {fileID: 341347529}
  m_Enabled: 1
  m_EditorHideFlags: 0
  m_Script: {fileID: -765806418, guid: f5f67c52d1564df4a8936ccd202a3bd8, type: 3}
  m_Name: 
  m_EditorClassIdentifier: 
  m_Material: {fileID: 0}
  m_Color: {r: 0.972549, g: 0.9490196, b: 0.9411765, a: 1}
  m_RaycastTarget: 1
  m_OnCullStateChanged:
    m_PersistentCalls:
      m_Calls: []
    m_TypeName: UnityEngine.UI.MaskableGraphic+CullStateChangedEvent, UnityEngine.UI,
      Version=1.0.0.0, Culture=neutral, PublicKeyToken=null
  m_Sprite: {fileID: 21300000, guid: 86c50c842fc5e5548b6a6e876c645ee0, type: 3}
  m_Type: 0
  m_PreserveAspect: 0
  m_FillCenter: 1
  m_FillMethod: 4
  m_FillAmount: 1
  m_FillClockwise: 1
  m_FillOrigin: 0
--- !u!222 &341347533
CanvasRenderer:
  m_ObjectHideFlags: 0
  m_PrefabParentObject: {fileID: 22267650, guid: b58c19bae463ca24d82249908693d5c8,
    type: 2}
  m_PrefabInternal: {fileID: 289978213}
  m_GameObject: {fileID: 341347529}
--- !u!1 &432078945
GameObject:
  m_ObjectHideFlags: 0
  m_PrefabParentObject: {fileID: 167672, guid: b58c19bae463ca24d82249908693d5c8, type: 2}
  m_PrefabInternal: {fileID: 289978213}
  serializedVersion: 5
  m_Component:
  - component: {fileID: 432078946}
  - component: {fileID: 432078948}
  - component: {fileID: 432078947}
  m_Layer: 5
  m_Name: Circle
  m_TagString: Untagged
  m_Icon: {fileID: 0}
  m_NavMeshLayer: 0
  m_StaticEditorFlags: 0
  m_IsActive: 1
--- !u!224 &432078946
RectTransform:
  m_ObjectHideFlags: 0
  m_PrefabParentObject: {fileID: 22467672, guid: b58c19bae463ca24d82249908693d5c8,
    type: 2}
  m_PrefabInternal: {fileID: 289978213}
  m_GameObject: {fileID: 432078945}
  m_LocalRotation: {x: 0, y: 0, z: 0.48727152, w: 0.87325054}
  m_LocalPosition: {x: 0, y: 0, z: 0}
  m_LocalScale: {x: 1, y: 1, z: 1}
  m_Children: []
  m_Father: {fileID: 341347530}
  m_RootOrder: 3
  m_LocalEulerAnglesHint: {x: 0, y: 0, z: 0}
  m_AnchorMin: {x: 0, y: 0}
  m_AnchorMax: {x: 0, y: 0}
  m_AnchoredPosition: {x: 318, y: 318}
  m_SizeDelta: {x: 621, y: 621}
  m_Pivot: {x: 0.5, y: 0.5}
--- !u!114 &432078947
MonoBehaviour:
  m_ObjectHideFlags: 0
  m_PrefabParentObject: {fileID: 11467674, guid: b58c19bae463ca24d82249908693d5c8,
    type: 2}
  m_PrefabInternal: {fileID: 289978213}
  m_GameObject: {fileID: 432078945}
  m_Enabled: 1
  m_EditorHideFlags: 0
  m_Script: {fileID: -765806418, guid: f5f67c52d1564df4a8936ccd202a3bd8, type: 3}
  m_Name: 
  m_EditorClassIdentifier: 
  m_Material: {fileID: 0}
  m_Color: {r: 0.96862745, g: 0.94509804, b: 0.9372549, a: 0.3019608}
  m_RaycastTarget: 1
  m_OnCullStateChanged:
    m_PersistentCalls:
      m_Calls: []
    m_TypeName: UnityEngine.UI.MaskableGraphic+CullStateChangedEvent, UnityEngine.UI,
      Version=1.0.0.0, Culture=neutral, PublicKeyToken=null
  m_Sprite: {fileID: 21300000, guid: 73ff9b0cba4d93a41b8b2f045a8d52c1, type: 3}
  m_Type: 3
  m_PreserveAspect: 0
  m_FillCenter: 1
  m_FillMethod: 4
  m_FillAmount: 0.1
  m_FillClockwise: 1
  m_FillOrigin: 0
--- !u!222 &432078948
CanvasRenderer:
  m_ObjectHideFlags: 0
  m_PrefabParentObject: {fileID: 22267672, guid: b58c19bae463ca24d82249908693d5c8,
    type: 2}
  m_PrefabInternal: {fileID: 289978213}
  m_GameObject: {fileID: 432078945}
--- !u!1 &465595722
GameObject:
  m_ObjectHideFlags: 0
  m_PrefabParentObject: {fileID: 167652, guid: b58c19bae463ca24d82249908693d5c8, type: 2}
  m_PrefabInternal: {fileID: 289978213}
  serializedVersion: 5
  m_Component:
  - component: {fileID: 465595723}
  - component: {fileID: 465595725}
  - component: {fileID: 465595724}
  m_Layer: 5
  m_Name: Circle
  m_TagString: Untagged
  m_Icon: {fileID: 0}
  m_NavMeshLayer: 0
  m_StaticEditorFlags: 0
  m_IsActive: 1
--- !u!224 &465595723
RectTransform:
  m_ObjectHideFlags: 0
  m_PrefabParentObject: {fileID: 22467652, guid: b58c19bae463ca24d82249908693d5c8,
    type: 2}
  m_PrefabInternal: {fileID: 289978213}
  m_GameObject: {fileID: 465595722}
  m_LocalRotation: {x: 0, y: 0, z: 0.77537006, w: -0.6315072}
  m_LocalPosition: {x: 0, y: 0, z: 0}
  m_LocalScale: {x: 1, y: 1, z: 1}
  m_Children: []
  m_Father: {fileID: 341347530}
  m_RootOrder: 8
  m_LocalEulerAnglesHint: {x: 0, y: 0, z: 0}
  m_AnchorMin: {x: 0, y: 0}
  m_AnchorMax: {x: 0, y: 0}
  m_AnchoredPosition: {x: 318, y: 318}
  m_SizeDelta: {x: 621, y: 621}
  m_Pivot: {x: 0.5, y: 0.5}
--- !u!114 &465595724
MonoBehaviour:
  m_ObjectHideFlags: 0
  m_PrefabParentObject: {fileID: 11467654, guid: b58c19bae463ca24d82249908693d5c8,
    type: 2}
  m_PrefabInternal: {fileID: 289978213}
  m_GameObject: {fileID: 465595722}
  m_Enabled: 1
  m_EditorHideFlags: 0
  m_Script: {fileID: -765806418, guid: f5f67c52d1564df4a8936ccd202a3bd8, type: 3}
  m_Name: 
  m_EditorClassIdentifier: 
  m_Material: {fileID: 0}
  m_Color: {r: 0.96862745, g: 0.94509804, b: 0.9372549, a: 0.3019608}
  m_RaycastTarget: 1
  m_OnCullStateChanged:
    m_PersistentCalls:
      m_Calls: []
    m_TypeName: UnityEngine.UI.MaskableGraphic+CullStateChangedEvent, UnityEngine.UI,
      Version=1.0.0.0, Culture=neutral, PublicKeyToken=null
  m_Sprite: {fileID: 21300000, guid: 73ff9b0cba4d93a41b8b2f045a8d52c1, type: 3}
  m_Type: 3
  m_PreserveAspect: 0
  m_FillCenter: 1
  m_FillMethod: 4
  m_FillAmount: 0.1
  m_FillClockwise: 1
  m_FillOrigin: 0
--- !u!222 &465595725
CanvasRenderer:
  m_ObjectHideFlags: 0
  m_PrefabParentObject: {fileID: 22267652, guid: b58c19bae463ca24d82249908693d5c8,
    type: 2}
  m_PrefabInternal: {fileID: 289978213}
  m_GameObject: {fileID: 465595722}
--- !u!1 &617573787
GameObject:
  m_ObjectHideFlags: 0
  m_PrefabParentObject: {fileID: 167646, guid: b58c19bae463ca24d82249908693d5c8, type: 2}
  m_PrefabInternal: {fileID: 289978213}
  serializedVersion: 5
  m_Component:
  - component: {fileID: 617573788}
  - component: {fileID: 617573790}
  - component: {fileID: 617573789}
  m_Layer: 5
  m_Name: AppTitle
  m_TagString: Untagged
  m_Icon: {fileID: 0}
  m_NavMeshLayer: 0
  m_StaticEditorFlags: 0
  m_IsActive: 1
--- !u!224 &617573788
RectTransform:
  m_ObjectHideFlags: 0
  m_PrefabParentObject: {fileID: 22467646, guid: b58c19bae463ca24d82249908693d5c8,
    type: 2}
  m_PrefabInternal: {fileID: 289978213}
  m_GameObject: {fileID: 617573787}
  m_LocalRotation: {x: 0, y: 0, z: 0, w: 1}
  m_LocalPosition: {x: 0, y: 0, z: 0}
  m_LocalScale: {x: 1, y: 1, z: 1}
  m_Children: []
  m_Father: {fileID: 337120667}
  m_RootOrder: 0
  m_LocalEulerAnglesHint: {x: 0, y: 0, z: 0}
  m_AnchorMin: {x: 0.5, y: 0.5}
  m_AnchorMax: {x: 0.5, y: 0.5}
  m_AnchoredPosition: {x: -0.00011635, y: -77}
  m_SizeDelta: {x: 695, y: 109}
  m_Pivot: {x: 0.5, y: 0.5}
--- !u!114 &617573789
MonoBehaviour:
  m_ObjectHideFlags: 0
  m_PrefabParentObject: {fileID: 11467646, guid: b58c19bae463ca24d82249908693d5c8,
    type: 2}
  m_PrefabInternal: {fileID: 289978213}
  m_GameObject: {fileID: 617573787}
  m_Enabled: 1
  m_EditorHideFlags: 0
  m_Script: {fileID: 708705254, guid: f5f67c52d1564df4a8936ccd202a3bd8, type: 3}
  m_Name: 
  m_EditorClassIdentifier: 
  m_Material: {fileID: 0}
  m_Color: {r: 0.85490197, g: 0.85490197, b: 0.85490197, a: 1}
  m_RaycastTarget: 1
  m_OnCullStateChanged:
    m_PersistentCalls:
      m_Calls: []
    m_TypeName: UnityEngine.UI.MaskableGraphic+CullStateChangedEvent, UnityEngine.UI,
      Version=1.0.0.0, Culture=neutral, PublicKeyToken=null
  m_FontData:
    m_Font: {fileID: 12800000, guid: 218956a5c2a6e42d6a60afccf80b002b, type: 3}
    m_FontSize: 40
    m_FontStyle: 0
    m_BestFit: 0
    m_MinSize: 10
    m_MaxSize: 40
    m_Alignment: 0
    m_AlignByGeometry: 0
    m_RichText: 1
    m_HorizontalOverflow: 0
    m_VerticalOverflow: 1
    m_LineSpacing: 1
  m_Text: APP SAMPLE
--- !u!222 &617573790
CanvasRenderer:
  m_ObjectHideFlags: 0
  m_PrefabParentObject: {fileID: 22267646, guid: b58c19bae463ca24d82249908693d5c8,
    type: 2}
  m_PrefabInternal: {fileID: 289978213}
  m_GameObject: {fileID: 617573787}
--- !u!1 &964884559
GameObject:
  m_ObjectHideFlags: 0
  m_PrefabParentObject: {fileID: 167670, guid: b58c19bae463ca24d82249908693d5c8, type: 2}
  m_PrefabInternal: {fileID: 289978213}
  serializedVersion: 5
  m_Component:
  - component: {fileID: 964884560}
  - component: {fileID: 964884562}
  - component: {fileID: 964884561}
  m_Layer: 5
  m_Name: Circle
  m_TagString: Untagged
  m_Icon: {fileID: 0}
  m_NavMeshLayer: 0
  m_StaticEditorFlags: 0
  m_IsActive: 1
--- !u!224 &964884560
RectTransform:
  m_ObjectHideFlags: 0
  m_PrefabParentObject: {fileID: 22467670, guid: b58c19bae463ca24d82249908693d5c8,
    type: 2}
  m_PrefabInternal: {fileID: 289978213}
  m_GameObject: {fileID: 964884559}
  m_LocalRotation: {x: 0, y: 0, z: 0.18804325, w: -0.98216075}
  m_LocalPosition: {x: 0, y: 0, z: 0}
  m_LocalScale: {x: 1, y: 1, z: 1}
  m_Children: []
  m_Father: {fileID: 341347530}
  m_RootOrder: 10
  m_LocalEulerAnglesHint: {x: 0, y: 0, z: 0}
  m_AnchorMin: {x: 0, y: 0}
  m_AnchorMax: {x: 0, y: 0}
  m_AnchoredPosition: {x: 318, y: 318}
  m_SizeDelta: {x: 621, y: 621}
  m_Pivot: {x: 0.5, y: 0.5}
--- !u!114 &964884561
MonoBehaviour:
  m_ObjectHideFlags: 0
  m_PrefabParentObject: {fileID: 11467672, guid: b58c19bae463ca24d82249908693d5c8,
    type: 2}
  m_PrefabInternal: {fileID: 289978213}
  m_GameObject: {fileID: 964884559}
  m_Enabled: 1
  m_EditorHideFlags: 0
  m_Script: {fileID: -765806418, guid: f5f67c52d1564df4a8936ccd202a3bd8, type: 3}
  m_Name: 
  m_EditorClassIdentifier: 
  m_Material: {fileID: 0}
  m_Color: {r: 0.96862745, g: 0.94509804, b: 0.9372549, a: 0.3019608}
  m_RaycastTarget: 1
  m_OnCullStateChanged:
    m_PersistentCalls:
      m_Calls: []
    m_TypeName: UnityEngine.UI.MaskableGraphic+CullStateChangedEvent, UnityEngine.UI,
      Version=1.0.0.0, Culture=neutral, PublicKeyToken=null
  m_Sprite: {fileID: 21300000, guid: 73ff9b0cba4d93a41b8b2f045a8d52c1, type: 3}
  m_Type: 3
  m_PreserveAspect: 0
  m_FillCenter: 1
  m_FillMethod: 4
  m_FillAmount: 0.1
  m_FillClockwise: 1
  m_FillOrigin: 0
--- !u!222 &964884562
CanvasRenderer:
  m_ObjectHideFlags: 0
  m_PrefabParentObject: {fileID: 22267670, guid: b58c19bae463ca24d82249908693d5c8,
    type: 2}
  m_PrefabInternal: {fileID: 289978213}
  m_GameObject: {fileID: 964884559}
--- !u!1 &1226133847
GameObject:
  m_ObjectHideFlags: 0
  m_PrefabParentObject: {fileID: 167654, guid: b58c19bae463ca24d82249908693d5c8, type: 2}
  m_PrefabInternal: {fileID: 289978213}
  serializedVersion: 5
  m_Component:
  - component: {fileID: 1226133848}
  - component: {fileID: 1226133850}
  - component: {fileID: 1226133849}
  m_Layer: 5
  m_Name: Circle
  m_TagString: Untagged
  m_Icon: {fileID: 0}
  m_NavMeshLayer: 0
  m_StaticEditorFlags: 0
  m_IsActive: 1
--- !u!224 &1226133848
RectTransform:
  m_ObjectHideFlags: 0
  m_PrefabParentObject: {fileID: 22467654, guid: b58c19bae463ca24d82249908693d5c8,
    type: 2}
  m_PrefabInternal: {fileID: 289978213}
  m_GameObject: {fileID: 1226133847}
  m_LocalRotation: {x: 0, y: 0, z: 0.9345862, w: 0.35573673}
  m_LocalPosition: {x: 0, y: 0, z: 0}
  m_LocalScale: {x: 1, y: 1, z: 1}
  m_Children: []
  m_Father: {fileID: 341347530}
  m_RootOrder: 5
  m_LocalEulerAnglesHint: {x: 0, y: 0, z: 0}
  m_AnchorMin: {x: 0, y: 0}
  m_AnchorMax: {x: 0, y: 0}
  m_AnchoredPosition: {x: 318, y: 318}
  m_SizeDelta: {x: 621, y: 621}
  m_Pivot: {x: 0.5, y: 0.5}
--- !u!114 &1226133849
MonoBehaviour:
  m_ObjectHideFlags: 0
  m_PrefabParentObject: {fileID: 11467656, guid: b58c19bae463ca24d82249908693d5c8,
    type: 2}
  m_PrefabInternal: {fileID: 289978213}
  m_GameObject: {fileID: 1226133847}
  m_Enabled: 1
  m_EditorHideFlags: 0
  m_Script: {fileID: -765806418, guid: f5f67c52d1564df4a8936ccd202a3bd8, type: 3}
  m_Name: 
  m_EditorClassIdentifier: 
  m_Material: {fileID: 0}
  m_Color: {r: 0.96862745, g: 0.94509804, b: 0.9372549, a: 0.3019608}
  m_RaycastTarget: 1
  m_OnCullStateChanged:
    m_PersistentCalls:
      m_Calls: []
    m_TypeName: UnityEngine.UI.MaskableGraphic+CullStateChangedEvent, UnityEngine.UI,
      Version=1.0.0.0, Culture=neutral, PublicKeyToken=null
  m_Sprite: {fileID: 21300000, guid: 73ff9b0cba4d93a41b8b2f045a8d52c1, type: 3}
  m_Type: 3
  m_PreserveAspect: 0
  m_FillCenter: 1
  m_FillMethod: 4
  m_FillAmount: 0.1
  m_FillClockwise: 1
  m_FillOrigin: 0
--- !u!222 &1226133850
CanvasRenderer:
  m_ObjectHideFlags: 0
  m_PrefabParentObject: {fileID: 22267654, guid: b58c19bae463ca24d82249908693d5c8,
    type: 2}
  m_PrefabInternal: {fileID: 289978213}
  m_GameObject: {fileID: 1226133847}
--- !u!1 &1349716924
GameObject:
  m_ObjectHideFlags: 0
  m_PrefabParentObject: {fileID: 167656, guid: b58c19bae463ca24d82249908693d5c8, type: 2}
  m_PrefabInternal: {fileID: 289978213}
  serializedVersion: 5
  m_Component:
  - component: {fileID: 1349716925}
  - component: {fileID: 1349716927}
  - component: {fileID: 1349716926}
  m_Layer: 5
  m_Name: Circle
  m_TagString: Untagged
  m_Icon: {fileID: 0}
  m_NavMeshLayer: 0
  m_StaticEditorFlags: 0
  m_IsActive: 1
--- !u!224 &1349716925
RectTransform:
  m_ObjectHideFlags: 0
  m_PrefabParentObject: {fileID: 22467656, guid: b58c19bae463ca24d82249908693d5c8,
    type: 2}
  m_PrefabInternal: {fileID: 289978213}
  m_GameObject: {fileID: 1349716924}
  m_LocalRotation: {x: 0, y: 0, z: 0.9445978, w: -0.3282303}
  m_LocalPosition: {x: 0, y: 0, z: 0}
  m_LocalScale: {x: 1, y: 1, z: 1}
  m_Children: []
  m_Father: {fileID: 341347530}
  m_RootOrder: 7
  m_LocalEulerAnglesHint: {x: 0, y: 0, z: 0}
  m_AnchorMin: {x: 0, y: 0}
  m_AnchorMax: {x: 0, y: 0}
  m_AnchoredPosition: {x: 318, y: 318}
  m_SizeDelta: {x: 621, y: 621}
  m_Pivot: {x: 0.5, y: 0.5}
--- !u!114 &1349716926
MonoBehaviour:
  m_ObjectHideFlags: 0
  m_PrefabParentObject: {fileID: 11467658, guid: b58c19bae463ca24d82249908693d5c8,
    type: 2}
  m_PrefabInternal: {fileID: 289978213}
  m_GameObject: {fileID: 1349716924}
  m_Enabled: 1
  m_EditorHideFlags: 0
  m_Script: {fileID: -765806418, guid: f5f67c52d1564df4a8936ccd202a3bd8, type: 3}
  m_Name: 
  m_EditorClassIdentifier: 
  m_Material: {fileID: 0}
  m_Color: {r: 0.96862745, g: 0.94509804, b: 0.9372549, a: 0.61960787}
  m_RaycastTarget: 1
  m_OnCullStateChanged:
    m_PersistentCalls:
      m_Calls: []
    m_TypeName: UnityEngine.UI.MaskableGraphic+CullStateChangedEvent, UnityEngine.UI,
      Version=1.0.0.0, Culture=neutral, PublicKeyToken=null
  m_Sprite: {fileID: 21300000, guid: 73ff9b0cba4d93a41b8b2f045a8d52c1, type: 3}
  m_Type: 3
  m_PreserveAspect: 0
  m_FillCenter: 1
  m_FillMethod: 4
  m_FillAmount: 0.1
  m_FillClockwise: 1
  m_FillOrigin: 0
--- !u!222 &1349716927
CanvasRenderer:
  m_ObjectHideFlags: 0
  m_PrefabParentObject: {fileID: 22267656, guid: b58c19bae463ca24d82249908693d5c8,
    type: 2}
  m_PrefabInternal: {fileID: 289978213}
  m_GameObject: {fileID: 1349716924}
--- !u!1 &1369952002
GameObject:
  m_ObjectHideFlags: 0
  m_PrefabParentObject: {fileID: 167666, guid: b58c19bae463ca24d82249908693d5c8, type: 2}
  m_PrefabInternal: {fileID: 289978213}
  serializedVersion: 5
  m_Component:
  - component: {fileID: 1369952003}
  - component: {fileID: 1369952005}
  - component: {fileID: 1369952004}
  m_Layer: 5
  m_Name: Circle
  m_TagString: Untagged
  m_Icon: {fileID: 0}
  m_NavMeshLayer: 0
  m_StaticEditorFlags: 0
  m_IsActive: 1
--- !u!224 &1369952003
RectTransform:
  m_ObjectHideFlags: 0
  m_PrefabParentObject: {fileID: 22467666, guid: b58c19bae463ca24d82249908693d5c8,
    type: 2}
  m_PrefabInternal: {fileID: 289978213}
  m_GameObject: {fileID: 1369952002}
  m_LocalRotation: {x: 0, y: 0, z: 0.7565544, w: 0.65393084}
  m_LocalPosition: {x: 0, y: 0, z: 0}
  m_LocalScale: {x: 1, y: 1, z: 1}
  m_Children: []
  m_Father: {fileID: 341347530}
  m_RootOrder: 4
  m_LocalEulerAnglesHint: {x: 0, y: 0, z: 0}
  m_AnchorMin: {x: 0, y: 0}
  m_AnchorMax: {x: 0, y: 0}
  m_AnchoredPosition: {x: 318, y: 318}
  m_SizeDelta: {x: 621, y: 621}
  m_Pivot: {x: 0.5, y: 0.5}
--- !u!114 &1369952004
MonoBehaviour:
  m_ObjectHideFlags: 0
  m_PrefabParentObject: {fileID: 11467668, guid: b58c19bae463ca24d82249908693d5c8,
    type: 2}
  m_PrefabInternal: {fileID: 289978213}
  m_GameObject: {fileID: 1369952002}
  m_Enabled: 1
  m_EditorHideFlags: 0
  m_Script: {fileID: -765806418, guid: f5f67c52d1564df4a8936ccd202a3bd8, type: 3}
  m_Name: 
  m_EditorClassIdentifier: 
  m_Material: {fileID: 0}
  m_Color: {r: 0.96862745, g: 0.94509804, b: 0.9372549, a: 0.3019608}
  m_RaycastTarget: 1
  m_OnCullStateChanged:
    m_PersistentCalls:
      m_Calls: []
    m_TypeName: UnityEngine.UI.MaskableGraphic+CullStateChangedEvent, UnityEngine.UI,
      Version=1.0.0.0, Culture=neutral, PublicKeyToken=null
  m_Sprite: {fileID: 21300000, guid: 73ff9b0cba4d93a41b8b2f045a8d52c1, type: 3}
  m_Type: 3
  m_PreserveAspect: 0
  m_FillCenter: 1
  m_FillMethod: 4
  m_FillAmount: 0.1
  m_FillClockwise: 1
  m_FillOrigin: 0
--- !u!222 &1369952005
CanvasRenderer:
  m_ObjectHideFlags: 0
  m_PrefabParentObject: {fileID: 22267666, guid: b58c19bae463ca24d82249908693d5c8,
    type: 2}
  m_PrefabInternal: {fileID: 289978213}
  m_GameObject: {fileID: 1369952002}
--- !u!1 &1500371475
GameObject:
  m_ObjectHideFlags: 0
  m_PrefabParentObject: {fileID: 0}
  m_PrefabInternal: {fileID: 0}
  serializedVersion: 5
  m_Component:
  - component: {fileID: 1500371479}
  - component: {fileID: 1500371478}
  - component: {fileID: 1500371477}
  - component: {fileID: 1500371476}
  m_Layer: 0
  m_Name: EventSystem
  m_TagString: Untagged
  m_Icon: {fileID: 0}
  m_NavMeshLayer: 0
  m_StaticEditorFlags: 0
  m_IsActive: 1
--- !u!114 &1500371476
MonoBehaviour:
  m_ObjectHideFlags: 0
  m_PrefabParentObject: {fileID: 0}
  m_PrefabInternal: {fileID: 0}
  m_GameObject: {fileID: 1500371475}
  m_Enabled: 1
  m_EditorHideFlags: 0
  m_Script: {fileID: 1997211142, guid: f5f67c52d1564df4a8936ccd202a3bd8, type: 3}
  m_Name: 
  m_EditorClassIdentifier: 
  m_ForceModuleActive: 0
--- !u!114 &1500371477
MonoBehaviour:
  m_ObjectHideFlags: 0
  m_PrefabParentObject: {fileID: 0}
  m_PrefabInternal: {fileID: 0}
  m_GameObject: {fileID: 1500371475}
  m_Enabled: 1
  m_EditorHideFlags: 0
  m_Script: {fileID: 1077351063, guid: f5f67c52d1564df4a8936ccd202a3bd8, type: 3}
  m_Name: 
  m_EditorClassIdentifier: 
  m_HorizontalAxis: Horizontal
  m_VerticalAxis: Vertical
  m_SubmitButton: Submit
  m_CancelButton: Cancel
  m_InputActionsPerSecond: 10
  m_RepeatDelay: 0.5
  m_ForceModuleActive: 0
--- !u!114 &1500371478
MonoBehaviour:
  m_ObjectHideFlags: 0
  m_PrefabParentObject: {fileID: 0}
  m_PrefabInternal: {fileID: 0}
  m_GameObject: {fileID: 1500371475}
  m_Enabled: 1
  m_EditorHideFlags: 0
  m_Script: {fileID: -619905303, guid: f5f67c52d1564df4a8936ccd202a3bd8, type: 3}
  m_Name: 
  m_EditorClassIdentifier: 
  m_FirstSelected: {fileID: 0}
  m_sendNavigationEvents: 1
  m_DragThreshold: 5
--- !u!4 &1500371479
Transform:
  m_ObjectHideFlags: 0
  m_PrefabParentObject: {fileID: 0}
  m_PrefabInternal: {fileID: 0}
  m_GameObject: {fileID: 1500371475}
  m_LocalRotation: {x: 0, y: 0, z: 0, w: 1}
  m_LocalPosition: {x: 0, y: 0, z: 0}
  m_LocalScale: {x: 1, y: 1, z: 1}
  m_Children: []
  m_Father: {fileID: 0}
  m_RootOrder: 1
  m_LocalEulerAnglesHint: {x: 0, y: 0, z: 0}
--- !u!1 &1511305452
GameObject:
  m_ObjectHideFlags: 0
  m_PrefabParentObject: {fileID: 0}
  m_PrefabInternal: {fileID: 0}
  serializedVersion: 5
  m_Component:
  - component: {fileID: 1511305453}
  m_Layer: 0
  m_Name: __SET_YOUR_GAMESCREEN_TO_636x636
  m_TagString: Untagged
  m_Icon: {fileID: 0}
  m_NavMeshLayer: 0
  m_StaticEditorFlags: 0
  m_IsActive: 1
--- !u!4 &1511305453
Transform:
  m_ObjectHideFlags: 0
  m_PrefabParentObject: {fileID: 0}
  m_PrefabInternal: {fileID: 0}
  m_GameObject: {fileID: 1511305452}
  m_LocalRotation: {x: 0, y: 0, z: 0, w: 1}
  m_LocalPosition: {x: 494.995, y: 627.74, z: 0}
  m_LocalScale: {x: 1, y: 1, z: 1}
  m_Children: []
  m_Father: {fileID: 0}
  m_RootOrder: 2
  m_LocalEulerAnglesHint: {x: 0, y: 0, z: 0}
--- !u!1 &1782270859
GameObject:
  m_ObjectHideFlags: 0
  m_PrefabParentObject: {fileID: 167668, guid: b58c19bae463ca24d82249908693d5c8, type: 2}
  m_PrefabInternal: {fileID: 289978213}
  serializedVersion: 5
  m_Component:
  - component: {fileID: 1782270860}
  - component: {fileID: 1782270862}
  - component: {fileID: 1782270861}
  m_Layer: 5
  m_Name: Text
  m_TagString: Untagged
  m_Icon: {fileID: 0}
  m_NavMeshLayer: 0
  m_StaticEditorFlags: 0
  m_IsActive: 1
--- !u!224 &1782270860
RectTransform:
  m_ObjectHideFlags: 0
  m_PrefabParentObject: {fileID: 22467668, guid: b58c19bae463ca24d82249908693d5c8,
    type: 2}
  m_PrefabInternal: {fileID: 289978213}
  m_GameObject: {fileID: 1782270859}
  m_LocalRotation: {x: 0, y: 0, z: 0, w: 1}
  m_LocalPosition: {x: 0, y: 0, z: 0}
  m_LocalScale: {x: 1, y: 1, z: 1}
  m_Children: []
  m_Father: {fileID: 341347530}
  m_RootOrder: 1
  m_LocalEulerAnglesHint: {x: 0, y: 0, z: 0}
  m_AnchorMin: {x: 0.5, y: 0.5}
  m_AnchorMax: {x: 0.5, y: 0.5}
  m_AnchoredPosition: {x: 0, y: 15}
  m_SizeDelta: {x: 636, y: 139}
  m_Pivot: {x: 0.5, y: 0.5}
--- !u!114 &1782270861
MonoBehaviour:
  m_ObjectHideFlags: 0
  m_PrefabParentObject: {fileID: 11467670, guid: b58c19bae463ca24d82249908693d5c8,
    type: 2}
  m_PrefabInternal: {fileID: 289978213}
  m_GameObject: {fileID: 1782270859}
  m_Enabled: 1
  m_EditorHideFlags: 0
  m_Script: {fileID: 708705254, guid: f5f67c52d1564df4a8936ccd202a3bd8, type: 3}
  m_Name: 
  m_EditorClassIdentifier: 
  m_Material: {fileID: 0}
  m_Color: {r: 0.96862745, g: 0.94509804, b: 0.9372549, a: 0.8352941}
  m_RaycastTarget: 1
  m_OnCullStateChanged:
    m_PersistentCalls:
      m_Calls: []
    m_TypeName: UnityEngine.UI.MaskableGraphic+CullStateChangedEvent, UnityEngine.UI,
      Version=1.0.0.0, Culture=neutral, PublicKeyToken=null
  m_FontData:
    m_Font: {fileID: 12800000, guid: 5c425d43bb0df45ca8eb162d5154251e, type: 3}
    m_FontSize: 80
    m_FontStyle: 0
    m_BestFit: 0
    m_MinSize: 10
    m_MaxSize: 80
    m_Alignment: 4
    m_AlignByGeometry: 0
    m_RichText: 1
    m_HorizontalOverflow: 0
    m_VerticalOverflow: 0
    m_LineSpacing: 1
  m_Text: 03:40AM
--- !u!222 &1782270862
CanvasRenderer:
  m_ObjectHideFlags: 0
  m_PrefabParentObject: {fileID: 22267668, guid: b58c19bae463ca24d82249908693d5c8,
    type: 2}
  m_PrefabInternal: {fileID: 289978213}
  m_GameObject: {fileID: 1782270859}
--- !u!1 &1867810195
GameObject:
  m_ObjectHideFlags: 0
  m_PrefabParentObject: {fileID: 167662, guid: b58c19bae463ca24d82249908693d5c8, type: 2}
  m_PrefabInternal: {fileID: 289978213}
  serializedVersion: 5
  m_Component:
  - component: {fileID: 1867810196}
  - component: {fileID: 1867810198}
  - component: {fileID: 1867810197}
  m_Layer: 5
  m_Name: Circle
  m_TagString: Untagged
  m_Icon: {fileID: 0}
  m_NavMeshLayer: 0
  m_StaticEditorFlags: 0
  m_IsActive: 1
--- !u!224 &1867810196
RectTransform:
  m_ObjectHideFlags: 0
  m_PrefabParentObject: {fileID: 22467662, guid: b58c19bae463ca24d82249908693d5c8,
    type: 2}
  m_PrefabInternal: {fileID: 289978213}
  m_GameObject: {fileID: 1867810195}
  m_LocalRotation: {x: 0, y: 0, z: 0.1592161, w: 0.9872438}
  m_LocalPosition: {x: 0, y: 0, z: 0}
  m_LocalScale: {x: 1, y: 1, z: 1}
  m_Children: []
  m_Father: {fileID: 341347530}
  m_RootOrder: 11
  m_LocalEulerAnglesHint: {x: 0, y: 0, z: 0}
  m_AnchorMin: {x: 0, y: 0}
  m_AnchorMax: {x: 0, y: 0}
  m_AnchoredPosition: {x: 318, y: 318}
  m_SizeDelta: {x: 621, y: 621}
  m_Pivot: {x: 0.5, y: 0.5}
--- !u!114 &1867810197
MonoBehaviour:
  m_ObjectHideFlags: 0
  m_PrefabParentObject: {fileID: 11467664, guid: b58c19bae463ca24d82249908693d5c8,
    type: 2}
  m_PrefabInternal: {fileID: 289978213}
  m_GameObject: {fileID: 1867810195}
  m_Enabled: 1
  m_EditorHideFlags: 0
  m_Script: {fileID: -765806418, guid: f5f67c52d1564df4a8936ccd202a3bd8, type: 3}
  m_Name: 
  m_EditorClassIdentifier: 
  m_Material: {fileID: 0}
  m_Color: {r: 0.96862745, g: 0.94509804, b: 0.9372549, a: 0.3019608}
  m_RaycastTarget: 1
  m_OnCullStateChanged:
    m_PersistentCalls:
      m_Calls: []
    m_TypeName: UnityEngine.UI.MaskableGraphic+CullStateChangedEvent, UnityEngine.UI,
      Version=1.0.0.0, Culture=neutral, PublicKeyToken=null
  m_Sprite: {fileID: 21300000, guid: 73ff9b0cba4d93a41b8b2f045a8d52c1, type: 3}
  m_Type: 3
  m_PreserveAspect: 0
  m_FillCenter: 1
  m_FillMethod: 4
  m_FillAmount: 0.1
  m_FillClockwise: 1
  m_FillOrigin: 0
--- !u!222 &1867810198
CanvasRenderer:
  m_ObjectHideFlags: 0
  m_PrefabParentObject: {fileID: 22267662, guid: b58c19bae463ca24d82249908693d5c8,
    type: 2}
  m_PrefabInternal: {fileID: 289978213}
  m_GameObject: {fileID: 1867810195}
--- !u!1 &2088335561
GameObject:
  m_ObjectHideFlags: 0
  m_PrefabParentObject: {fileID: 167648, guid: b58c19bae463ca24d82249908693d5c8, type: 2}
  m_PrefabInternal: {fileID: 289978213}
  serializedVersion: 5
  m_Component:
  - component: {fileID: 2088335562}
  - component: {fileID: 2088335564}
  - component: {fileID: 2088335563}
  m_Layer: 5
  m_Name: Circle
  m_TagString: Untagged
  m_Icon: {fileID: 0}
  m_NavMeshLayer: 0
  m_StaticEditorFlags: 0
  m_IsActive: 1
--- !u!224 &2088335562
RectTransform:
  m_ObjectHideFlags: 0
  m_PrefabParentObject: {fileID: 22467648, guid: b58c19bae463ca24d82249908693d5c8,
    type: 2}
  m_PrefabInternal: {fileID: 289978213}
  m_GameObject: {fileID: 2088335561}
  m_LocalRotation: {x: 0, y: 0, z: 0.5126217, w: -0.8586146}
  m_LocalPosition: {x: 0, y: 0, z: 0}
  m_LocalScale: {x: 1, y: 1, z: 1}
  m_Children: []
  m_Father: {fileID: 341347530}
  m_RootOrder: 9
  m_LocalEulerAnglesHint: {x: 0, y: 0, z: 0}
  m_AnchorMin: {x: 0, y: 0}
  m_AnchorMax: {x: 0, y: 0}
  m_AnchoredPosition: {x: 318, y: 318}
  m_SizeDelta: {x: 621, y: 621}
  m_Pivot: {x: 0.5, y: 0.5}
--- !u!114 &2088335563
MonoBehaviour:
  m_ObjectHideFlags: 0
  m_PrefabParentObject: {fileID: 11467648, guid: b58c19bae463ca24d82249908693d5c8,
    type: 2}
  m_PrefabInternal: {fileID: 289978213}
  m_GameObject: {fileID: 2088335561}
  m_Enabled: 1
  m_EditorHideFlags: 0
  m_Script: {fileID: -765806418, guid: f5f67c52d1564df4a8936ccd202a3bd8, type: 3}
  m_Name: 
  m_EditorClassIdentifier: 
  m_Material: {fileID: 0}
  m_Color: {r: 0.96862745, g: 0.94509804, b: 0.9372549, a: 0.3019608}
  m_RaycastTarget: 1
  m_OnCullStateChanged:
    m_PersistentCalls:
      m_Calls: []
    m_TypeName: UnityEngine.UI.MaskableGraphic+CullStateChangedEvent, UnityEngine.UI,
      Version=1.0.0.0, Culture=neutral, PublicKeyToken=null
  m_Sprite: {fileID: 21300000, guid: 73ff9b0cba4d93a41b8b2f045a8d52c1, type: 3}
  m_Type: 3
  m_PreserveAspect: 0
  m_FillCenter: 1
  m_FillMethod: 4
  m_FillAmount: 0.1
  m_FillClockwise: 1
  m_FillOrigin: 0
--- !u!222 &2088335564
CanvasRenderer:
  m_ObjectHideFlags: 0
  m_PrefabParentObject: {fileID: 22267648, guid: b58c19bae463ca24d82249908693d5c8,
    type: 2}
  m_PrefabInternal: {fileID: 289978213}
  m_GameObject: {fileID: 2088335561}
--- !u!1 &2124271997
GameObject:
  m_ObjectHideFlags: 0
  m_PrefabParentObject: {fileID: 167664, guid: b58c19bae463ca24d82249908693d5c8, type: 2}
  m_PrefabInternal: {fileID: 289978213}
  serializedVersion: 5
  m_Component:
  - component: {fileID: 2124271998}
  - component: {fileID: 2124272000}
  - component: {fileID: 2124271999}
  m_Layer: 5
  m_Name: Circle
  m_TagString: Untagged
  m_Icon: {fileID: 0}
  m_NavMeshLayer: 0
  m_StaticEditorFlags: 0
  m_IsActive: 1
--- !u!224 &2124271998
RectTransform:
  m_ObjectHideFlags: 0
  m_PrefabParentObject: {fileID: 22467664, guid: b58c19bae463ca24d82249908693d5c8,
    type: 2}
  m_PrefabInternal: {fileID: 289978213}
  m_GameObject: {fileID: 2124271997}
  m_LocalRotation: {x: 0, y: 0, z: 0.9998929, w: 0.014635942}
  m_LocalPosition: {x: 0, y: 0, z: 0}
  m_LocalScale: {x: 1, y: 1, z: 1}
  m_Children: []
  m_Father: {fileID: 341347530}
  m_RootOrder: 6
  m_LocalEulerAnglesHint: {x: 0, y: 0, z: 0}
  m_AnchorMin: {x: 0, y: 0}
  m_AnchorMax: {x: 0, y: 0}
  m_AnchoredPosition: {x: 318, y: 318}
  m_SizeDelta: {x: 621, y: 621}
  m_Pivot: {x: 0.5, y: 0.5}
--- !u!114 &2124271999
MonoBehaviour:
  m_ObjectHideFlags: 0
  m_PrefabParentObject: {fileID: 11467666, guid: b58c19bae463ca24d82249908693d5c8,
    type: 2}
  m_PrefabInternal: {fileID: 289978213}
  m_GameObject: {fileID: 2124271997}
  m_Enabled: 1
  m_EditorHideFlags: 0
  m_Script: {fileID: -765806418, guid: f5f67c52d1564df4a8936ccd202a3bd8, type: 3}
  m_Name: 
  m_EditorClassIdentifier: 
  m_Material: {fileID: 0}
  m_Color: {r: 0.96862745, g: 0.94509804, b: 0.9372549, a: 0.3019608}
  m_RaycastTarget: 1
  m_OnCullStateChanged:
    m_PersistentCalls:
      m_Calls: []
    m_TypeName: UnityEngine.UI.MaskableGraphic+CullStateChangedEvent, UnityEngine.UI,
      Version=1.0.0.0, Culture=neutral, PublicKeyToken=null
  m_Sprite: {fileID: 21300000, guid: 73ff9b0cba4d93a41b8b2f045a8d52c1, type: 3}
  m_Type: 3
  m_PreserveAspect: 0
  m_FillCenter: 1
  m_FillMethod: 4
  m_FillAmount: 0.1
  m_FillClockwise: 1
  m_FillOrigin: 0
--- !u!222 &2124272000
CanvasRenderer:
  m_ObjectHideFlags: 0
  m_PrefabParentObject: {fileID: 22267664, guid: b58c19bae463ca24d82249908693d5c8,
    type: 2}
  m_PrefabInternal: {fileID: 289978213}
  m_GameObject: {fileID: 2124271997}
