<svg width="1381" height="1600" viewBox="0 0 1381 1600" fill="none" xmlns="http://www.w3.org/2000/svg">
<g clip-path="url(#clip0)">
<rect x="14.0924" width="1366.59" height="1587.38" transform="rotate(0.493859 14.0924 0)" fill="white"/>
<rect x="1350.57" y="-152" width="442.342" height="2432.07" transform="rotate(41.7215 1350.57 -152)" fill="#C3C9CC"/>
<rect x="-148" y="-165.673" width="418" height="2376.07" transform="rotate(-48.5546 -148 -165.673)" fill="#C3C9CC"/>
<rect x="-332.05" y="658.971" width="418" height="2025.33" transform="rotate(-48.3793 -332.05 658.971)" fill="#C3C9CC"/>
</g>
<defs>
<clipPath id="clip0">
<rect x="14.0924" width="1366.59" height="1587.38" transform="rotate(0.493859 14.0924 0)" fill="white"/>
</clipPath>
</defs>
</svg>
