{
  "classifierPath" : "meta::pure::metamodel::type::Enumeration",
  "content" : {
    "_type" : "Enumeration",
    "name" : "LoanTradingTypeEnum",
    "package" : "FpML::model",
    "taggedValues" : [ {
      "tag" : {
        "profile" : "meta::pure::profiles::doc",
        "value" : "doc"
      },
      "value" : "A list that specifies whether a trade was executed during the syndication period or in the post-syndication market."
    } ],
    "values" : [ {
      "value" : "Primary"
    }, {
      "value" : "Secondary"
    } ]
  }
}