{
  "classifierPath" : "meta::pure::metamodel::type::Enumeration",
  "content" : {
    "_type" : "Enumeration",
    "name" : "SettlementPeriodDurationEnum",
    "package" : "FpML::model",
    "taggedValues" : [ {
      "tag" : {
        "profile" : "meta::pure::profiles::doc",
        "value" : "doc"
      },
      "value" : "Defines the Settlement Period Duration for an Electricity Transaction."
    } ],
    "values" : [ {
      "value" : "_2Hours"
    }, {
      "value" : "_1Hour"
    }, {
      "value" : "_30Minutes"
    }, {
      "value" : "_15Minutes"
    } ]
  }
}