{
  "classifierPath" : "meta::pure::metamodel::type::Enumeration",
  "content" : {
    "_type" : "Enumeration",
    "name" : "AccrualReferenceAmountTypeEnum",
    "package" : "FpML::model",
    "taggedValues" : [ {
      "tag" : {
        "profile" : "meta::pure::profiles::doc",
        "value" : "doc"
      },
      "value" : "The type of amount referenced by the accrual."
    } ],
    "values" : [ {
      "value" : "Commitment"
    }, {
      "value" : "Funded"
    }, {
      "value" : "Other"
    }, {
      "value" : "Unfunded"
    }, {
      "value" : "Unutilized"
    }, {
      "value" : "Utilized"
    } ]
  }
}