{
  "classifierPath" : "meta::pure::metamodel::type::Class",
  "content" : {
    "_type" : "class",
    "constraints" : [ {
      "functionDefinition" : {
        "_type" : "lambda",
        "body" : [ {
          "_type" : "func",
          "function" : "forAll",
          "parameters" : [ {
            "_type" : "property",
            "parameters" : [ {
              "_type" : "var",
              "name" : "this",
              "sourceInformation" : {
                "endColumn" : 18,
                "endLine" : 8648,
                "sourceId" : "",
                "startColumn" : 14,
                "startLine" : 8648
              }
            } ],
            "property" : "publicSource",
            "sourceInformation" : {
              "endColumn" : 31,
              "endLine" : 8648,
              "sourceId" : "",
              "startColumn" : 20,
              "startLine" : 8648
            }
          }, {
            "_type" : "lambda",
            "body" : [ {
              "_type" : "func",
              "function" : "greaterThanEqual",
              "parameters" : [ {
                "_type" : "func",
                "function" : "length",
                "parameters" : [ {
                  "_type" : "var",
                  "name" : "x",
                  "sourceInformation" : {
                    "endColumn" : 55,
                    "endLine" : 8648,
                    "sourceId" : "",
                    "startColumn" : 54,
                    "startLine" : 8648
                  }
                } ],
                "sourceInformation" : {
                  "endColumn" : 63,
                  "endLine" : 8648,
                  "sourceId" : "",
                  "startColumn" : 58,
                  "startLine" : 8648
                }
              }, {
                "_type" : "integer",
                "multiplicity" : {
                  "lowerBound" : 1,
                  "upperBound" : 1
                },
                "sourceInformation" : {
                  "endColumn" : 70,
                  "endLine" : 8648,
                  "sourceId" : "",
                  "startColumn" : 70,
                  "startLine" : 8648
                },
                "values" : [ 1 ]
              } ],
              "sourceInformation" : {
                "endColumn" : 70,
                "endLine" : 8648,
                "sourceId" : "",
                "startColumn" : 67,
                "startLine" : 8648
              }
            } ],
            "parameters" : [ {
              "_type" : "var",
              "class" : "String",
              "multiplicity" : {
                "lowerBound" : 1,
                "upperBound" : 1
              },
              "name" : "x",
              "sourceInformation" : {
                "endColumn" : 49,
                "endLine" : 8648,
                "sourceId" : "",
                "startColumn" : 44,
                "startLine" : 8648
              }
            } ],
            "sourceInformation" : {
              "endColumn" : 70,
              "endLine" : 8648,
              "sourceId" : "",
              "startColumn" : 53,
              "startLine" : 8648
            }
          } ],
          "sourceInformation" : {
            "endColumn" : 39,
            "endLine" : 8648,
            "sourceId" : "",
            "startColumn" : 34,
            "startLine" : 8648
          }
        } ],
        "parameters" : [ ]
      },
      "name" : "c1_length"
    } ],
    "name" : "PubliclyAvailableInformation",
    "package" : "FpML::model",
    "properties" : [ {
      "multiplicity" : {
        "lowerBound" : 0,
        "upperBound" : 1
      },
      "name" : "standardPublicSources",
      "taggedValues" : [ {
        "tag" : {
          "profile" : "meta::pure::profiles::doc",
          "value" : "doc"
        },
        "value" : "If this element is specified and set to 'true', indicates that ISDA defined Standard Public Sources are applicable."
      } ],
      "type" : "Boolean"
    }, {
      "multiplicity" : {
        "lowerBound" : 0
      },
      "name" : "publicSource",
      "taggedValues" : [ {
        "tag" : {
          "profile" : "meta::pure::profiles::doc",
          "value" : "doc"
        },
        "value" : "A public information source, e.g. a particular newspaper or electronic news service, that may publish relevant information used in the determination of whether or not a credit event has occurred. ISDA 2003 Term: Public Source."
      } ],
      "type" : "String"
    }, {
      "multiplicity" : {
        "lowerBound" : 0,
        "upperBound" : 1
      },
      "name" : "specifiedNumber",
      "taggedValues" : [ {
        "tag" : {
          "profile" : "meta::pure::profiles::doc",
          "value" : "doc"
        },
        "value" : "The minimum number of the specified public information sources that must publish information that reasonably confirms that a credit event has occurred. The market convention is two. ISDA 2003 Term: Specified Number."
      } ],
      "type" : "Decimal"
    } ]
  }
}