{
  "classifierPath" : "meta::pure::metamodel::type::Class",
  "content" : {
    "_type" : "class",
    "constraints" : [ {
      "functionDefinition" : {
        "_type" : "lambda",
        "body" : [ {
          "_type" : "func",
          "function" : "or",
          "parameters" : [ {
            "_type" : "func",
            "function" : "isNotEmpty",
            "parameters" : [ {
              "_type" : "property",
              "parameters" : [ {
                "_type" : "var",
                "name" : "this",
                "sourceInformation" : {
                  "endColumn" : 18,
                  "endLine" : 7438,
                  "sourceId" : "",
                  "startColumn" : 14,
                  "startLine" : 7438
                }
              } ],
              "property" : "indexName",
              "sourceInformation" : {
                "endColumn" : 28,
                "endLine" : 7438,
                "sourceId" : "",
                "startColumn" : 20,
                "startLine" : 7438
              }
            } ],
            "sourceInformation" : {
              "endColumn" : 40,
              "endLine" : 7438,
              "sourceId" : "",
              "startColumn" : 31,
              "startLine" : 7438
            }
          }, {
            "_type" : "func",
            "function" : "isEmpty",
            "parameters" : [ {
              "_type" : "property",
              "parameters" : [ {
                "_type" : "var",
                "name" : "this",
                "sourceInformation" : {
                  "endColumn" : 51,
                  "endLine" : 7438,
                  "sourceId" : "",
                  "startColumn" : 47,
                  "startLine" : 7438
                }
              } ],
              "property" : "indexName",
              "sourceInformation" : {
                "endColumn" : 61,
                "endLine" : 7438,
                "sourceId" : "",
                "startColumn" : 53,
                "startLine" : 7438
              }
            } ],
            "sourceInformation" : {
              "endColumn" : 70,
              "endLine" : 7438,
              "sourceId" : "",
              "startColumn" : 64,
              "startLine" : 7438
            }
          } ],
          "sourceInformation" : {
            "endColumn" : 45,
            "endLine" : 7438,
            "sourceId" : "",
            "startColumn" : 44,
            "startLine" : 7438
          }
        } ],
        "parameters" : [ ]
      },
      "name" : "c1_choice"
    } ],
    "name" : "IndexReferenceInformation",
    "package" : "FpML::model",
    "properties" : [ {
      "multiplicity" : {
        "lowerBound" : 0,
        "upperBound" : 1
      },
      "name" : "indexName",
      "taggedValues" : [ {
        "tag" : {
          "profile" : "meta::pure::profiles::doc",
          "value" : "doc"
        },
        "value" : "The name of the index expressed as a free format string. FpML does not define usage rules for this element."
      } ],
      "type" : "FpML::model::IndexName"
    }, {
      "multiplicity" : {
        "lowerBound" : 0
      },
      "name" : "indexId",
      "taggedValues" : [ {
        "tag" : {
          "profile" : "meta::pure::profiles::doc",
          "value" : "doc"
        },
        "value" : "A CDS index identifier (e.g. RED pair code)."
      } ],
      "type" : "FpML::model::IndexId"
    }, {
      "multiplicity" : {
        "lowerBound" : 0,
        "upperBound" : 1
      },
      "name" : "indexSeries",
      "taggedValues" : [ {
        "tag" : {
          "profile" : "meta::pure::profiles::doc",
          "value" : "doc"
        },
        "value" : "A CDS index series identifier, e.g. 1, 2, 3 etc."
      } ],
      "type" : "Decimal"
    }, {
      "multiplicity" : {
        "lowerBound" : 0,
        "upperBound" : 1
      },
      "name" : "indexAnnexVersion",
      "taggedValues" : [ {
        "tag" : {
          "profile" : "meta::pure::profiles::doc",
          "value" : "doc"
        },
        "value" : "A CDS index series version identifier, e.g. 1, 2, 3 etc."
      } ],
      "type" : "Decimal"
    }, {
      "multiplicity" : {
        "lowerBound" : 0,
        "upperBound" : 1
      },
      "name" : "indexAnnexDate",
      "taggedValues" : [ {
        "tag" : {
          "profile" : "meta::pure::profiles::doc",
          "value" : "doc"
        },
        "value" : "A CDS index series annex date."
      } ],
      "type" : "StrictDate"
    }, {
      "multiplicity" : {
        "lowerBound" : 0,
        "upperBound" : 1
      },
      "name" : "indexAnnexSource",
      "taggedValues" : [ {
        "tag" : {
          "profile" : "meta::pure::profiles::doc",
          "value" : "doc"
        },
        "value" : "A CDS index series annex source."
      } ],
      "type" : "FpML::model::IndexAnnexSource"
    }, {
      "multiplicity" : {
        "lowerBound" : 0
      },
      "name" : "excludedReferenceEntity",
      "taggedValues" : [ {
        "tag" : {
          "profile" : "meta::pure::profiles::doc",
          "value" : "doc"
        },
        "value" : "Excluded reference entity."
      } ],
      "type" : "FpML::model::LegalEntity"
    }, {
      "multiplicity" : {
        "lowerBound" : 0,
        "upperBound" : 1
      },
      "name" : "tranche",
      "taggedValues" : [ {
        "tag" : {
          "profile" : "meta::pure::profiles::doc",
          "value" : "doc"
        },
        "value" : "This element contains CDS tranche terms."
      } ],
      "type" : "FpML::model::Tranche"
    }, {
      "multiplicity" : {
        "lowerBound" : 0,
        "upperBound" : 1
      },
      "name" : "settledEntityMatrix",
      "taggedValues" : [ {
        "tag" : {
          "profile" : "meta::pure::profiles::doc",
          "value" : "doc"
        },
        "value" : "Used to specify the Relevant Settled Entity Matrix when there are settled entities at the time of the trade."
      } ],
      "type" : "FpML::model::SettledEntityMatrix"
    }, {
      "multiplicity" : {
        "lowerBound" : 0,
        "upperBound" : 1
      },
      "name" : "indexFactor",
      "taggedValues" : [ {
        "tag" : {
          "profile" : "meta::pure::profiles::doc",
          "value" : "doc"
        },
        "value" : "Index Factor is the index version factor or percent, expressed as an absolute decimal value between 0 and 1, that multiplied by the original notional amount yields the notional amount covered by the seller of protection."
      } ],
      "type" : "Decimal"
    }, {
      "multiplicity" : {
        "lowerBound" : 0,
        "upperBound" : 1
      },
      "name" : "seniority",
      "taggedValues" : [ {
        "tag" : {
          "profile" : "meta::pure::profiles::doc",
          "value" : "doc"
        },
        "value" : "Seniority of debt instruments comprising the index."
      } ],
      "type" : "FpML::model::CreditSeniority"
    }, {
      "multiplicity" : {
        "lowerBound" : 0,
        "upperBound" : 1
      },
      "name" : "id",
      "type" : "String"
    } ],
    "taggedValues" : [ {
      "tag" : {
        "profile" : "meta::pure::profiles::doc",
        "value" : "doc"
      },
      "value" : "A type defining a Credit Default Swap Index."
    } ]
  }
}