{
  "classifierPath" : "meta::pure::metamodel::type::Class",
  "content" : {
    "_type" : "class",
    "constraints" : [ {
      "functionDefinition" : {
        "_type" : "lambda",
        "body" : [ {
          "_type" : "func",
          "function" : "forAll",
          "parameters" : [ {
            "_type" : "property",
            "parameters" : [ {
              "_type" : "var",
              "name" : "this",
              "sourceInformation" : {
                "endColumn" : 18,
                "endLine" : 7724,
                "sourceId" : "",
                "startColumn" : 14,
                "startLine" : 7724
              }
            } ],
            "property" : "masterAgreementIdScheme",
            "sourceInformation" : {
              "endColumn" : 42,
              "endLine" : 7724,
              "sourceId" : "",
              "startColumn" : 20,
              "startLine" : 7724
            }
          }, {
            "_type" : "lambda",
            "body" : [ {
              "_type" : "func",
              "function" : "greaterThanEqual",
              "parameters" : [ {
                "_type" : "func",
                "function" : "length",
                "parameters" : [ {
                  "_type" : "var",
                  "name" : "x",
                  "sourceInformation" : {
                    "endColumn" : 66,
                    "endLine" : 7724,
                    "sourceId" : "",
                    "startColumn" : 65,
                    "startLine" : 7724
                  }
                } ],
                "sourceInformation" : {
                  "endColumn" : 74,
                  "endLine" : 7724,
                  "sourceId" : "",
                  "startColumn" : 69,
                  "startLine" : 7724
                }
              }, {
                "_type" : "integer",
                "multiplicity" : {
                  "lowerBound" : 1,
                  "upperBound" : 1
                },
                "sourceInformation" : {
                  "endColumn" : 81,
                  "endLine" : 7724,
                  "sourceId" : "",
                  "startColumn" : 81,
                  "startLine" : 7724
                },
                "values" : [ 1 ]
              } ],
              "sourceInformation" : {
                "endColumn" : 81,
                "endLine" : 7724,
                "sourceId" : "",
                "startColumn" : 78,
                "startLine" : 7724
              }
            } ],
            "parameters" : [ {
              "_type" : "var",
              "class" : "String",
              "multiplicity" : {
                "lowerBound" : 1,
                "upperBound" : 1
              },
              "name" : "x",
              "sourceInformation" : {
                "endColumn" : 60,
                "endLine" : 7724,
                "sourceId" : "",
                "startColumn" : 55,
                "startLine" : 7724
              }
            } ],
            "sourceInformation" : {
              "endColumn" : 81,
              "endLine" : 7724,
              "sourceId" : "",
              "startColumn" : 64,
              "startLine" : 7724
            }
          } ],
          "sourceInformation" : {
            "endColumn" : 50,
            "endLine" : 7724,
            "sourceId" : "",
            "startColumn" : 45,
            "startLine" : 7724
          }
        } ],
        "parameters" : [ ]
      },
      "name" : "c1_length"
    }, {
      "functionDefinition" : {
        "_type" : "lambda",
        "body" : [ {
          "_type" : "func",
          "function" : "greaterThanEqual",
          "parameters" : [ {
            "_type" : "func",
            "function" : "length",
            "parameters" : [ {
              "_type" : "property",
              "parameters" : [ {
                "_type" : "var",
                "name" : "this",
                "sourceInformation" : {
                  "endColumn" : 18,
                  "endLine" : 7725,
                  "sourceId" : "",
                  "startColumn" : 14,
                  "startLine" : 7725
                }
              } ],
              "property" : "value",
              "sourceInformation" : {
                "endColumn" : 24,
                "endLine" : 7725,
                "sourceId" : "",
                "startColumn" : 20,
                "startLine" : 7725
              }
            } ],
            "sourceInformation" : {
              "endColumn" : 32,
              "endLine" : 7725,
              "sourceId" : "",
              "startColumn" : 27,
              "startLine" : 7725
            }
          }, {
            "_type" : "integer",
            "multiplicity" : {
              "lowerBound" : 1,
              "upperBound" : 1
            },
            "sourceInformation" : {
              "endColumn" : 39,
              "endLine" : 7725,
              "sourceId" : "",
              "startColumn" : 39,
              "startLine" : 7725
            },
            "values" : [ 1 ]
          } ],
          "sourceInformation" : {
            "endColumn" : 39,
            "endLine" : 7725,
            "sourceId" : "",
            "startColumn" : 36,
            "startLine" : 7725
          }
        } ],
        "parameters" : [ ]
      },
      "name" : "c2_length"
    }, {
      "functionDefinition" : {
        "_type" : "lambda",
        "body" : [ {
          "_type" : "func",
          "function" : "lessThanEqual",
          "parameters" : [ {
            "_type" : "func",
            "function" : "length",
            "parameters" : [ {
              "_type" : "property",
              "parameters" : [ {
                "_type" : "var",
                "name" : "this",
                "sourceInformation" : {
                  "endColumn" : 18,
                  "endLine" : 7726,
                  "sourceId" : "",
                  "startColumn" : 14,
                  "startLine" : 7726
                }
              } ],
              "property" : "value",
              "sourceInformation" : {
                "endColumn" : 24,
                "endLine" : 7726,
                "sourceId" : "",
                "startColumn" : 20,
                "startLine" : 7726
              }
            } ],
            "sourceInformation" : {
              "endColumn" : 32,
              "endLine" : 7726,
              "sourceId" : "",
              "startColumn" : 27,
              "startLine" : 7726
            }
          }, {
            "_type" : "integer",
            "multiplicity" : {
              "lowerBound" : 1,
              "upperBound" : 1
            },
            "sourceInformation" : {
              "endColumn" : 41,
              "endLine" : 7726,
              "sourceId" : "",
              "startColumn" : 39,
              "startLine" : 7726
            },
            "values" : [ 255 ]
          } ],
          "sourceInformation" : {
            "endColumn" : 41,
            "endLine" : 7726,
            "sourceId" : "",
            "startColumn" : 36,
            "startLine" : 7726
          }
        } ],
        "parameters" : [ ]
      },
      "name" : "c3_length"
    } ],
    "name" : "MasterAgreementId",
    "package" : "FpML::model",
    "properties" : [ {
      "multiplicity" : {
        "lowerBound" : 0,
        "upperBound" : 1
      },
      "name" : "masterAgreementIdScheme",
      "type" : "String"
    }, {
      "multiplicity" : {
        "lowerBound" : 1,
        "upperBound" : 1
      },
      "name" : "value",
      "type" : "String"
    } ],
    "taggedValues" : [ {
      "tag" : {
        "profile" : "meta::pure::profiles::doc",
        "value" : "doc"
      },
      "value" : "A master agreement identifier allocated by a party. FpML does not define the domain values associated with this element. Note that the domain values for this element are not strictly an enumerated list."
    } ]
  }
}