{
  "classifierPath" : "meta::pure::metamodel::type::Class",
  "content" : {
    "_type" : "class",
    "constraints" : [ {
      "functionDefinition" : {
        "_type" : "lambda",
        "body" : [ {
          "_type" : "func",
          "function" : "or",
          "parameters" : [ {
            "_type" : "func",
            "function" : "and",
            "parameters" : [ {
              "_type" : "func",
              "function" : "isNotEmpty",
              "parameters" : [ {
                "_type" : "property",
                "parameters" : [ {
                  "_type" : "var",
                  "name" : "this",
                  "sourceInformation" : {
                    "endColumn" : 19,
                    "endLine" : 7227,
                    "sourceId" : "",
                    "startColumn" : 15,
                    "startLine" : 7227
                  }
                } ],
                "property" : "composite",
                "sourceInformation" : {
                  "endColumn" : 29,
                  "endLine" : 7227,
                  "sourceId" : "",
                  "startColumn" : 21,
                  "startLine" : 7227
                }
              } ],
              "sourceInformation" : {
                "endColumn" : 41,
                "endLine" : 7227,
                "sourceId" : "",
                "startColumn" : 32,
                "startLine" : 7227
              }
            }, {
              "_type" : "func",
              "function" : "and",
              "parameters" : [ {
                "_type" : "func",
                "function" : "isEmpty",
                "parameters" : [ {
                  "_type" : "property",
                  "parameters" : [ {
                    "_type" : "var",
                    "name" : "this",
                    "sourceInformation" : {
                      "endColumn" : 53,
                      "endLine" : 7227,
                      "sourceId" : "",
                      "startColumn" : 49,
                      "startLine" : 7227
                    }
                  } ],
                  "property" : "quanto",
                  "sourceInformation" : {
                    "endColumn" : 60,
                    "endLine" : 7227,
                    "sourceId" : "",
                    "startColumn" : 55,
                    "startLine" : 7227
                  }
                } ],
                "sourceInformation" : {
                  "endColumn" : 69,
                  "endLine" : 7227,
                  "sourceId" : "",
                  "startColumn" : 63,
                  "startLine" : 7227
                }
              }, {
                "_type" : "func",
                "function" : "isEmpty",
                "parameters" : [ {
                  "_type" : "property",
                  "parameters" : [ {
                    "_type" : "var",
                    "name" : "this",
                    "sourceInformation" : {
                      "endColumn" : 80,
                      "endLine" : 7227,
                      "sourceId" : "",
                      "startColumn" : 76,
                      "startLine" : 7227
                    }
                  } ],
                  "property" : "crossCurrency",
                  "sourceInformation" : {
                    "endColumn" : 94,
                    "endLine" : 7227,
                    "sourceId" : "",
                    "startColumn" : 82,
                    "startLine" : 7227
                  }
                } ],
                "sourceInformation" : {
                  "endColumn" : 103,
                  "endLine" : 7227,
                  "sourceId" : "",
                  "startColumn" : 97,
                  "startLine" : 7227
                }
              } ],
              "sourceInformation" : {
                "endColumn" : 74,
                "endLine" : 7227,
                "sourceId" : "",
                "startColumn" : 73,
                "startLine" : 7227
              }
            } ],
            "sourceInformation" : {
              "endColumn" : 46,
              "endLine" : 7227,
              "sourceId" : "",
              "startColumn" : 45,
              "startLine" : 7227
            }
          }, {
            "_type" : "func",
            "function" : "or",
            "parameters" : [ {
              "_type" : "func",
              "function" : "and",
              "parameters" : [ {
                "_type" : "func",
                "function" : "isEmpty",
                "parameters" : [ {
                  "_type" : "property",
                  "parameters" : [ {
                    "_type" : "var",
                    "name" : "this",
                    "sourceInformation" : {
                      "endColumn" : 118,
                      "endLine" : 7227,
                      "sourceId" : "",
                      "startColumn" : 114,
                      "startLine" : 7227
                    }
                  } ],
                  "property" : "composite",
                  "sourceInformation" : {
                    "endColumn" : 128,
                    "endLine" : 7227,
                    "sourceId" : "",
                    "startColumn" : 120,
                    "startLine" : 7227
                  }
                } ],
                "sourceInformation" : {
                  "endColumn" : 137,
                  "endLine" : 7227,
                  "sourceId" : "",
                  "startColumn" : 131,
                  "startLine" : 7227
                }
              }, {
                "_type" : "func",
                "function" : "and",
                "parameters" : [ {
                  "_type" : "func",
                  "function" : "isNotEmpty",
                  "parameters" : [ {
                    "_type" : "property",
                    "parameters" : [ {
                      "_type" : "var",
                      "name" : "this",
                      "sourceInformation" : {
                        "endColumn" : 149,
                        "endLine" : 7227,
                        "sourceId" : "",
                        "startColumn" : 145,
                        "startLine" : 7227
                      }
                    } ],
                    "property" : "quanto",
                    "sourceInformation" : {
                      "endColumn" : 156,
                      "endLine" : 7227,
                      "sourceId" : "",
                      "startColumn" : 151,
                      "startLine" : 7227
                    }
                  } ],
                  "sourceInformation" : {
                    "endColumn" : 168,
                    "endLine" : 7227,
                    "sourceId" : "",
                    "startColumn" : 159,
                    "startLine" : 7227
                  }
                }, {
                  "_type" : "func",
                  "function" : "isEmpty",
                  "parameters" : [ {
                    "_type" : "property",
                    "parameters" : [ {
                      "_type" : "var",
                      "name" : "this",
                      "sourceInformation" : {
                        "endColumn" : 179,
                        "endLine" : 7227,
                        "sourceId" : "",
                        "startColumn" : 175,
                        "startLine" : 7227
                      }
                    } ],
                    "property" : "crossCurrency",
                    "sourceInformation" : {
                      "endColumn" : 193,
                      "endLine" : 7227,
                      "sourceId" : "",
                      "startColumn" : 181,
                      "startLine" : 7227
                    }
                  } ],
                  "sourceInformation" : {
                    "endColumn" : 202,
                    "endLine" : 7227,
                    "sourceId" : "",
                    "startColumn" : 196,
                    "startLine" : 7227
                  }
                } ],
                "sourceInformation" : {
                  "endColumn" : 173,
                  "endLine" : 7227,
                  "sourceId" : "",
                  "startColumn" : 172,
                  "startLine" : 7227
                }
              } ],
              "sourceInformation" : {
                "endColumn" : 142,
                "endLine" : 7227,
                "sourceId" : "",
                "startColumn" : 141,
                "startLine" : 7227
              }
            }, {
              "_type" : "func",
              "function" : "and",
              "parameters" : [ {
                "_type" : "func",
                "function" : "isEmpty",
                "parameters" : [ {
                  "_type" : "property",
                  "parameters" : [ {
                    "_type" : "var",
                    "name" : "this",
                    "sourceInformation" : {
                      "endColumn" : 216,
                      "endLine" : 7227,
                      "sourceId" : "",
                      "startColumn" : 212,
                      "startLine" : 7227
                    }
                  } ],
                  "property" : "composite",
                  "sourceInformation" : {
                    "endColumn" : 226,
                    "endLine" : 7227,
                    "sourceId" : "",
                    "startColumn" : 218,
                    "startLine" : 7227
                  }
                } ],
                "sourceInformation" : {
                  "endColumn" : 235,
                  "endLine" : 7227,
                  "sourceId" : "",
                  "startColumn" : 229,
                  "startLine" : 7227
                }
              }, {
                "_type" : "func",
                "function" : "and",
                "parameters" : [ {
                  "_type" : "func",
                  "function" : "isEmpty",
                  "parameters" : [ {
                    "_type" : "property",
                    "parameters" : [ {
                      "_type" : "var",
                      "name" : "this",
                      "sourceInformation" : {
                        "endColumn" : 247,
                        "endLine" : 7227,
                        "sourceId" : "",
                        "startColumn" : 243,
                        "startLine" : 7227
                      }
                    } ],
                    "property" : "quanto",
                    "sourceInformation" : {
                      "endColumn" : 254,
                      "endLine" : 7227,
                      "sourceId" : "",
                      "startColumn" : 249,
                      "startLine" : 7227
                    }
                  } ],
                  "sourceInformation" : {
                    "endColumn" : 263,
                    "endLine" : 7227,
                    "sourceId" : "",
                    "startColumn" : 257,
                    "startLine" : 7227
                  }
                }, {
                  "_type" : "func",
                  "function" : "isNotEmpty",
                  "parameters" : [ {
                    "_type" : "property",
                    "parameters" : [ {
                      "_type" : "var",
                      "name" : "this",
                      "sourceInformation" : {
                        "endColumn" : 274,
                        "endLine" : 7227,
                        "sourceId" : "",
                        "startColumn" : 270,
                        "startLine" : 7227
                      }
                    } ],
                    "property" : "crossCurrency",
                    "sourceInformation" : {
                      "endColumn" : 288,
                      "endLine" : 7227,
                      "sourceId" : "",
                      "startColumn" : 276,
                      "startLine" : 7227
                    }
                  } ],
                  "sourceInformation" : {
                    "endColumn" : 300,
                    "endLine" : 7227,
                    "sourceId" : "",
                    "startColumn" : 291,
                    "startLine" : 7227
                  }
                } ],
                "sourceInformation" : {
                  "endColumn" : 268,
                  "endLine" : 7227,
                  "sourceId" : "",
                  "startColumn" : 267,
                  "startLine" : 7227
                }
              } ],
              "sourceInformation" : {
                "endColumn" : 240,
                "endLine" : 7227,
                "sourceId" : "",
                "startColumn" : 239,
                "startLine" : 7227
              }
            } ],
            "sourceInformation" : {
              "endColumn" : 209,
              "endLine" : 7227,
              "sourceId" : "",
              "startColumn" : 208,
              "startLine" : 7227
            }
          } ],
          "sourceInformation" : {
            "endColumn" : 110,
            "endLine" : 7227,
            "sourceId" : "",
            "startColumn" : 109,
            "startLine" : 7227
          }
        } ],
        "parameters" : [ ]
      },
      "name" : "c1_choice"
    } ],
    "name" : "FxFeature",
    "package" : "FpML::model",
    "properties" : [ {
      "multiplicity" : {
        "lowerBound" : 0,
        "upperBound" : 1
      },
      "name" : "referenceCurrency",
      "taggedValues" : [ {
        "tag" : {
          "profile" : "meta::pure::profiles::doc",
          "value" : "doc"
        },
        "value" : "Specifies the reference currency of the trade."
      } ],
      "type" : "FpML::model::IdentifiedCurrency"
    }, {
      "multiplicity" : {
        "lowerBound" : 0,
        "upperBound" : 1
      },
      "name" : "composite",
      "taggedValues" : [ {
        "tag" : {
          "profile" : "meta::pure::profiles::doc",
          "value" : "doc"
        },
        "value" : "If “Composite” is specified as the Settlement Type in the relevant Transaction Supplement, an amount in the Settlement Currency, determined by the Calculation Agent as being equal to the number of Options exercised or deemed exercised, multiplied by: (Settlement Price – Strike Price) / (Strike Price – Settlement Price) x Multiplier provided that if the above is equal to a negative amount the Option Cash Settlement Amount shall be deemed to be zero."
      } ],
      "type" : "FpML::model::Composite"
    }, {
      "multiplicity" : {
        "lowerBound" : 0,
        "upperBound" : 1
      },
      "name" : "quanto",
      "taggedValues" : [ {
        "tag" : {
          "profile" : "meta::pure::profiles::doc",
          "value" : "doc"
        },
        "value" : "If “Quanto” is specified as the Settlement Type in the relevant Transaction Supplement, an amount, as determined by the Calculation Agent in accordance with the Section 8.2 of the Equity Definitions."
      } ],
      "type" : "FpML::model::Quanto"
    }, {
      "multiplicity" : {
        "lowerBound" : 0,
        "upperBound" : 1
      },
      "name" : "crossCurrency",
      "taggedValues" : [ {
        "tag" : {
          "profile" : "meta::pure::profiles::doc",
          "value" : "doc"
        },
        "value" : "If “Cross-Currency” is specified as the Settlement Type in the relevant Transaction Supplement, an amount in the Settlement Currency, determined by the Calculation Agent as being equal to the number of Options exercised or deemed exercised, multiplied by: (Settlement Price – Strike Price) / (Strike Price – Settlement Price) x Multiplier x one unit of the Reference Currency converted into an amount in the Settlement Currency using the rate of exchange of the Settlement Currency as quoted on the Reference Price Source on the Valuation Date, provided that if the above is equal to a negative amount the Option Cash Settlement Amount shall be deemed to be zero."
      } ],
      "type" : "FpML::model::Composite"
    } ],
    "taggedValues" : [ {
      "tag" : {
        "profile" : "meta::pure::profiles::doc",
        "value" : "doc"
      },
      "value" : "A type for defining Fx Features."
    } ]
  }
}