{
  "classifierPath" : "meta::pure::metamodel::type::Enumeration",
  "content" : {
    "_type" : "Enumeration",
    "name" : "StepRelativeToEnum",
    "package" : "FpML::model",
    "taggedValues" : [ {
      "tag" : {
        "profile" : "meta::pure::profiles::doc",
        "value" : "doc"
      },
      "value" : "The specification of whether a percentage rate change, used to calculate a change in notional outstanding, is expressed as a percentage of the initial notional amount or the previously outstanding notional amount. The specification of whether a percentage rate change, used to calculate a change in notional outstanding, is expressed as a percentage of the initial notional amount or the previously outstanding notional amount. - For use with pre-trade Credit Limit Check messages."
    } ],
    "values" : [ {
      "value" : "Initial"
    }, {
      "value" : "Previous"
    } ]
  }
}