{
  "classifierPath" : "meta::pure::metamodel::type::Class",
  "content" : {
    "_type" : "class",
    "name" : "OptionStrike",
    "package" : "FpML::model",
    "properties" : [ {
      "multiplicity" : {
        "lowerBound" : 0,
        "upperBound" : 1
      },
      "name" : "currency",
      "taggedValues" : [ {
        "tag" : {
          "profile" : "meta::pure::profiles::doc",
          "value" : "doc"
        },
        "value" : "The currency in which an amount is denominated."
      } ],
      "type" : "FpML::model::Currency"
    } ],
    "superTypes" : [ "FpML::model::OptionNumericStrike" ],
    "taggedValues" : [ {
      "tag" : {
        "profile" : "meta::pure::profiles::doc",
        "value" : "doc"
      },
      "value" : "A type for defining the strike price for an equity option. The strike price is either: (i) in respect of an index option transaction, the level of the relevant index specified or otherwise determined in the transaction; or (ii) in respect of a share option transaction, the price per share specified or otherwise determined in the transaction. This can be expressed either as a percentage of notional amount or as an absolute value."
    } ]
  }
}