{
  "classifierPath" : "meta::pure::metamodel::type::Class",
  "content" : {
    "_type" : "class",
    "name" : "BusinessDateRange",
    "package" : "FpML::model",
    "properties" : [ {
      "multiplicity" : {
        "lowerBound" : 0,
        "upperBound" : 1
      },
      "name" : "businessDayConvention",
      "taggedValues" : [ {
        "tag" : {
          "profile" : "meta::pure::profiles::doc",
          "value" : "doc"
        },
        "value" : "The convention for adjusting a date if it would otherwise fall on a day that is not a business day."
      } ],
      "type" : "FpML::model::BusinessDayConventionEnum"
    }, {
      "multiplicity" : {
        "lowerBound" : 0,
        "upperBound" : 1
      },
      "name" : "businessCentersReference",
      "taggedValues" : [ {
        "tag" : {
          "profile" : "meta::pure::profiles::doc",
          "value" : "doc"
        },
        "value" : "A pointer style reference to a set of financial business centers defined elsewhere in the document. This set of business centers is used to determine whether a particular day is a business day or not."
      } ],
      "type" : "FpML::model::BusinessCentersReference"
    }, {
      "multiplicity" : {
        "lowerBound" : 0,
        "upperBound" : 1
      },
      "name" : "businessCenters",
      "type" : "FpML::model::BusinessCenters"
    } ],
    "superTypes" : [ "FpML::model::DateRange" ],
    "taggedValues" : [ {
      "tag" : {
        "profile" : "meta::pure::profiles::doc",
        "value" : "doc"
      },
      "value" : "A type defining a range of contiguous business days by defining an unadjusted first date, an unadjusted last date and a business day convention and business centers for adjusting the first and last dates if they would otherwise fall on a non business day in the specified business centers. The days between the first and last date must also be good business days in the specified centers to be counted in the range."
    } ]
  }
}