{
  "classifierPath" : "meta::pure::metamodel::type::Enumeration",
  "content" : {
    "_type" : "Enumeration",
    "name" : "AmountAdjustmentEnum",
    "package" : "FpML::model",
    "taggedValues" : [ {
      "tag" : {
        "profile" : "meta::pure::profiles::doc",
        "value" : "doc"
      },
      "value" : "The type of adjustment applied to any amount."
    } ],
    "values" : [ {
      "value" : "Decrease"
    }, {
      "value" : "Increase"
    } ]
  }
}