{
  "classifierPath" : "meta::pure::metamodel::type::Enumeration",
  "content" : {
    "_type" : "Enumeration",
    "name" : "LoanTradingAssocEnum",
    "package" : "FpML::model",
    "taggedValues" : [ {
      "tag" : {
        "profile" : "meta::pure::profiles::doc",
        "value" : "doc"
      },
      "value" : "A list that defines the loan trading association responsible for defining the standardized legal framework that governs the trade."
    } ],
    "values" : [ {
      "value" : "LMA"
    }, {
      "value" : "LSTA"
    } ]
  }
}