{
  "classifierPath" : "meta::pure::metamodel::type::Enumeration",
  "content" : {
    "_type" : "Enumeration",
    "name" : "PositionTypeEnum",
    "package" : "FpML::model",
    "taggedValues" : [ {
      "tag" : {
        "profile" : "meta::pure::profiles::doc",
        "value" : "doc"
      },
      "value" : "Specifies whether a position is long (the transactor owns the securities) or short (the transactor has borrowed the securities)."
    } ],
    "values" : [ {
      "value" : "Long"
    }, {
      "value" : "Short"
    } ]
  }
}