{
  "classifierPath" : "meta::pure::metamodel::type::Enumeration",
  "content" : {
    "_type" : "Enumeration",
    "name" : "GasProductTypeEnum",
    "package" : "FpML::model",
    "taggedValues" : [ {
      "tag" : {
        "profile" : "meta::pure::profiles::doc",
        "value" : "doc"
      },
      "value" : "The type of gas product."
    } ],
    "values" : [ {
      "value" : "Butane"
    }, {
      "value" : "CarbonDioxide"
    }, {
      "value" : "EPMix"
    }, {
      "value" : "Ethane"
    }, {
      "value" : "Gasoline"
    }, {
      "value" : "Helium"
    }, {
      "value" : "HydrogenSulfide"
    }, {
      "value" : "Isobutane"
    }, {
      "value" : "Methane"
    }, {
      "value" : "Naphtha"
    }, {
      "value" : "NaturalGas"
    }, {
      "value" : "Nitrogen"
    }, {
      "value" : "Pentane"
    }, {
      "value" : "Propane"
    }, {
      "value" : "Propylene"
    }, {
      "value" : "Water"
    } ]
  }
}