{
  "classifierPath" : "meta::pure::metamodel::type::Class",
  "content" : {
    "_type" : "class",
    "constraints" : [ {
      "functionDefinition" : {
        "_type" : "lambda",
        "body" : [ {
          "_type" : "func",
          "function" : "or",
          "parameters" : [ {
            "_type" : "func",
            "function" : "and",
            "parameters" : [ {
              "_type" : "func",
              "function" : "isEmpty",
              "parameters" : [ {
                "_type" : "property",
                "parameters" : [ {
                  "_type" : "var",
                  "name" : "this",
                  "sourceInformation" : {
                    "endColumn" : 19,
                    "endLine" : 8194,
                    "sourceId" : "",
                    "startColumn" : 15,
                    "startLine" : 8194
                  }
                } ],
                "property" : "groupType",
                "sourceInformation" : {
                  "endColumn" : 29,
                  "endLine" : 8194,
                  "sourceId" : "",
                  "startColumn" : 21,
                  "startLine" : 8194
                }
              } ],
              "sourceInformation" : {
                "endColumn" : 38,
                "endLine" : 8194,
                "sourceId" : "",
                "startColumn" : 32,
                "startLine" : 8194
              }
            }, {
              "_type" : "func",
              "function" : "isEmpty",
              "parameters" : [ {
                "_type" : "property",
                "parameters" : [ {
                  "_type" : "var",
                  "name" : "this",
                  "sourceInformation" : {
                    "endColumn" : 49,
                    "endLine" : 8194,
                    "sourceId" : "",
                    "startColumn" : 45,
                    "startLine" : 8194
                  }
                } ],
                "property" : "partyReference",
                "sourceInformation" : {
                  "endColumn" : 64,
                  "endLine" : 8194,
                  "sourceId" : "",
                  "startColumn" : 51,
                  "startLine" : 8194
                }
              } ],
              "sourceInformation" : {
                "endColumn" : 73,
                "endLine" : 8194,
                "sourceId" : "",
                "startColumn" : 67,
                "startLine" : 8194
              }
            } ],
            "sourceInformation" : {
              "endColumn" : 43,
              "endLine" : 8194,
              "sourceId" : "",
              "startColumn" : 42,
              "startLine" : 8194
            }
          }, {
            "_type" : "func",
            "function" : "and",
            "parameters" : [ {
              "_type" : "func",
              "function" : "isEmpty",
              "parameters" : [ {
                "_type" : "property",
                "parameters" : [ {
                  "_type" : "var",
                  "name" : "this",
                  "sourceInformation" : {
                    "endColumn" : 86,
                    "endLine" : 8194,
                    "sourceId" : "",
                    "startColumn" : 82,
                    "startLine" : 8194
                  }
                } ],
                "property" : "partyId",
                "sourceInformation" : {
                  "endColumn" : 94,
                  "endLine" : 8194,
                  "sourceId" : "",
                  "startColumn" : 88,
                  "startLine" : 8194
                }
              } ],
              "sourceInformation" : {
                "endColumn" : 103,
                "endLine" : 8194,
                "sourceId" : "",
                "startColumn" : 97,
                "startLine" : 8194
              }
            }, {
              "_type" : "func",
              "function" : "and",
              "parameters" : [ {
                "_type" : "func",
                "function" : "isEmpty",
                "parameters" : [ {
                  "_type" : "property",
                  "parameters" : [ {
                    "_type" : "var",
                    "name" : "this",
                    "sourceInformation" : {
                      "endColumn" : 115,
                      "endLine" : 8194,
                      "sourceId" : "",
                      "startColumn" : 111,
                      "startLine" : 8194
                    }
                  } ],
                  "property" : "partyName",
                  "sourceInformation" : {
                    "endColumn" : 125,
                    "endLine" : 8194,
                    "sourceId" : "",
                    "startColumn" : 117,
                    "startLine" : 8194
                  }
                } ],
                "sourceInformation" : {
                  "endColumn" : 134,
                  "endLine" : 8194,
                  "sourceId" : "",
                  "startColumn" : 128,
                  "startLine" : 8194
                }
              }, {
                "_type" : "func",
                "function" : "and",
                "parameters" : [ {
                  "_type" : "func",
                  "function" : "isEmpty",
                  "parameters" : [ {
                    "_type" : "property",
                    "parameters" : [ {
                      "_type" : "var",
                      "name" : "this",
                      "sourceInformation" : {
                        "endColumn" : 146,
                        "endLine" : 8194,
                        "sourceId" : "",
                        "startColumn" : 142,
                        "startLine" : 8194
                      }
                    } ],
                    "property" : "classification",
                    "sourceInformation" : {
                      "endColumn" : 161,
                      "endLine" : 8194,
                      "sourceId" : "",
                      "startColumn" : 148,
                      "startLine" : 8194
                    }
                  } ],
                  "sourceInformation" : {
                    "endColumn" : 170,
                    "endLine" : 8194,
                    "sourceId" : "",
                    "startColumn" : 164,
                    "startLine" : 8194
                  }
                }, {
                  "_type" : "func",
                  "function" : "and",
                  "parameters" : [ {
                    "_type" : "func",
                    "function" : "isEmpty",
                    "parameters" : [ {
                      "_type" : "property",
                      "parameters" : [ {
                        "_type" : "var",
                        "name" : "this",
                        "sourceInformation" : {
                          "endColumn" : 182,
                          "endLine" : 8194,
                          "sourceId" : "",
                          "startColumn" : 178,
                          "startLine" : 8194
                        }
                      } ],
                      "property" : "creditRating",
                      "sourceInformation" : {
                        "endColumn" : 195,
                        "endLine" : 8194,
                        "sourceId" : "",
                        "startColumn" : 184,
                        "startLine" : 8194
                      }
                    } ],
                    "sourceInformation" : {
                      "endColumn" : 204,
                      "endLine" : 8194,
                      "sourceId" : "",
                      "startColumn" : 198,
                      "startLine" : 8194
                    }
                  }, {
                    "_type" : "func",
                    "function" : "and",
                    "parameters" : [ {
                      "_type" : "func",
                      "function" : "isEmpty",
                      "parameters" : [ {
                        "_type" : "property",
                        "parameters" : [ {
                          "_type" : "var",
                          "name" : "this",
                          "sourceInformation" : {
                            "endColumn" : 216,
                            "endLine" : 8194,
                            "sourceId" : "",
                            "startColumn" : 212,
                            "startLine" : 8194
                          }
                        } ],
                        "property" : "country",
                        "sourceInformation" : {
                          "endColumn" : 224,
                          "endLine" : 8194,
                          "sourceId" : "",
                          "startColumn" : 218,
                          "startLine" : 8194
                        }
                      } ],
                      "sourceInformation" : {
                        "endColumn" : 233,
                        "endLine" : 8194,
                        "sourceId" : "",
                        "startColumn" : 227,
                        "startLine" : 8194
                      }
                    }, {
                      "_type" : "func",
                      "function" : "and",
                      "parameters" : [ {
                        "_type" : "func",
                        "function" : "isEmpty",
                        "parameters" : [ {
                          "_type" : "property",
                          "parameters" : [ {
                            "_type" : "var",
                            "name" : "this",
                            "sourceInformation" : {
                              "endColumn" : 245,
                              "endLine" : 8194,
                              "sourceId" : "",
                              "startColumn" : 241,
                              "startLine" : 8194
                            }
                          } ],
                          "property" : "region",
                          "sourceInformation" : {
                            "endColumn" : 252,
                            "endLine" : 8194,
                            "sourceId" : "",
                            "startColumn" : 247,
                            "startLine" : 8194
                          }
                        } ],
                        "sourceInformation" : {
                          "endColumn" : 261,
                          "endLine" : 8194,
                          "sourceId" : "",
                          "startColumn" : 255,
                          "startLine" : 8194
                        }
                      }, {
                        "_type" : "func",
                        "function" : "and",
                        "parameters" : [ {
                          "_type" : "func",
                          "function" : "isEmpty",
                          "parameters" : [ {
                            "_type" : "property",
                            "parameters" : [ {
                              "_type" : "var",
                              "name" : "this",
                              "sourceInformation" : {
                                "endColumn" : 273,
                                "endLine" : 8194,
                                "sourceId" : "",
                                "startColumn" : 269,
                                "startLine" : 8194
                              }
                            } ],
                            "property" : "jurisdiction",
                            "sourceInformation" : {
                              "endColumn" : 286,
                              "endLine" : 8194,
                              "sourceId" : "",
                              "startColumn" : 275,
                              "startLine" : 8194
                            }
                          } ],
                          "sourceInformation" : {
                            "endColumn" : 295,
                            "endLine" : 8194,
                            "sourceId" : "",
                            "startColumn" : 289,
                            "startLine" : 8194
                          }
                        }, {
                          "_type" : "func",
                          "function" : "and",
                          "parameters" : [ {
                            "_type" : "func",
                            "function" : "isEmpty",
                            "parameters" : [ {
                              "_type" : "property",
                              "parameters" : [ {
                                "_type" : "var",
                                "name" : "this",
                                "sourceInformation" : {
                                  "endColumn" : 307,
                                  "endLine" : 8194,
                                  "sourceId" : "",
                                  "startColumn" : 303,
                                  "startLine" : 8194
                                }
                              } ],
                              "property" : "organizationType",
                              "sourceInformation" : {
                                "endColumn" : 324,
                                "endLine" : 8194,
                                "sourceId" : "",
                                "startColumn" : 309,
                                "startLine" : 8194
                              }
                            } ],
                            "sourceInformation" : {
                              "endColumn" : 333,
                              "endLine" : 8194,
                              "sourceId" : "",
                              "startColumn" : 327,
                              "startLine" : 8194
                            }
                          }, {
                            "_type" : "func",
                            "function" : "and",
                            "parameters" : [ {
                              "_type" : "func",
                              "function" : "isEmpty",
                              "parameters" : [ {
                                "_type" : "property",
                                "parameters" : [ {
                                  "_type" : "var",
                                  "name" : "this",
                                  "sourceInformation" : {
                                    "endColumn" : 345,
                                    "endLine" : 8194,
                                    "sourceId" : "",
                                    "startColumn" : 341,
                                    "startLine" : 8194
                                  }
                                } ],
                                "property" : "relatedParty",
                                "sourceInformation" : {
                                  "endColumn" : 358,
                                  "endLine" : 8194,
                                  "sourceId" : "",
                                  "startColumn" : 347,
                                  "startLine" : 8194
                                }
                              } ],
                              "sourceInformation" : {
                                "endColumn" : 367,
                                "endLine" : 8194,
                                "sourceId" : "",
                                "startColumn" : 361,
                                "startLine" : 8194
                              }
                            }, {
                              "_type" : "func",
                              "function" : "and",
                              "parameters" : [ {
                                "_type" : "func",
                                "function" : "isEmpty",
                                "parameters" : [ {
                                  "_type" : "property",
                                  "parameters" : [ {
                                    "_type" : "var",
                                    "name" : "this",
                                    "sourceInformation" : {
                                      "endColumn" : 379,
                                      "endLine" : 8194,
                                      "sourceId" : "",
                                      "startColumn" : 375,
                                      "startLine" : 8194
                                    }
                                  } ],
                                  "property" : "role",
                                  "sourceInformation" : {
                                    "endColumn" : 384,
                                    "endLine" : 8194,
                                    "sourceId" : "",
                                    "startColumn" : 381,
                                    "startLine" : 8194
                                  }
                                } ],
                                "sourceInformation" : {
                                  "endColumn" : 393,
                                  "endLine" : 8194,
                                  "sourceId" : "",
                                  "startColumn" : 387,
                                  "startLine" : 8194
                                }
                              }, {
                                "_type" : "func",
                                "function" : "and",
                                "parameters" : [ {
                                  "_type" : "func",
                                  "function" : "isEmpty",
                                  "parameters" : [ {
                                    "_type" : "property",
                                    "parameters" : [ {
                                      "_type" : "var",
                                      "name" : "this",
                                      "sourceInformation" : {
                                        "endColumn" : 405,
                                        "endLine" : 8194,
                                        "sourceId" : "",
                                        "startColumn" : 401,
                                        "startLine" : 8194
                                      }
                                    } ],
                                    "property" : "contactInfo",
                                    "sourceInformation" : {
                                      "endColumn" : 417,
                                      "endLine" : 8194,
                                      "sourceId" : "",
                                      "startColumn" : 407,
                                      "startLine" : 8194
                                    }
                                  } ],
                                  "sourceInformation" : {
                                    "endColumn" : 426,
                                    "endLine" : 8194,
                                    "sourceId" : "",
                                    "startColumn" : 420,
                                    "startLine" : 8194
                                  }
                                }, {
                                  "_type" : "func",
                                  "function" : "and",
                                  "parameters" : [ {
                                    "_type" : "func",
                                    "function" : "isEmpty",
                                    "parameters" : [ {
                                      "_type" : "property",
                                      "parameters" : [ {
                                        "_type" : "var",
                                        "name" : "this",
                                        "sourceInformation" : {
                                          "endColumn" : 438,
                                          "endLine" : 8194,
                                          "sourceId" : "",
                                          "startColumn" : 434,
                                          "startLine" : 8194
                                        }
                                      } ],
                                      "property" : "businessUnit",
                                      "sourceInformation" : {
                                        "endColumn" : 451,
                                        "endLine" : 8194,
                                        "sourceId" : "",
                                        "startColumn" : 440,
                                        "startLine" : 8194
                                      }
                                    } ],
                                    "sourceInformation" : {
                                      "endColumn" : 460,
                                      "endLine" : 8194,
                                      "sourceId" : "",
                                      "startColumn" : 454,
                                      "startLine" : 8194
                                    }
                                  }, {
                                    "_type" : "func",
                                    "function" : "isEmpty",
                                    "parameters" : [ {
                                      "_type" : "property",
                                      "parameters" : [ {
                                        "_type" : "var",
                                        "name" : "this",
                                        "sourceInformation" : {
                                          "endColumn" : 471,
                                          "endLine" : 8194,
                                          "sourceId" : "",
                                          "startColumn" : 467,
                                          "startLine" : 8194
                                        }
                                      } ],
                                      "property" : "person",
                                      "sourceInformation" : {
                                        "endColumn" : 478,
                                        "endLine" : 8194,
                                        "sourceId" : "",
                                        "startColumn" : 473,
                                        "startLine" : 8194
                                      }
                                    } ],
                                    "sourceInformation" : {
                                      "endColumn" : 487,
                                      "endLine" : 8194,
                                      "sourceId" : "",
                                      "startColumn" : 481,
                                      "startLine" : 8194
                                    }
                                  } ],
                                  "sourceInformation" : {
                                    "endColumn" : 465,
                                    "endLine" : 8194,
                                    "sourceId" : "",
                                    "startColumn" : 464,
                                    "startLine" : 8194
                                  }
                                } ],
                                "sourceInformation" : {
                                  "endColumn" : 431,
                                  "endLine" : 8194,
                                  "sourceId" : "",
                                  "startColumn" : 430,
                                  "startLine" : 8194
                                }
                              } ],
                              "sourceInformation" : {
                                "endColumn" : 398,
                                "endLine" : 8194,
                                "sourceId" : "",
                                "startColumn" : 397,
                                "startLine" : 8194
                              }
                            } ],
                            "sourceInformation" : {
                              "endColumn" : 372,
                              "endLine" : 8194,
                              "sourceId" : "",
                              "startColumn" : 371,
                              "startLine" : 8194
                            }
                          } ],
                          "sourceInformation" : {
                            "endColumn" : 338,
                            "endLine" : 8194,
                            "sourceId" : "",
                            "startColumn" : 337,
                            "startLine" : 8194
                          }
                        } ],
                        "sourceInformation" : {
                          "endColumn" : 300,
                          "endLine" : 8194,
                          "sourceId" : "",
                          "startColumn" : 299,
                          "startLine" : 8194
                        }
                      } ],
                      "sourceInformation" : {
                        "endColumn" : 266,
                        "endLine" : 8194,
                        "sourceId" : "",
                        "startColumn" : 265,
                        "startLine" : 8194
                      }
                    } ],
                    "sourceInformation" : {
                      "endColumn" : 238,
                      "endLine" : 8194,
                      "sourceId" : "",
                      "startColumn" : 237,
                      "startLine" : 8194
                    }
                  } ],
                  "sourceInformation" : {
                    "endColumn" : 209,
                    "endLine" : 8194,
                    "sourceId" : "",
                    "startColumn" : 208,
                    "startLine" : 8194
                  }
                } ],
                "sourceInformation" : {
                  "endColumn" : 175,
                  "endLine" : 8194,
                  "sourceId" : "",
                  "startColumn" : 174,
                  "startLine" : 8194
                }
              } ],
              "sourceInformation" : {
                "endColumn" : 139,
                "endLine" : 8194,
                "sourceId" : "",
                "startColumn" : 138,
                "startLine" : 8194
              }
            } ],
            "sourceInformation" : {
              "endColumn" : 108,
              "endLine" : 8194,
              "sourceId" : "",
              "startColumn" : 107,
              "startLine" : 8194
            }
          } ],
          "sourceInformation" : {
            "endColumn" : 79,
            "endLine" : 8194,
            "sourceId" : "",
            "startColumn" : 78,
            "startLine" : 8194
          }
        } ],
        "parameters" : [ ]
      },
      "name" : "c1_choice"
    } ],
    "name" : "Party",
    "package" : "FpML::model",
    "properties" : [ {
      "multiplicity" : {
        "lowerBound" : 0
      },
      "name" : "partyId",
      "taggedValues" : [ {
        "tag" : {
          "profile" : "meta::pure::profiles::doc",
          "value" : "doc"
        },
        "value" : "A party identifier, e.g. a S.W.I.F.T. bank identifier code (BIC)."
      } ],
      "type" : "FpML::model::PartyId"
    }, {
      "multiplicity" : {
        "lowerBound" : 0,
        "upperBound" : 1
      },
      "name" : "partyName",
      "taggedValues" : [ {
        "tag" : {
          "profile" : "meta::pure::profiles::doc",
          "value" : "doc"
        },
        "value" : "The legal name of the organization. A free format string. FpML does not define usage rules for this element."
      } ],
      "type" : "FpML::model::PartyName"
    }, {
      "multiplicity" : {
        "lowerBound" : 0
      },
      "name" : "classification",
      "taggedValues" : [ {
        "tag" : {
          "profile" : "meta::pure::profiles::doc",
          "value" : "doc"
        },
        "value" : "The party's industry sector classification."
      } ],
      "type" : "FpML::model::IndustryClassification"
    }, {
      "multiplicity" : {
        "lowerBound" : 0
      },
      "name" : "creditRating",
      "taggedValues" : [ {
        "tag" : {
          "profile" : "meta::pure::profiles::doc",
          "value" : "doc"
        },
        "value" : "The party's credit rating."
      } ],
      "type" : "FpML::model::CreditRating"
    }, {
      "multiplicity" : {
        "lowerBound" : 0,
        "upperBound" : 1
      },
      "name" : "country",
      "taggedValues" : [ {
        "tag" : {
          "profile" : "meta::pure::profiles::doc",
          "value" : "doc"
        },
        "value" : "The country where the party is domiciled."
      } ],
      "type" : "FpML::model::CountryCode"
    }, {
      "multiplicity" : {
        "lowerBound" : 0
      },
      "name" : "region",
      "taggedValues" : [ {
        "tag" : {
          "profile" : "meta::pure::profiles::doc",
          "value" : "doc"
        },
        "value" : "A code for a grouping of countries to which this belongs."
      } ],
      "type" : "FpML::model::Region"
    }, {
      "multiplicity" : {
        "lowerBound" : 0
      },
      "name" : "jurisdiction",
      "taggedValues" : [ {
        "tag" : {
          "profile" : "meta::pure::profiles::doc",
          "value" : "doc"
        },
        "value" : "The legal jurisdiction of the entity's registration."
      } ],
      "type" : "FpML::model::GoverningLaw"
    }, {
      "multiplicity" : {
        "lowerBound" : 0
      },
      "name" : "organizationType",
      "taggedValues" : [ {
        "tag" : {
          "profile" : "meta::pure::profiles::doc",
          "value" : "doc"
        },
        "value" : "The type of an organization's participantion in the OTC derivatives market."
      } ],
      "type" : "FpML::model::OrganizationType"
    }, {
      "multiplicity" : {
        "lowerBound" : 0
      },
      "name" : "relatedParty",
      "taggedValues" : [ {
        "tag" : {
          "profile" : "meta::pure::profiles::doc",
          "value" : "doc"
        },
        "value" : "Identifies a party that is related to this party, such as a parent, guarantor, or counterparty."
      } ],
      "type" : "FpML::model::PartyRelationship"
    }, {
      "multiplicity" : {
        "lowerBound" : 0,
        "upperBound" : 1
      },
      "name" : "role",
      "taggedValues" : [ {
        "tag" : {
          "profile" : "meta::pure::profiles::doc",
          "value" : "doc"
        },
        "value" : "For pretrade processes, anonymous parties can be specified performing a specific role defined in this field such as MarketMaker or PriceTaker."
      } ],
      "type" : "FpML::model::PartyRole"
    }, {
      "multiplicity" : {
        "lowerBound" : 0,
        "upperBound" : 1
      },
      "name" : "contactInfo",
      "taggedValues" : [ {
        "tag" : {
          "profile" : "meta::pure::profiles::doc",
          "value" : "doc"
        },
        "value" : "Information on how to contact the party using various means."
      } ],
      "type" : "FpML::model::ContactInformation"
    }, {
      "multiplicity" : {
        "lowerBound" : 0
      },
      "name" : "businessUnit",
      "taggedValues" : [ {
        "tag" : {
          "profile" : "meta::pure::profiles::doc",
          "value" : "doc"
        },
        "value" : "Optional organization unit information used to describe the organization units (e.g. trading desks) involved in a transaction or business process ."
      } ],
      "type" : "FpML::model::BusinessUnit"
    }, {
      "multiplicity" : {
        "lowerBound" : 0
      },
      "name" : "person",
      "taggedValues" : [ {
        "tag" : {
          "profile" : "meta::pure::profiles::doc",
          "value" : "doc"
        },
        "value" : "Optional information about people involved in a transaction or busines process. (These are eomployees of the party)."
      } ],
      "type" : "FpML::model::Person"
    }, {
      "multiplicity" : {
        "lowerBound" : 0,
        "upperBound" : 1
      },
      "name" : "groupType",
      "taggedValues" : [ {
        "tag" : {
          "profile" : "meta::pure::profiles::doc",
          "value" : "doc"
        },
        "value" : "Party Group Type, e.g. JointAndSeveralLiability"
      } ],
      "type" : "FpML::model::PartyGroupType"
    }, {
      "multiplicity" : {
        "lowerBound" : 0
      },
      "name" : "partyReference",
      "taggedValues" : [ {
        "tag" : {
          "profile" : "meta::pure::profiles::doc",
          "value" : "doc"
        },
        "value" : "Reference to a party that is a member of the group of entities that are acting together as a single party in a transaction."
      } ],
      "type" : "FpML::model::PartyReference"
    }, {
      "multiplicity" : {
        "lowerBound" : 1,
        "upperBound" : 1
      },
      "name" : "id",
      "taggedValues" : [ {
        "tag" : {
          "profile" : "meta::pure::profiles::doc",
          "value" : "doc"
        },
        "value" : "The id uniquely identifying the Party within the document."
      } ],
      "type" : "String"
    } ],
    "taggedValues" : [ {
      "tag" : {
        "profile" : "meta::pure::profiles::doc",
        "value" : "doc"
      },
      "value" : "A type defining a legal entity or a subdivision of a legal entity. Parties can perform multiple roles in a trade lifecycle. For example, the principal parties obligated to make payments from time to time during the term of the trade, but may include other parties involved in, or incidental to, the trade, such as parties acting in the role of novation transferor/transferee, broker, calculation agent, etc. In FpML roles are defined in multiple places within a document."
    } ]
  }
}