{
  "classifierPath" : "meta::pure::metamodel::type::Class",
  "content" : {
    "_type" : "class",
    "constraints" : [ {
      "functionDefinition" : {
        "_type" : "lambda",
        "body" : [ {
          "_type" : "func",
          "function" : "forAll",
          "parameters" : [ {
            "_type" : "property",
            "parameters" : [ {
              "_type" : "var",
              "name" : "this",
              "sourceInformation" : {
                "endColumn" : 17,
                "endLine" : 6373,
                "sourceId" : "",
                "startColumn" : 13,
                "startLine" : 6373
              }
            } ],
            "property" : "multiplier",
            "sourceInformation" : {
              "endColumn" : 28,
              "endLine" : 6373,
              "sourceId" : "",
              "startColumn" : 19,
              "startLine" : 6373
            }
          }, {
            "_type" : "lambda",
            "body" : [ {
              "_type" : "func",
              "function" : "greaterThan",
              "parameters" : [ {
                "_type" : "var",
                "name" : "x",
                "sourceInformation" : {
                  "endColumn" : 53,
                  "endLine" : 6373,
                  "sourceId" : "",
                  "startColumn" : 52,
                  "startLine" : 6373
                }
              }, {
                "_type" : "integer",
                "multiplicity" : {
                  "lowerBound" : 1,
                  "upperBound" : 1
                },
                "sourceInformation" : {
                  "endColumn" : 57,
                  "endLine" : 6373,
                  "sourceId" : "",
                  "startColumn" : 57,
                  "startLine" : 6373
                },
                "values" : [ 0 ]
              } ],
              "sourceInformation" : {
                "endColumn" : 57,
                "endLine" : 6373,
                "sourceId" : "",
                "startColumn" : 55,
                "startLine" : 6373
              }
            } ],
            "parameters" : [ {
              "_type" : "var",
              "class" : "Decimal",
              "multiplicity" : {
                "lowerBound" : 1,
                "upperBound" : 1
              },
              "name" : "x",
              "sourceInformation" : {
                "endColumn" : 47,
                "endLine" : 6373,
                "sourceId" : "",
                "startColumn" : 41,
                "startLine" : 6373
              }
            } ],
            "sourceInformation" : {
              "endColumn" : 57,
              "endLine" : 6373,
              "sourceId" : "",
              "startColumn" : 51,
              "startLine" : 6373
            }
          } ],
          "sourceInformation" : {
            "endColumn" : 36,
            "endLine" : 6373,
            "sourceId" : "",
            "startColumn" : 31,
            "startLine" : 6373
          }
        } ],
        "parameters" : [ ]
      },
      "name" : "c1_range"
    } ],
    "name" : "Commodity",
    "package" : "FpML::model",
    "properties" : [ {
      "multiplicity" : {
        "lowerBound" : 0,
        "upperBound" : 1
      },
      "name" : "commodityBase",
      "taggedValues" : [ {
        "tag" : {
          "profile" : "meta::pure::profiles::doc",
          "value" : "doc"
        },
        "value" : "A coding scheme value to identify the base type of the commodity being traded. Where possible, this should follow the naming convention used in the 2005 ISDA Commodity Definitions. For example, 'Oil'."
      } ],
      "type" : "FpML::model::CommodityBase"
    }, {
      "multiplicity" : {
        "lowerBound" : 0,
        "upperBound" : 1
      },
      "name" : "commodityDetails",
      "taggedValues" : [ {
        "tag" : {
          "profile" : "meta::pure::profiles::doc",
          "value" : "doc"
        },
        "value" : "A coding scheme value to identify the commodity being traded more specifically. Where possible, this should follow the naming convention used in the 2005 ISDA Commodity Definitions. For example, 'Brent'."
      } ],
      "type" : "FpML::model::CommodityDetails"
    }, {
      "multiplicity" : {
        "lowerBound" : 0,
        "upperBound" : 1
      },
      "name" : "unit",
      "taggedValues" : [ {
        "tag" : {
          "profile" : "meta::pure::profiles::doc",
          "value" : "doc"
        },
        "value" : "A coding scheme value to identify the unit of measure (e.g. Therms) in which the undelryer is denominated. Where possible, this should follow the naming convention used in the 2005 ISDA Commodity Definitions."
      } ],
      "type" : "FpML::model::QuantityUnit"
    }, {
      "multiplicity" : {
        "lowerBound" : 0,
        "upperBound" : 1
      },
      "name" : "currency",
      "taggedValues" : [ {
        "tag" : {
          "profile" : "meta::pure::profiles::doc",
          "value" : "doc"
        },
        "value" : "The currency in which the Commodity Reference Price is published (e.g. GBP)."
      } ],
      "type" : "FpML::model::Currency"
    }, {
      "multiplicity" : {
        "lowerBound" : 0,
        "upperBound" : 1
      },
      "name" : "exchangeId",
      "taggedValues" : [ {
        "tag" : {
          "profile" : "meta::pure::profiles::doc",
          "value" : "doc"
        },
        "value" : "For those commodities being traded with reference to the price of a listed instrument, the exchange where that instrument is listed should be specified in the 'exchange' element."
      } ],
      "type" : "FpML::model::ExchangeId"
    }, {
      "multiplicity" : {
        "lowerBound" : 0,
        "upperBound" : 1
      },
      "name" : "publication",
      "taggedValues" : [ {
        "tag" : {
          "profile" : "meta::pure::profiles::doc",
          "value" : "doc"
        },
        "value" : "For those commodities being traded with reference to a price distributed by a publication, that publication should be specified in the 'publication' element."
      } ],
      "type" : "FpML::model::CommodityInformationSource"
    }, {
      "multiplicity" : {
        "lowerBound" : 0,
        "upperBound" : 1
      },
      "name" : "specifiedPrice",
      "taggedValues" : [ {
        "tag" : {
          "profile" : "meta::pure::profiles::doc",
          "value" : "doc"
        },
        "value" : "The 'specified Price' describes the nature of the underlying price that is observed. It must be be stated in the underlyer definition as it is not defined in the Commodity Reference Price. Example values of 'specifiedPrice' are 'Settlement' (for a futures contract) and 'WeightedAverage' (for some published prices and indices)."
      } ],
      "type" : "FpML::model::SpecifiedPriceEnum"
    }, {
      "multiplicity" : {
        "lowerBound" : 0,
        "upperBound" : 1
      },
      "name" : "deliveryDates",
      "taggedValues" : [ {
        "tag" : {
          "profile" : "meta::pure::profiles::doc",
          "value" : "doc"
        },
        "value" : "Deprecated: The 'deliveryDates' element is applicable for a Commodity Reference Price that references a listed future contract (e.g. The Delivery Date is a NearbyMonth)."
      } ],
      "type" : "FpML::model::DeliveryDatesEnum"
    }, {
      "multiplicity" : {
        "lowerBound" : 0,
        "upperBound" : 1
      },
      "name" : "deliveryNearby",
      "taggedValues" : [ {
        "tag" : {
          "profile" : "meta::pure::profiles::doc",
          "value" : "doc"
        },
        "value" : "A container for the parametric representation of nearby contracts."
      } ],
      "type" : "FpML::model::DeliveryNearby"
    }, {
      "multiplicity" : {
        "lowerBound" : 0,
        "upperBound" : 1
      },
      "name" : "deliveryDate",
      "taggedValues" : [ {
        "tag" : {
          "profile" : "meta::pure::profiles::doc",
          "value" : "doc"
        },
        "value" : "The Delivery Date is a fixed, single day."
      } ],
      "type" : "FpML::model::AdjustableDate"
    }, {
      "multiplicity" : {
        "lowerBound" : 0,
        "upperBound" : 1
      },
      "name" : "deliveryDateYearMonth",
      "taggedValues" : [ {
        "tag" : {
          "profile" : "meta::pure::profiles::doc",
          "value" : "doc"
        },
        "value" : "The Delivery Date is a fixed, single month."
      } ],
      "type" : "StrictDate"
    }, {
      "multiplicity" : {
        "lowerBound" : 0,
        "upperBound" : 1
      },
      "name" : "deliveryDateRollConvention",
      "taggedValues" : [ {
        "tag" : {
          "profile" : "meta::pure::profiles::doc",
          "value" : "doc"
        },
        "value" : "The 'deliveryDateRollConvention' specifies, for a Commodity Transaction that references a listed future via the 'deliveryDates' element, the day on which the specified future will roll to the next nearby month prior to the expiration of the referenced future. If the future will not roll at all - i.e. the price will be taken from the expiring contract, 0 should be specified here. If the future will roll to the next nearby on the last trading day - i.e. the price will be taken from the next nearby on the last trading day, then 1 should be specified and so on."
      } ],
      "type" : "FpML::model::Offset"
    }, {
      "multiplicity" : {
        "lowerBound" : 0,
        "upperBound" : 1
      },
      "name" : "deliveryDateExpirationConvention",
      "taggedValues" : [ {
        "tag" : {
          "profile" : "meta::pure::profiles::doc",
          "value" : "doc"
        },
        "value" : "The 'deliveryDateExpirationConvention' specifies, for a Commodity Transaction that references a listed future via the 'deliveryDates' element, the day on which the specified future will expire ahead of the actual expiration of the referenced future. For example: Z21 Contract expires on 19Nov21, with an adjust of 2D the 'expire' will be 16Nov21. DeliveryDateRollConvention takes precedence. Example: Pricing on the Z21 Contract with NearbyContractDay and a deliveryDateRoll of 10D, Sampling of the F22 Contract will occur on 8Nov21 through the last Date of the Z21 Contract. With an ExpConvention of 5D, the last sampling date on the F22 contract will be 12Nov21."
      } ],
      "type" : "FpML::model::Offset"
    }, {
      "multiplicity" : {
        "lowerBound" : 0,
        "upperBound" : 1
      },
      "name" : "multiplier",
      "taggedValues" : [ {
        "tag" : {
          "profile" : "meta::pure::profiles::doc",
          "value" : "doc"
        },
        "value" : "The 'multiplier' specifies the multiplier associated with the Transaction. The 'multiplier' element has two uses: (1) for Freight Transactions or any Calculation Period specified for a Freight Transaction, if an amount is specified as the Multiplier then it is captured by this element and (2) if the Transaction is a heat rate option, the heat rate multiplier is represented in this element. If multiplier is not provided, multiplier is assumed to be 1. (i.e. rate source states 1 BBL of Oil as 90 Dollars. Multiplier of 10 will change the value to 900 dollars.)"
      } ],
      "type" : "Decimal"
    } ],
    "superTypes" : [ "FpML::model::IdentifiedAsset" ],
    "taggedValues" : [ {
      "tag" : {
        "profile" : "meta::pure::profiles::doc",
        "value" : "doc"
      },
      "value" : "A type describing a commodity underlying asset."
    } ]
  }
}