{
  "classifierPath" : "meta::pure::metamodel::type::Class",
  "content" : {
    "_type" : "class",
    "constraints" : [ {
      "functionDefinition" : {
        "_type" : "lambda",
        "body" : [ {
          "_type" : "func",
          "function" : "forAll",
          "parameters" : [ {
            "_type" : "property",
            "parameters" : [ {
              "_type" : "var",
              "name" : "this",
              "sourceInformation" : {
                "endColumn" : 17,
                "endLine" : 8068,
                "sourceId" : "",
                "startColumn" : 13,
                "startLine" : 8068
              }
            } ],
            "property" : "optionEntitlement",
            "sourceInformation" : {
              "endColumn" : 35,
              "endLine" : 8068,
              "sourceId" : "",
              "startColumn" : 19,
              "startLine" : 8068
            }
          }, {
            "_type" : "lambda",
            "body" : [ {
              "_type" : "func",
              "function" : "greaterThan",
              "parameters" : [ {
                "_type" : "var",
                "name" : "x",
                "sourceInformation" : {
                  "endColumn" : 60,
                  "endLine" : 8068,
                  "sourceId" : "",
                  "startColumn" : 59,
                  "startLine" : 8068
                }
              }, {
                "_type" : "integer",
                "multiplicity" : {
                  "lowerBound" : 1,
                  "upperBound" : 1
                },
                "sourceInformation" : {
                  "endColumn" : 64,
                  "endLine" : 8068,
                  "sourceId" : "",
                  "startColumn" : 64,
                  "startLine" : 8068
                },
                "values" : [ 0 ]
              } ],
              "sourceInformation" : {
                "endColumn" : 64,
                "endLine" : 8068,
                "sourceId" : "",
                "startColumn" : 62,
                "startLine" : 8068
              }
            } ],
            "parameters" : [ {
              "_type" : "var",
              "class" : "Decimal",
              "multiplicity" : {
                "lowerBound" : 1,
                "upperBound" : 1
              },
              "name" : "x",
              "sourceInformation" : {
                "endColumn" : 54,
                "endLine" : 8068,
                "sourceId" : "",
                "startColumn" : 48,
                "startLine" : 8068
              }
            } ],
            "sourceInformation" : {
              "endColumn" : 64,
              "endLine" : 8068,
              "sourceId" : "",
              "startColumn" : 58,
              "startLine" : 8068
            }
          } ],
          "sourceInformation" : {
            "endColumn" : 43,
            "endLine" : 8068,
            "sourceId" : "",
            "startColumn" : 38,
            "startLine" : 8068
          }
        } ],
        "parameters" : [ ]
      },
      "name" : "c1_range"
    }, {
      "functionDefinition" : {
        "_type" : "lambda",
        "body" : [ {
          "_type" : "func",
          "function" : "forAll",
          "parameters" : [ {
            "_type" : "property",
            "parameters" : [ {
              "_type" : "var",
              "name" : "this",
              "sourceInformation" : {
                "endColumn" : 17,
                "endLine" : 8069,
                "sourceId" : "",
                "startColumn" : 13,
                "startLine" : 8069
              }
            } ],
            "property" : "numberOfOptions",
            "sourceInformation" : {
              "endColumn" : 33,
              "endLine" : 8069,
              "sourceId" : "",
              "startColumn" : 19,
              "startLine" : 8069
            }
          }, {
            "_type" : "lambda",
            "body" : [ {
              "_type" : "func",
              "function" : "greaterThan",
              "parameters" : [ {
                "_type" : "var",
                "name" : "x",
                "sourceInformation" : {
                  "endColumn" : 58,
                  "endLine" : 8069,
                  "sourceId" : "",
                  "startColumn" : 57,
                  "startLine" : 8069
                }
              }, {
                "_type" : "integer",
                "multiplicity" : {
                  "lowerBound" : 1,
                  "upperBound" : 1
                },
                "sourceInformation" : {
                  "endColumn" : 62,
                  "endLine" : 8069,
                  "sourceId" : "",
                  "startColumn" : 62,
                  "startLine" : 8069
                },
                "values" : [ 0 ]
              } ],
              "sourceInformation" : {
                "endColumn" : 62,
                "endLine" : 8069,
                "sourceId" : "",
                "startColumn" : 60,
                "startLine" : 8069
              }
            } ],
            "parameters" : [ {
              "_type" : "var",
              "class" : "Decimal",
              "multiplicity" : {
                "lowerBound" : 1,
                "upperBound" : 1
              },
              "name" : "x",
              "sourceInformation" : {
                "endColumn" : 52,
                "endLine" : 8069,
                "sourceId" : "",
                "startColumn" : 46,
                "startLine" : 8069
              }
            } ],
            "sourceInformation" : {
              "endColumn" : 62,
              "endLine" : 8069,
              "sourceId" : "",
              "startColumn" : 56,
              "startLine" : 8069
            }
          } ],
          "sourceInformation" : {
            "endColumn" : 41,
            "endLine" : 8069,
            "sourceId" : "",
            "startColumn" : 36,
            "startLine" : 8069
          }
        } ],
        "parameters" : [ ]
      },
      "name" : "c2_range"
    } ],
    "name" : "OptionBaseExtended",
    "package" : "FpML::model",
    "properties" : [ {
      "multiplicity" : {
        "lowerBound" : 0,
        "upperBound" : 1
      },
      "name" : "premium",
      "taggedValues" : [ {
        "tag" : {
          "profile" : "meta::pure::profiles::doc",
          "value" : "doc"
        },
        "value" : "The option premium payable by the buyer to the seller."
      } ],
      "type" : "FpML::model::Premium"
    }, {
      "multiplicity" : {
        "lowerBound" : 0,
        "upperBound" : 1
      },
      "name" : "exercise",
      "taggedValues" : [ {
        "tag" : {
          "profile" : "meta::pure::profiles::doc",
          "value" : "doc"
        },
        "value" : "An placeholder for the actual option exercise definitions."
      } ],
      "type" : "FpML::model::Exercise"
    }, {
      "multiplicity" : {
        "lowerBound" : 0,
        "upperBound" : 1
      },
      "name" : "exerciseProcedure",
      "taggedValues" : [ {
        "tag" : {
          "profile" : "meta::pure::profiles::doc",
          "value" : "doc"
        },
        "value" : "A set of parameters defining procedures associated with the exercise."
      } ],
      "type" : "FpML::model::ExerciseProcedure"
    }, {
      "multiplicity" : {
        "lowerBound" : 0,
        "upperBound" : 1
      },
      "name" : "feature",
      "taggedValues" : [ {
        "tag" : {
          "profile" : "meta::pure::profiles::doc",
          "value" : "doc"
        },
        "value" : "An Option feature such as quanto, asian, barrier, knock."
      } ],
      "type" : "FpML::model::OptionFeature"
    }, {
      "multiplicity" : {
        "lowerBound" : 0,
        "upperBound" : 1
      },
      "name" : "notionalReference",
      "type" : "FpML::model::NotionalAmountReference"
    }, {
      "multiplicity" : {
        "lowerBound" : 0,
        "upperBound" : 1
      },
      "name" : "notionalAmount",
      "type" : "FpML::model::Money"
    }, {
      "multiplicity" : {
        "lowerBound" : 0,
        "upperBound" : 1
      },
      "name" : "optionEntitlement",
      "taggedValues" : [ {
        "tag" : {
          "profile" : "meta::pure::profiles::doc",
          "value" : "doc"
        },
        "value" : "The number of units of underlyer per option comprised in the option transaction."
      } ],
      "type" : "Decimal"
    }, {
      "multiplicity" : {
        "lowerBound" : 0,
        "upperBound" : 1
      },
      "name" : "entitlementCurrency",
      "taggedValues" : [ {
        "tag" : {
          "profile" : "meta::pure::profiles::doc",
          "value" : "doc"
        },
        "value" : "Currency of the relevant bonds to which one option relates. For Bond Options this element should be used to define the currency of the bonds instead of the currency element present in the Bond underlyer."
      } ],
      "type" : "FpML::model::Currency"
    }, {
      "multiplicity" : {
        "lowerBound" : 0,
        "upperBound" : 1
      },
      "name" : "numberOfOptions",
      "taggedValues" : [ {
        "tag" : {
          "profile" : "meta::pure::profiles::doc",
          "value" : "doc"
        },
        "value" : "The number of options comprised in the option transaction."
      } ],
      "type" : "Decimal"
    }, {
      "multiplicity" : {
        "lowerBound" : 0,
        "upperBound" : 1
      },
      "name" : "settlementType",
      "type" : "FpML::model::SettlementTypeEnum"
    }, {
      "multiplicity" : {
        "lowerBound" : 0,
        "upperBound" : 1
      },
      "name" : "settlementDate",
      "type" : "FpML::model::AdjustableOrRelativeDate"
    }, {
      "multiplicity" : {
        "lowerBound" : 0,
        "upperBound" : 1
      },
      "name" : "settlementAmount",
      "taggedValues" : [ {
        "tag" : {
          "profile" : "meta::pure::profiles::doc",
          "value" : "doc"
        },
        "value" : "Settlement Amount"
      } ],
      "type" : "FpML::model::Money"
    }, {
      "multiplicity" : {
        "lowerBound" : 0,
        "upperBound" : 1
      },
      "name" : "settlementCurrency",
      "taggedValues" : [ {
        "tag" : {
          "profile" : "meta::pure::profiles::doc",
          "value" : "doc"
        },
        "value" : "Settlement Currency for use where the Settlement Amount cannot be known in advance"
      } ],
      "type" : "FpML::model::Currency"
    } ],
    "stereotypes" : [ {
      "profile" : "meta::pure::profiles::typemodifiers",
      "value" : "abstract"
    } ],
    "superTypes" : [ "FpML::model::OptionBase" ],
    "taggedValues" : [ {
      "tag" : {
        "profile" : "meta::pure::profiles::doc",
        "value" : "doc"
      },
      "value" : "Base type for options starting with the 4-3 release, until we refactor the schema as part of the 5-0 release series."
    } ]
  }
}