{
  "classifierPath" : "meta::pure::metamodel::type::Enumeration",
  "content" : {
    "_type" : "Enumeration",
    "name" : "DayOfWeekExtEnum",
    "package" : "FpML::model",
    "taggedValues" : [ {
      "tag" : {
        "profile" : "meta::pure::profiles::doc",
        "value" : "doc"
      },
      "value" : "A day of the seven-day week, plus codes for weekends and weekdays."
    } ],
    "values" : [ {
      "value" : "MON"
    }, {
      "value" : "TUE"
    }, {
      "value" : "WED"
    }, {
      "value" : "THU"
    }, {
      "value" : "FRI"
    }, {
      "value" : "SAT"
    }, {
      "value" : "SUN"
    }, {
      "value" : "WD"
    }, {
      "value" : "WN"
    } ]
  }
}