{
  "classifierPath" : "meta::pure::metamodel::type::Enumeration",
  "content" : {
    "_type" : "Enumeration",
    "name" : "MarkToMarketConventionEnum",
    "package" : "FpML::model",
    "taggedValues" : [ {
      "tag" : {
        "profile" : "meta::pure::profiles::doc",
        "value" : "doc"
      },
      "value" : "The type of mark to market convention."
    } ],
    "values" : [ {
      "value" : "Gross"
    }, {
      "value" : "Netted"
    } ]
  }
}