{
  "classifierPath" : "meta::pure::metamodel::type::Enumeration",
  "content" : {
    "_type" : "Enumeration",
    "name" : "DeliveryNearbyTypeEnum",
    "package" : "FpML::model",
    "taggedValues" : [ {
      "tag" : {
        "profile" : "meta::pure::profiles::doc",
        "value" : "doc"
      },
      "value" : "The type of nearby qualifier, expect to be used in conjunction with a nearby count."
    } ],
    "values" : [ {
      "value" : "CalculationPeriod"
    }, {
      "value" : "NearbyMonth"
    }, {
      "value" : "NearbyWeek"
    } ]
  }
}