{
  "classifierPath" : "meta::pure::metamodel::type::Class",
  "content" : {
    "_type" : "class",
    "constraints" : [ {
      "functionDefinition" : {
        "_type" : "lambda",
        "body" : [ {
          "_type" : "func",
          "function" : "or",
          "parameters" : [ {
            "_type" : "func",
            "function" : "isNotEmpty",
            "parameters" : [ {
              "_type" : "property",
              "parameters" : [ {
                "_type" : "var",
                "name" : "this",
                "sourceInformation" : {
                  "endColumn" : 18,
                  "endLine" : 5771,
                  "sourceId" : "",
                  "startColumn" : 14,
                  "startLine" : 5771
                }
              } ],
              "property" : "unadjustedDate",
              "sourceInformation" : {
                "endColumn" : 33,
                "endLine" : 5771,
                "sourceId" : "",
                "startColumn" : 20,
                "startLine" : 5771
              }
            } ],
            "sourceInformation" : {
              "endColumn" : 45,
              "endLine" : 5771,
              "sourceId" : "",
              "startColumn" : 36,
              "startLine" : 5771
            }
          }, {
            "_type" : "func",
            "function" : "and",
            "parameters" : [ {
              "_type" : "func",
              "function" : "isEmpty",
              "parameters" : [ {
                "_type" : "property",
                "parameters" : [ {
                  "_type" : "var",
                  "name" : "this",
                  "sourceInformation" : {
                    "endColumn" : 57,
                    "endLine" : 5771,
                    "sourceId" : "",
                    "startColumn" : 53,
                    "startLine" : 5771
                  }
                } ],
                "property" : "unadjustedDate",
                "sourceInformation" : {
                  "endColumn" : 72,
                  "endLine" : 5771,
                  "sourceId" : "",
                  "startColumn" : 59,
                  "startLine" : 5771
                }
              } ],
              "sourceInformation" : {
                "endColumn" : 81,
                "endLine" : 5771,
                "sourceId" : "",
                "startColumn" : 75,
                "startLine" : 5771
              }
            }, {
              "_type" : "func",
              "function" : "and",
              "parameters" : [ {
                "_type" : "func",
                "function" : "isEmpty",
                "parameters" : [ {
                  "_type" : "property",
                  "parameters" : [ {
                    "_type" : "var",
                    "name" : "this",
                    "sourceInformation" : {
                      "endColumn" : 93,
                      "endLine" : 5771,
                      "sourceId" : "",
                      "startColumn" : 89,
                      "startLine" : 5771
                    }
                  } ],
                  "property" : "dateAdjustments",
                  "sourceInformation" : {
                    "endColumn" : 109,
                    "endLine" : 5771,
                    "sourceId" : "",
                    "startColumn" : 95,
                    "startLine" : 5771
                  }
                } ],
                "sourceInformation" : {
                  "endColumn" : 118,
                  "endLine" : 5771,
                  "sourceId" : "",
                  "startColumn" : 112,
                  "startLine" : 5771
                }
              }, {
                "_type" : "func",
                "function" : "isNotEmpty",
                "parameters" : [ {
                  "_type" : "property",
                  "parameters" : [ {
                    "_type" : "var",
                    "name" : "this",
                    "sourceInformation" : {
                      "endColumn" : 129,
                      "endLine" : 5771,
                      "sourceId" : "",
                      "startColumn" : 125,
                      "startLine" : 5771
                    }
                  } ],
                  "property" : "adjustedDate",
                  "sourceInformation" : {
                    "endColumn" : 142,
                    "endLine" : 5771,
                    "sourceId" : "",
                    "startColumn" : 131,
                    "startLine" : 5771
                  }
                } ],
                "sourceInformation" : {
                  "endColumn" : 154,
                  "endLine" : 5771,
                  "sourceId" : "",
                  "startColumn" : 145,
                  "startLine" : 5771
                }
              } ],
              "sourceInformation" : {
                "endColumn" : 123,
                "endLine" : 5771,
                "sourceId" : "",
                "startColumn" : 122,
                "startLine" : 5771
              }
            } ],
            "sourceInformation" : {
              "endColumn" : 86,
              "endLine" : 5771,
              "sourceId" : "",
              "startColumn" : 85,
              "startLine" : 5771
            }
          } ],
          "sourceInformation" : {
            "endColumn" : 50,
            "endLine" : 5771,
            "sourceId" : "",
            "startColumn" : 49,
            "startLine" : 5771
          }
        } ],
        "parameters" : [ ]
      },
      "name" : "c1_choice"
    } ],
    "name" : "AdjustableOrAdjustedDate",
    "package" : "FpML::model",
    "properties" : [ {
      "multiplicity" : {
        "lowerBound" : 0,
        "upperBound" : 1
      },
      "name" : "unadjustedDate",
      "taggedValues" : [ {
        "tag" : {
          "profile" : "meta::pure::profiles::doc",
          "value" : "doc"
        },
        "value" : "A date subject to adjustment."
      } ],
      "type" : "FpML::model::IdentifiedDate"
    }, {
      "multiplicity" : {
        "lowerBound" : 0,
        "upperBound" : 1
      },
      "name" : "dateAdjustments",
      "taggedValues" : [ {
        "tag" : {
          "profile" : "meta::pure::profiles::doc",
          "value" : "doc"
        },
        "value" : "The business day convention and financial business centers used for adjusting the date if it would otherwise fall on a day that is not a business date in the specified business centers."
      } ],
      "type" : "FpML::model::BusinessDayAdjustments"
    }, {
      "multiplicity" : {
        "lowerBound" : 0,
        "upperBound" : 1
      },
      "name" : "adjustedDate",
      "taggedValues" : [ {
        "tag" : {
          "profile" : "meta::pure::profiles::doc",
          "value" : "doc"
        },
        "value" : "The date once the adjustment has been performed. (Note that this date may change if the business center holidays change)."
      } ],
      "type" : "FpML::model::IdentifiedDate"
    }, {
      "multiplicity" : {
        "lowerBound" : 0,
        "upperBound" : 1
      },
      "name" : "id",
      "type" : "String"
    } ],
    "taggedValues" : [ {
      "tag" : {
        "profile" : "meta::pure::profiles::doc",
        "value" : "doc"
      },
      "value" : "A type for defining a date that shall be subject to adjustment if it would otherwise fall on a day that is not a business day in the specified business centers, together with the convention for adjusting the date."
    } ]
  }
}